{"text_format":"1","workbook":"xlsx","n_sheets":9,"sheets":["READ ME","LSTLONG.txt","LSTSTYLE.txt","LSTCAT.txt","LSTROUND.txt","LSTCONC.txt","LSTRACE.txt","LSTTITPR.txt","LSTSTART.TXT"],"not_rendered":{"charts":0,"images":0,"macros":1,"external_links":1,"defined_names":24,"comments":0,"pivot_tables":0},"unopened":[],"bounds":{"document_bytes":16777216,"sheet_cells":100000,"rows_first":2000,"rows_last":500,"rows_between":2000,"halvings":0,"cell_chars":16384,"cell_head_chars":4096},"cells_cut":0,"cells_raw":0,"read":"whole","date_system":"1900"}

{"sheet":"READ ME","index":0,"n_rows":38,"n_cols":4,"rows_kept":38,"cut":false,"hidden":false,"merged":[]}
["Read Me"]
["Quick and dirty spreadsheet used to make all the files for Ares21 for a National Arena League swim meet."]
["Adjust the green boxes below and then hit the 'Save Ares21 files' button"]
[]
["Date of Gala","2021-10-09","DD:MM:YYYY"]
["Start time of first race","18:30:00","HH:MM:SS"]
["Average time to swim 25m","00:00:20","HH:MM:SS","This is used to roughly calculate the duration of each event to give the start of the next one"]
["Inter race interval","00:00:30","HH:MM:SS","This is used to roughly calculate the duration of each event to give the start of the next one"]
["Name of Referee","A Referee"]
[]
["Enter team names and abbreviations in the green boxes "]
["Make sure the 'team name' is empty for unused lanes"]
["Lane numbers can be changed to 0-9 or 1-10 if needed"]
["Lane","Team Name","Team Abbreviation"]
[1,"Team in Lane 1","L 1"]
[2,"Team in Lane 2","L2"]
[3,"Team in Lane 3","L3"]
[4,"Team in Lane 4","L4"]
[5,"Team in Lane 5","L5"]
[6,"Team in Lane 6","L6"]
[7]
[8]
[9]
[10]
[]
[]
[]
[]
[]
[]
[]
[]
["Notes:"]
["Each Tab helps modify or generate one of the files needed by the Ares21 software to define a meet"]
["Generally the tabs flow left to right, so the ones on the right depend on the ones on the left."]
["The columns in Green are the originals and can be edited if you know what you are doing"]
["The columns in blue are saved into files with the same name as the tab."]
["In the lsttitpr.txt tab the columns in Yellow are automatically generated using the information in the other tabs, "]

{"sheet":"LSTLONG.txt","index":1,"n_rows":15,"n_cols":7,"rows_kept":15,"cut":false,"hidden":false,"merged":[]}
["idLength","Longueur","Mlongueur","Relais",null,null,{"$f":"\"\"\"\"&A1&\"\"\";\"\"\"&B1&\"\"\";\"\"\"&C1&\"\"\";\"\"\"&D1&\"\"\"\"","v":"\"idLength\";\"Longueur\";\"Mlongueur\";\"Relais\""}]
[0,"25m",25,1,null,null,{"$f":"A2&\";\"\"\"&B2&\"\"\";\"&C2&\";\"&D2","v":"0;\"25m\";25;1"}]
[1,"50m",50,1,null,null,{"$f":"A3&\";\"\"\"&B3&\"\"\";\"&C3&\";\"&D3","v":"1;\"50m\";50;1"}]
[2,"100m",100,1,null,null,"2;\"100m\";100;1"]
[3,"200m",200,1,null,null,"3;\"200m\";200;1"]
[4,"400m",400,1,null,null,"4;\"400m\";400;1"]
[5,"800m",800,1,null,null,"5;\"800m\";800;1"]
[6,"1500m",1500,1,null,null,"6;\"1500m\";1500;1"]
[7,"4x25m",100,4,null,null,"7;\"4x25m\";100;4"]
[8,"4x50m",200,4,null,null,"8;\"4x50m\";200;4"]
[9,"4x100m",400,4,null,null,"9;\"4x100m\";400;4"]
[10,"4x200m",800,4,null,null,"10;\"4x200m\";800;4"]
[11,"8x25m",200,8,null,null,"11;\"8x25m\";200;8"]
[12,"6x50m",300,6,null,null,"12;\"6x50m\";300;6"]
[13,"8x50m",400,8,null,null,"13;\"8x50m\";400;8"]

{"sheet":"LSTSTYLE.txt","index":2,"n_rows":6,"n_cols":6,"rows_kept":6,"cut":false,"hidden":false,"merged":[]}
["idStyle","Style","StyleAbr",null,null,{"$f":"A1&\";\"&B1&\";\"&C1","v":"idStyle;Style;StyleAbr"}]
[0,"Freestyle","FR",null,null,{"$f":"A2&\";\"\"\"&B2&\"\"\";\"\"\"&C2&\"\"\"\"","v":"0;\"Freestyle\";\"FR\""}]
[1,"Backstroke","BA",null,null,{"$f":"A3&\";\"\"\"&B3&\"\"\";\"\"\"&C3&\"\"\"\"","v":"1;\"Backstroke\";\"BA\""}]
[2,"Breaststroke","BR",null,null,"2;\"Breaststroke\";\"BR\""]
[3,"Butterfly","BU",null,null,"3;\"Butterfly\";\"BU\""]
[4,"Medley","ME",null,null,"4;\"Medley\";\"ME\""]

{"sheet":"LSTCAT.txt","index":3,"n_rows":9,"n_cols":6,"rows_kept":9,"cut":false,"hidden":false,"merged":[]}
["Category","AbrevCat","Catoffset",null,null,{"$f":"\"\"\"\"&A1&\"\"\";\"\"\"&B1&\"\"\"\"","v":"\"Category\";\"AbrevCat\""}]
["Male/Open","M",100,null,null,{"$f":"\"\"\"\"&A2&\"\"\";\"\"\"&B2&\"\"\"\"","v":"\"Male/Open\";\"M\""}]
["Female","F",200,null,null,"\"Female\";\"F\""]
["Boys","B",300,null,null,"\"Boys\";\"B\""]
["Girls","G",400,null,null,"\"Girls\";\"G\""]
["Mixed","X",500,null,null,"\"Mixed\";\"X\""]
[]
[]
[null,null,"Catoffset is added to the lane number to make unique IDs for each team/gender combination in LSTCONC.txt"]

{"sheet":"LSTROUND.txt","index":4,"n_rows":9,"n_cols":7,"rows_kept":9,"cut":false,"hidden":false,"merged":[]}
["idRound","TITLE","RoundAbrev","roundtext"," sequence",null,{"$f":"A1&\";\"&B1&\";\"&C1&\";\"&D1&\";\"&E1","v":"idRound;TITLE;RoundAbrev;roundtext; sequence"}]
[0,"Qualif.","H","Heat","1  2  3  4  5  6  7  8  9  10 11 12 13 14 15 16 17 18 19 20 21 22 23 24 25 26 27 28 29 30 31 32 33 34 35 36 37 38 39 40 41 42 43 44 45 46 47 48 49 50 51 52 53 54 55 56 57 58 59 60 61 62 63 64 65 66 67 68 69 70 71 72 73 74 75 76 77 78 79 80 81 82 83 84 85 86 87 88 89 90 91 92 93 94 95 96 97 98 99",null,{"$f":"A2&\";\"\"\"&B2&\"\"\";\"\"\"&C2&\"\"\";\"\"\"&D2&\"\"\";\"\"\"&E2&\"\"\"\"","v":"0;\"Qualif.\";\"H\";\"Heat\";\"1  2  3  4  5  6  7  8  9  10 11 12 13 14 15 16 17 18 19 20 21 22 23 24 25 26 27 28 29 30 31 32 33 34 35 36 37 38 39 40 41 42 43 44 45 46 47 48 49 50 51 52 53 54 55 56 57 58 59 60 61 62 63 64 65 66 67 68 69 70 71 72 73 74 75 76 77 78 79 80 81 82 83 84 85 86 87 88 89 90 91 92 93 94 95 96 97 98 99\""}]
[1,"SwimmOff","SOff","SOff","1  2  3  4  5  6  7  8  9  10 11 12 13 14 15 16 17 18 19 20",null,{"$f":"A3&\";\"\"\"&B3&\"\"\";\"\"\"&C3&\"\"\";\"\"\"&D3&\"\"\";\"\"\"&E3&\"\"\"\"","v":"1;\"SwimmOff\";\"SOff\";\"SOff\";\"1  2  3  4  5  6  7  8  9  10 11 12 13 14 15 16 17 18 19 20\""}]
[2,"Semi-finals ","SFI ","S-Final","1  2",null,"2;\"Semi-finals \";\"SFI \";\"S-Final\";\"1  2\""]
[3,"Finals ","FI ","Final","A  B",null,"3;\"Finals \";\"FI \";\"Final\";\"A  B\""]
[4,"TESTS","TE","Test","1  2  3  4  5  6  7  8  9  10 11 12 13 14 15 16 17 18 19 20",null,"4;\"TESTS\";\"TE\";\"Test\";\"1  2  3  4  5  6  7  8  9  10 11 12 13 14 15 16 17 18 19 20\""]
[5,"Consolation","CO","Consol","1 2 3 4 5 6 7 8 9 10 ",null,"5;\"Consolation\";\"CO\";\"Consol\";\"1 2 3 4 5 6 7 8 9 10 \""]
[6,"Bonus Final","BF","B-Final","A  B ",null,"6;\"Bonus Final\";\"BF\";\"B-Final\";\"A  B \""]
[7,"Timed Final","TF","T-Final","1  2  3  4  5  6  7  8  9  10 11 12 13 14 15 16 17 18 19 20 21 22 23 24 25 26 27 28 29 30 31 32 33 34 35 36 37 38 39 40 41 42 43 44 45 46 47 48 49 50 51 52 53 54 55 56 57 58 59 60 61 62 63 64 65 66 67 68 69 70 71 72 73 74 75 76 77 78 79 80 81 82 83 84 85 86 87 88 89 90 91 92 93 94 95 96 97 98 99 ",null,"7;\"Timed Final\";\"TF\";\"T-Final\";\"1  2  3  4  5  6  7  8  9  10 11 12 13 14 15 16 17 18 19 20 21 22 23 24 25 26 27 28 29 30 31 32 33 34 35 36 37 38 39 40 41 42 43 44 45 46 47 48 49 50 51 52 53 54 55 56 57 58 59 60 61 62 63 64 65 66 67 68 69 70 71 72 73 74 75 76 77 78 79 80 81 82 83 84 85 86 87 88 89 90 91 92 93 94 95 96 97 98 99 \""]

{"sheet":"LSTCONC.txt","index":5,"n_rows":51,"n_cols":5,"rows_kept":51,"cut":false,"hidden":false,"merged":[]}
["Gender","ID",null,null,"id;bib;lastname;firstname;birthyear;abNat;abCat"]
["M",100,null,null,{"$f":"IF('READ ME'!B15<>\"\",'READ ME'!A15+B2 &\";\"\"\"&'READ ME'!A15+B2&\"\"\";\"\"\" &'READ ME'!B15& \"\"\";\"\"\"\";\"\"\"\";\"\"\"&'READ ME'!C15&\"\"\";\"\"\"&A2&\"\"\";\",\"\")","v":"101;\"101\";\"Team in Lane 1\";\"\";\"\";\"L 1\";\"M\";"}]
["M",100,null,null,{"$f":"IF('READ ME'!B16<>\"\",'READ ME'!A16+B3 &\";\"\"\"&'READ ME'!A16+B3&\"\"\";\"\"\" &'READ ME'!B16& \"\"\";\"\"\"\";\"\"\"\";\"\"\"&'READ ME'!C16&\"\"\";\"\"\"&A3&\"\"\";\",\"\")","v":"102;\"102\";\"Team in Lane 2\";\"\";\"\";\"L2\";\"M\";"}]
["M",100,null,null,{"$f":"IF('READ ME'!B17<>\"\",'READ ME'!A17+B4 &\";\"\"\"&'READ ME'!A17+B4&\"\"\";\"\"\" &'READ ME'!B17& \"\"\";\"\"\"\";\"\"\"\";\"\"\"&'READ ME'!C17&\"\"\";\"\"\"&A4&\"\"\";\",\"\")","v":"103;\"103\";\"Team in Lane 3\";\"\";\"\";\"L3\";\"M\";"}]
["M",100,null,null,{"$f":"IF('READ ME'!B18<>\"\",'READ ME'!A18+B5 &\";\"\"\"&'READ ME'!A18+B5&\"\"\";\"\"\" &'READ ME'!B18& \"\"\";\"\"\"\";\"\"\"\";\"\"\"&'READ ME'!C18&\"\"\";\"\"\"&A5&\"\"\";\",\"\")","v":"104;\"104\";\"Team in Lane 4\";\"\";\"\";\"L4\";\"M\";"}]
["M",100,null,null,{"$f":"IF('READ ME'!B19<>\"\",'READ ME'!A19+B6 &\";\"\"\"&'READ ME'!A19+B6&\"\"\";\"\"\" &'READ ME'!B19& \"\"\";\"\"\"\";\"\"\"\";\"\"\"&'READ ME'!C19&\"\"\";\"\"\"&A6&\"\"\";\",\"\")","v":"105;\"105\";\"Team in Lane 5\";\"\";\"\";\"L5\";\"M\";"}]
["M",100,null,null,{"$f":"IF('READ ME'!B20<>\"\",'READ ME'!A20+B7 &\";\"\"\"&'READ ME'!A20+B7&\"\"\";\"\"\" &'READ ME'!B20& \"\"\";\"\"\"\";\"\"\"\";\"\"\"&'READ ME'!C20&\"\"\";\"\"\"&A7&\"\"\";\",\"\")","v":"106;\"106\";\"Team in Lane 6\";\"\";\"\";\"L6\";\"M\";"}]
["M",100,null,null,{"$f":"IF('READ ME'!B21<>\"\",'READ ME'!A21+B8 &\";\"\"\"&'READ ME'!A21+B8&\"\"\";\"\"\" &'READ ME'!B21& \"\"\";\"\"\"\";\"\"\"\";\"\"\"&'READ ME'!C21&\"\"\";\"\"\"&A8&\"\"\";\",\"\")","v":""}]
["M",100,null,null,{"$f":"IF('READ ME'!B22<>\"\",'READ ME'!A22+B9 &\";\"\"\"&'READ ME'!A22+B9&\"\"\";\"\"\" &'READ ME'!B22& \"\"\";\"\"\"\";\"\"\"\";\"\"\"&'READ ME'!C22&\"\"\";\"\"\"&A9&\"\"\";\",\"\")","v":""}]
["M",100,null,null,{"$f":"IF('READ ME'!B23<>\"\",'READ ME'!A23+B10 &\";\"\"\"&'READ ME'!A23+B10&\"\"\";\"\"\" &'READ ME'!B23& \"\"\";\"\"\"\";\"\"\"\";\"\"\"&'READ ME'!C23&\"\"\";\"\"\"&A10&\"\"\";\",\"\")","v":""}]
["M",100,null,null,{"$f":"IF('READ ME'!B24<>\"\",'READ ME'!A24+B11 &\";\"\"\"&'READ ME'!A24+B11&\"\"\";\"\"\" &'READ ME'!B24& \"\"\";\"\"\"\";\"\"\"\";\"\"\"&'READ ME'!C24&\"\"\";\"\"\"&A11&\"\"\";\",\"\")","v":""}]
["F",200,null,null,{"$f":"IF('READ ME'!B15<>\"\",'READ ME'!A15+B12 &\";\"\"\"&'READ ME'!A15+B12&\"\"\";\"\"\" &'READ ME'!B15& \"\"\";\"\"\"\";\"\"\"\";\"\"\"&'READ ME'!C15&\"\"\";\"\"\"&A12&\"\"\";\",\"\")","v":"201;\"201\";\"Team in Lane 1\";\"\";\"\";\"L 1\";\"F\";"}]
["F",200,null,null,{"$f":"IF('READ ME'!B16<>\"\",'READ ME'!A16+B13 &\";\"\"\"&'READ ME'!A16+B13&\"\"\";\"\"\" &'READ ME'!B16& \"\"\";\"\"\"\";\"\"\"\";\"\"\"&'READ ME'!C16&\"\"\";\"\"\"&A13&\"\"\";\",\"\")","v":"202;\"202\";\"Team in Lane 2\";\"\";\"\";\"L2\";\"F\";"}]
["F",200,null,null,{"$f":"IF('READ ME'!B17<>\"\",'READ ME'!A17+B14 &\";\"\"\"&'READ ME'!A17+B14&\"\"\";\"\"\" &'READ ME'!B17& \"\"\";\"\"\"\";\"\"\"\";\"\"\"&'READ ME'!C17&\"\"\";\"\"\"&A14&\"\"\";\",\"\")","v":"203;\"203\";\"Team in Lane 3\";\"\";\"\";\"L3\";\"F\";"}]
["F",200,null,null,{"$f":"IF('READ ME'!B18<>\"\",'READ ME'!A18+B15 &\";\"\"\"&'READ ME'!A18+B15&\"\"\";\"\"\" &'READ ME'!B18& \"\"\";\"\"\"\";\"\"\"\";\"\"\"&'READ ME'!C18&\"\"\";\"\"\"&A15&\"\"\";\",\"\")","v":"204;\"204\";\"Team in Lane 4\";\"\";\"\";\"L4\";\"F\";"}]
["F",200,null,null,{"$f":"IF('READ ME'!B19<>\"\",'READ ME'!A19+B16 &\";\"\"\"&'READ ME'!A19+B16&\"\"\";\"\"\" &'READ ME'!B19& \"\"\";\"\"\"\";\"\"\"\";\"\"\"&'READ ME'!C19&\"\"\";\"\"\"&A16&\"\"\";\",\"\")","v":"205;\"205\";\"Team in Lane 5\";\"\";\"\";\"L5\";\"F\";"}]
["F",200,null,null,{"$f":"IF('READ ME'!B20<>\"\",'READ ME'!A20+B17 &\";\"\"\"&'READ ME'!A20+B17&\"\"\";\"\"\" &'READ ME'!B20& \"\"\";\"\"\"\";\"\"\"\";\"\"\"&'READ ME'!C20&\"\"\";\"\"\"&A17&\"\"\";\",\"\")","v":"206;\"206\";\"Team in Lane 6\";\"\";\"\";\"L6\";\"F\";"}]
["F",200,null,null,{"$f":"IF('READ ME'!B21<>\"\",'READ ME'!A21+B18 &\";\"\"\"&'READ ME'!A21+B18&\"\"\";\"\"\" &'READ ME'!B21& \"\"\";\"\"\"\";\"\"\"\";\"\"\"&'READ ME'!C21&\"\"\";\"\"\"&A18&\"\"\";\",\"\")","v":""}]
["F",200,null,null,{"$f":"IF('READ ME'!B22<>\"\",'READ ME'!A22+B19 &\";\"\"\"&'READ ME'!A22+B19&\"\"\";\"\"\" &'READ ME'!B22& \"\"\";\"\"\"\";\"\"\"\";\"\"\"&'READ ME'!C22&\"\"\";\"\"\"&A19&\"\"\";\",\"\")","v":""}]
["F",200,null,null,{"$f":"IF('READ ME'!B23<>\"\",'READ ME'!A23+B20 &\";\"\"\"&'READ ME'!A23+B20&\"\"\";\"\"\" &'READ ME'!B23& \"\"\";\"\"\"\";\"\"\"\";\"\"\"&'READ ME'!C23&\"\"\";\"\"\"&A20&\"\"\";\",\"\")","v":""}]
["F",200,null,null,{"$f":"IF('READ ME'!B24<>\"\",'READ ME'!A24+B21 &\";\"\"\"&'READ ME'!A24+B21&\"\"\";\"\"\" &'READ ME'!B24& \"\"\";\"\"\"\";\"\"\"\";\"\"\"&'READ ME'!C24&\"\"\";\"\"\"&A21&\"\"\";\",\"\")","v":""}]
["B",300,null,null,{"$f":"IF('READ ME'!B15<>\"\",'READ ME'!A15+B22 &\";\"\"\"&'READ ME'!A15+B22&\"\"\";\"\"\" &'READ ME'!B15& \"\"\";\"\"\"\";\"\"\"\";\"\"\"&'READ ME'!C15&\"\"\";\"\"\"&A22&\"\"\";\",\"\")","v":"301;\"301\";\"Team in Lane 1\";\"\";\"\";\"L 1\";\"B\";"}]
["B",300,null,null,{"$f":"IF('READ ME'!B16<>\"\",'READ ME'!A16+B23 &\";\"\"\"&'READ ME'!A16+B23&\"\"\";\"\"\" &'READ ME'!B16& \"\"\";\"\"\"\";\"\"\"\";\"\"\"&'READ ME'!C16&\"\"\";\"\"\"&A23&\"\"\";\",\"\")","v":"302;\"302\";\"Team in Lane 2\";\"\";\"\";\"L2\";\"B\";"}]
["B",300,null,null,{"$f":"IF('READ ME'!B17<>\"\",'READ ME'!A17+B24 &\";\"\"\"&'READ ME'!A17+B24&\"\"\";\"\"\" &'READ ME'!B17& \"\"\";\"\"\"\";\"\"\"\";\"\"\"&'READ ME'!C17&\"\"\";\"\"\"&A24&\"\"\";\",\"\")","v":"303;\"303\";\"Team in Lane 3\";\"\";\"\";\"L3\";\"B\";"}]
["B",300,null,null,{"$f":"IF('READ ME'!B18<>\"\",'READ ME'!A18+B25 &\";\"\"\"&'READ ME'!A18+B25&\"\"\";\"\"\" &'READ ME'!B18& \"\"\";\"\"\"\";\"\"\"\";\"\"\"&'READ ME'!C18&\"\"\";\"\"\"&A25&\"\"\";\",\"\")","v":"304;\"304\";\"Team in Lane 4\";\"\";\"\";\"L4\";\"B\";"}]
["B",300,null,null,{"$f":"IF('READ ME'!B19<>\"\",'READ ME'!A19+B26 &\";\"\"\"&'READ ME'!A19+B26&\"\"\";\"\"\" &'READ ME'!B19& \"\"\";\"\"\"\";\"\"\"\";\"\"\"&'READ ME'!C19&\"\"\";\"\"\"&A26&\"\"\";\",\"\")","v":"305;\"305\";\"Team in Lane 5\";\"\";\"\";\"L5\";\"B\";"}]
["B",300,null,null,{"$f":"IF('READ ME'!B20<>\"\",'READ ME'!A20+B27 &\";\"\"\"&'READ ME'!A20+B27&\"\"\";\"\"\" &'READ ME'!B20& \"\"\";\"\"\"\";\"\"\"\";\"\"\"&'READ ME'!C20&\"\"\";\"\"\"&A27&\"\"\";\",\"\")","v":"306;\"306\";\"Team in Lane 6\";\"\";\"\";\"L6\";\"B\";"}]
["B",300,null,null,{"$f":"IF('READ ME'!B21<>\"\",'READ ME'!A21+B28 &\";\"\"\"&'READ ME'!A21+B28&\"\"\";\"\"\" &'READ ME'!B21& \"\"\";\"\"\"\";\"\"\"\";\"\"\"&'READ ME'!C21&\"\"\";\"\"\"&A28&\"\"\";\",\"\")","v":""}]
["B",300,null,null,{"$f":"IF('READ ME'!B22<>\"\",'READ ME'!A22+B29 &\";\"\"\"&'READ ME'!A22+B29&\"\"\";\"\"\" &'READ ME'!B22& \"\"\";\"\"\"\";\"\"\"\";\"\"\"&'READ ME'!C22&\"\"\";\"\"\"&A29&\"\"\";\",\"\")","v":""}]
["B",300,null,null,{"$f":"IF('READ ME'!B23<>\"\",'READ ME'!A23+B30 &\";\"\"\"&'READ ME'!A23+B30&\"\"\";\"\"\" &'READ ME'!B23& \"\"\";\"\"\"\";\"\"\"\";\"\"\"&'READ ME'!C23&\"\"\";\"\"\"&A30&\"\"\";\",\"\")","v":""}]
["B",300,null,null,{"$f":"IF('READ ME'!B24<>\"\",'READ ME'!A24+B31 &\";\"\"\"&'READ ME'!A24+B31&\"\"\";\"\"\" &'READ ME'!B24& \"\"\";\"\"\"\";\"\"\"\";\"\"\"&'READ ME'!C24&\"\"\";\"\"\"&A31&\"\"\";\",\"\")","v":""}]
["G",400,null,null,{"$f":"IF('READ ME'!B15<>\"\",'READ ME'!A15+B32 &\";\"\"\"&'READ ME'!A15+B32&\"\"\";\"\"\" &'READ ME'!B15& \"\"\";\"\"\"\";\"\"\"\";\"\"\"&'READ ME'!C15&\"\"\";\"\"\"&A32&\"\"\";\",\"\")","v":"401;\"401\";\"Team in Lane 1\";\"\";\"\";\"L 1\";\"G\";"}]
["G",400,null,null,{"$f":"IF('READ ME'!B16<>\"\",'READ ME'!A16+B33 &\";\"\"\"&'READ ME'!A16+B33&\"\"\";\"\"\" &'READ ME'!B16& \"\"\";\"\"\"\";\"\"\"\";\"\"\"&'READ ME'!C16&\"\"\";\"\"\"&A33&\"\"\";\",\"\")","v":"402;\"402\";\"Team in Lane 2\";\"\";\"\";\"L2\";\"G\";"}]
["G",400,null,null,{"$f":"IF('READ ME'!B17<>\"\",'READ ME'!A17+B34 &\";\"\"\"&'READ ME'!A17+B34&\"\"\";\"\"\" &'READ ME'!B17& \"\"\";\"\"\"\";\"\"\"\";\"\"\"&'READ ME'!C17&\"\"\";\"\"\"&A34&\"\"\";\",\"\")","v":"403;\"403\";\"Team in Lane 3\";\"\";\"\";\"L3\";\"G\";"}]
["G",400,null,null,{"$f":"IF('READ ME'!B18<>\"\",'READ ME'!A18+B35 &\";\"\"\"&'READ ME'!A18+B35&\"\"\";\"\"\" &'READ ME'!B18& \"\"\";\"\"\"\";\"\"\"\";\"\"\"&'READ ME'!C18&\"\"\";\"\"\"&A35&\"\"\";\",\"\")","v":"404;\"404\";\"Team in Lane 4\";\"\";\"\";\"L4\";\"G\";"}]
["G",400,null,null,{"$f":"IF('READ ME'!B19<>\"\",'READ ME'!A19+B36 &\";\"\"\"&'READ ME'!A19+B36&\"\"\";\"\"\" &'READ ME'!B19& \"\"\";\"\"\"\";\"\"\"\";\"\"\"&'READ ME'!C19&\"\"\";\"\"\"&A36&\"\"\";\",\"\")","v":"405;\"405\";\"Team in Lane 5\";\"\";\"\";\"L5\";\"G\";"}]
["G",400,null,null,{"$f":"IF('READ ME'!B20<>\"\",'READ ME'!A20+B37 &\";\"\"\"&'READ ME'!A20+B37&\"\"\";\"\"\" &'READ ME'!B20& \"\"\";\"\"\"\";\"\"\"\";\"\"\"&'READ ME'!C20&\"\"\";\"\"\"&A37&\"\"\";\",\"\")","v":"406;\"406\";\"Team in Lane 6\";\"\";\"\";\"L6\";\"G\";"}]
["G",400,null,null,{"$f":"IF('READ ME'!B21<>\"\",'READ ME'!A21+B38 &\";\"\"\"&'READ ME'!A21+B38&\"\"\";\"\"\" &'READ ME'!B21& \"\"\";\"\"\"\";\"\"\"\";\"\"\"&'READ ME'!C21&\"\"\";\"\"\"&A38&\"\"\";\",\"\")","v":""}]
["G",400,null,null,{"$f":"IF('READ ME'!B22<>\"\",'READ ME'!A22+B39 &\";\"\"\"&'READ ME'!A22+B39&\"\"\";\"\"\" &'READ ME'!B22& \"\"\";\"\"\"\";\"\"\"\";\"\"\"&'READ ME'!C22&\"\"\";\"\"\"&A39&\"\"\";\",\"\")","v":""}]
["G",400,null,null,{"$f":"IF('READ ME'!B23<>\"\",'READ ME'!A23+B40 &\";\"\"\"&'READ ME'!A23+B40&\"\"\";\"\"\" &'READ ME'!B23& \"\"\";\"\"\"\";\"\"\"\";\"\"\"&'READ ME'!C23&\"\"\";\"\"\"&A40&\"\"\";\",\"\")","v":""}]
["G",400,null,null,{"$f":"IF('READ ME'!B24<>\"\",'READ ME'!A24+B41 &\";\"\"\"&'READ ME'!A24+B41&\"\"\";\"\"\" &'READ ME'!B24& \"\"\";\"\"\"\";\"\"\"\";\"\"\"&'READ ME'!C24&\"\"\";\"\"\"&A41&\"\"\";\",\"\")","v":""}]
["X",500,null,null,{"$f":"IF('READ ME'!B15<>\"\",'READ ME'!A15+B42 &\";\"\"\"&'READ ME'!A15+B42&\"\"\";\"\"\" &'READ ME'!B15& \"\"\";\"\"\"\";\"\"\"\";\"\"\"&'READ ME'!C15&\"\"\";\"\"\"&A42&\"\"\";\",\"\")","v":"501;\"501\";\"Team in Lane 1\";\"\";\"\";\"L 1\";\"X\";"}]
["X",500,null,null,{"$f":"IF('READ ME'!B16<>\"\",'READ ME'!A16+B43 &\";\"\"\"&'READ ME'!A16+B43&\"\"\";\"\"\" &'READ ME'!B16& \"\"\";\"\"\"\";\"\"\"\";\"\"\"&'READ ME'!C16&\"\"\";\"\"\"&A43&\"\"\";\",\"\")","v":"502;\"502\";\"Team in Lane 2\";\"\";\"\";\"L2\";\"X\";"}]
["X",500,null,null,{"$f":"IF('READ ME'!B17<>\"\",'READ ME'!A17+B44 &\";\"\"\"&'READ ME'!A17+B44&\"\"\";\"\"\" &'READ ME'!B17& \"\"\";\"\"\"\";\"\"\"\";\"\"\"&'READ ME'!C17&\"\"\";\"\"\"&A44&\"\"\";\",\"\")","v":"503;\"503\";\"Team in Lane 3\";\"\";\"\";\"L3\";\"X\";"}]
["X",500,null,null,{"$f":"IF('READ ME'!B18<>\"\",'READ ME'!A18+B45 &\";\"\"\"&'READ ME'!A18+B45&\"\"\";\"\"\" &'READ ME'!B18& \"\"\";\"\"\"\";\"\"\"\";\"\"\"&'READ ME'!C18&\"\"\";\"\"\"&A45&\"\"\";\",\"\")","v":"504;\"504\";\"Team in Lane 4\";\"\";\"\";\"L4\";\"X\";"}]
["X",500,null,null,{"$f":"IF('READ ME'!B19<>\"\",'READ ME'!A19+B46 &\";\"\"\"&'READ ME'!A19+B46&\"\"\";\"\"\" &'READ ME'!B19& \"\"\";\"\"\"\";\"\"\"\";\"\"\"&'READ ME'!C19&\"\"\";\"\"\"&A46&\"\"\";\",\"\")","v":"505;\"505\";\"Team in Lane 5\";\"\";\"\";\"L5\";\"X\";"}]
["X",500,null,null,{"$f":"IF('READ ME'!B20<>\"\",'READ ME'!A20+B47 &\";\"\"\"&'READ ME'!A20+B47&\"\"\";\"\"\" &'READ ME'!B20& \"\"\";\"\"\"\";\"\"\"\";\"\"\"&'READ ME'!C20&\"\"\";\"\"\"&A47&\"\"\";\",\"\")","v":"506;\"506\";\"Team in Lane 6\";\"\";\"\";\"L6\";\"X\";"}]
["X",500,null,null,{"$f":"IF('READ ME'!B21<>\"\",'READ ME'!A21+B48 &\";\"\"\"&'READ ME'!A21+B48&\"\"\";\"\"\" &'READ ME'!B21& \"\"\";\"\"\"\";\"\"\"\";\"\"\"&'READ ME'!C21&\"\"\";\"\"\"&A48&\"\"\";\",\"\")","v":""}]
["X",500,null,null,{"$f":"IF('READ ME'!B22<>\"\",'READ ME'!A22+B49 &\";\"\"\"&'READ ME'!A22+B49&\"\"\";\"\"\" &'READ ME'!B22& \"\"\";\"\"\"\";\"\"\"\";\"\"\"&'READ ME'!C22&\"\"\";\"\"\"&A49&\"\"\";\",\"\")","v":""}]
["X",500,null,null,{"$f":"IF('READ ME'!B23<>\"\",'READ ME'!A23+B50 &\";\"\"\"&'READ ME'!A23+B50&\"\"\";\"\"\" &'READ ME'!B23& \"\"\";\"\"\"\";\"\"\"\";\"\"\"&'READ ME'!C23&\"\"\";\"\"\"&A50&\"\"\";\",\"\")","v":""}]
["X",500,null,null,{"$f":"IF('READ ME'!B24<>\"\",'READ ME'!A24+B51 &\";\"\"\"&'READ ME'!A24+B51&\"\"\";\"\"\" &'READ ME'!B24& \"\"\";\"\"\"\";\"\"\"\";\"\"\"&'READ ME'!C24&\"\"\";\"\"\"&A51&\"\"\";\",\"\")","v":""}]

{"sheet":"LSTRACE.txt","index":6,"n_rows":52,"n_cols":13,"rows_kept":52,"cut":false,"hidden":false,"merged":[]}
["event","round","nbHeat","idLen","idStyle","abCat",null,"Date","Time","Race duration",null,null,{"$f":"A1&\";\"&B1&\";\"&C1&\";\"&D1&\";\"&E1&\";\"&F1&\";\"&H1&\";\"&I1","v":"event;round;nbHeat;idLen;idStyle;abCat;Date;Time"}]
[1,3,1,3,4,"F",null,{"$f":"'READ ME'!$B$5","v":"2021-10-09"},{"$f":"'READ ME'!B6","v":"18:30:00"},{"$f":"((INDEX(lstlong,MATCH(D2,lstlong_index,0),3))/25)*'READ ME'!$B$7+'READ ME'!$B$8","v":"00:03:10"},null,null,{"$f":"A2&\";\"&B2&\";\"&C2&\";\"&D2&\";\"&E2&\";\"\"\"&TRIM(F2)&\"\"\";\"\"\"&TEXT(H2,\"DD/MM/YY\")&\"\"\";\"\"\"&TEXT(I2,\"HH:MM\")&\"\"\"\"","v":"1;3;1;3;4;\"F\";\"09/10/21\";\"18:30\""}]
[2,3,1,3,4,"M ",null,{"$f":"'READ ME'!$B$5","v":"2021-10-09"},{"$f":"I2+J2","v":"18:33:10"},{"$f":"((INDEX(lstlong,MATCH(D3,lstlong_index,0),3))/25)*'READ ME'!$B$7+'READ ME'!$B$8","v":"00:03:10"},null,null,"2;3;1;3;4;\"M\";\"09/10/21\";\"18:33\""]
[3,3,1,8,0,"F",null,{"$f":"'READ ME'!$B$5","v":"2021-10-09"},{"$f":"I3+J3","v":"18:36:20"},{"$f":"((INDEX(lstlong,MATCH(D4,lstlong_index,0),3))/25)*'READ ME'!$B$7+'READ ME'!$B$8","v":"00:03:10"},null,null,"3;3;1;8;0;\"F\";\"09/10/21\";\"18:36\""]
[4,3,1,8,0,"M ",null,{"$f":"'READ ME'!$B$5","v":"2021-10-09"},"18:39:30",{"$f":"((INDEX(lstlong,MATCH(D5,lstlong_index,0),3))/25)*'READ ME'!$B$7+'READ ME'!$B$8","v":"00:03:10"},null,null,"4;3;1;8;0;\"M\";\"09/10/21\";\"18:39\""]
[5,3,1,8,4,"F",null,{"$f":"'READ ME'!$B$5","v":"2021-10-09"},"18:42:40",{"$f":"((INDEX(lstlong,MATCH(D6,lstlong_index,0),3))/25)*'READ ME'!$B$7+'READ ME'!$B$8","v":"00:03:10"},null,null,"5;3;1;8;4;\"F\";\"09/10/21\";\"18:42\""]
[6,3,1,8,4,"M ",null,{"$f":"'READ ME'!$B$5","v":"2021-10-09"},"18:45:50",{"$f":"((INDEX(lstlong,MATCH(D7,lstlong_index,0),3))/25)*'READ ME'!$B$7+'READ ME'!$B$8","v":"00:03:10"},null,null,"6;3;1;8;4;\"M\";\"09/10/21\";\"18:45\""]
[7,3,1,8,0,"F",null,{"$f":"'READ ME'!$B$5","v":"2021-10-09"},"18:49:00",{"$f":"((INDEX(lstlong,MATCH(D8,lstlong_index,0),3))/25)*'READ ME'!$B$7+'READ ME'!$B$8","v":"00:03:10"},null,null,"7;3;1;8;0;\"F\";\"09/10/21\";\"18:49\""]
[8,3,1,8,0,"M ",null,{"$f":"'READ ME'!$B$5","v":"2021-10-09"},"18:52:10",{"$f":"((INDEX(lstlong,MATCH(D9,lstlong_index,0),3))/25)*'READ ME'!$B$7+'READ ME'!$B$8","v":"00:03:10"},null,null,"8;3;1;8;0;\"M\";\"09/10/21\";\"18:52\""]
[9,3,1,8,4,"F",null,{"$f":"'READ ME'!$B$5","v":"2021-10-09"},"18:55:20",{"$f":"((INDEX(lstlong,MATCH(D10,lstlong_index,0),3))/25)*'READ ME'!$B$7+'READ ME'!$B$8","v":"00:03:10"},null,null,"9;3;1;8;4;\"F\";\"09/10/21\";\"18:55\""]
[10,3,1,8,4,"M ",null,{"$f":"'READ ME'!$B$5","v":"2021-10-09"},"18:58:30",{"$f":"((INDEX(lstlong,MATCH(D11,lstlong_index,0),3))/25)*'READ ME'!$B$7+'READ ME'!$B$8","v":"00:03:10"},null,null,"10;3;1;8;4;\"M\";\"09/10/21\";\"18:58\""]
[11,3,1,1,1,"F",null,{"$f":"'READ ME'!$B$5","v":"2021-10-09"},"19:01:40",{"$f":"((INDEX(lstlong,MATCH(D12,lstlong_index,0),3))/25)*'READ ME'!$B$7+'READ ME'!$B$8","v":"00:01:10"},null,null,"11;3;1;1;1;\"F\";\"09/10/21\";\"19:01\""]
[12,3,1,1,1,"M ",null,{"$f":"'READ ME'!$B$5","v":"2021-10-09"},"19:02:50",{"$f":"((INDEX(lstlong,MATCH(D13,lstlong_index,0),3))/25)*'READ ME'!$B$7+'READ ME'!$B$8","v":"00:01:10"},null,null,"12;3;1;1;1;\"M\";\"09/10/21\";\"19:02\""]
[13,3,1,2,2,"F",null,{"$f":"'READ ME'!$B$5","v":"2021-10-09"},"19:04:00",{"$f":"((INDEX(lstlong,MATCH(D14,lstlong_index,0),3))/25)*'READ ME'!$B$7+'READ ME'!$B$8","v":"00:01:50"},null,null,"13;3;1;2;2;\"F\";\"09/10/21\";\"19:04\""]
[14,3,1,2,2,"M ",null,{"$f":"'READ ME'!$B$5","v":"2021-10-09"},"19:05:50",{"$f":"((INDEX(lstlong,MATCH(D15,lstlong_index,0),3))/25)*'READ ME'!$B$7+'READ ME'!$B$8","v":"00:01:50"},null,null,"14;3;1;2;2;\"M\";\"09/10/21\";\"19:05\""]
[15,3,1,2,1,"F",null,{"$f":"'READ ME'!$B$5","v":"2021-10-09"},"19:07:40",{"$f":"((INDEX(lstlong,MATCH(D16,lstlong_index,0),3))/25)*'READ ME'!$B$7+'READ ME'!$B$8","v":"00:01:50"},null,null,"15;3;1;2;1;\"F\";\"09/10/21\";\"19:07\""]
[16,3,1,2,1,"M ",null,{"$f":"'READ ME'!$B$5","v":"2021-10-09"},"19:09:30",{"$f":"((INDEX(lstlong,MATCH(D17,lstlong_index,0),3))/25)*'READ ME'!$B$7+'READ ME'!$B$8","v":"00:01:50"},null,null,"16;3;1;2;1;\"M\";\"09/10/21\";\"19:09\""]
[17,3,1,2,3,"F",null,{"$f":"'READ ME'!$B$5","v":"2021-10-09"},"19:11:20",{"$f":"((INDEX(lstlong,MATCH(D18,lstlong_index,0),3))/25)*'READ ME'!$B$7+'READ ME'!$B$8","v":"00:01:50"},null,null,"17;3;1;2;3;\"F\";\"09/10/21\";\"19:11\""]
[18,3,1,2,3,"M ",null,{"$f":"'READ ME'!$B$5","v":"2021-10-09"},"19:13:10",{"$f":"((INDEX(lstlong,MATCH(D19,lstlong_index,0),3))/25)*'READ ME'!$B$7+'READ ME'!$B$8","v":"00:01:50"},null,null,"18;3;1;2;3;\"M\";\"09/10/21\";\"19:13\""]
[19,3,1,1,3,"F",null,{"$f":"'READ ME'!$B$5","v":"2021-10-09"},"19:15:00",{"$f":"((INDEX(lstlong,MATCH(D20,lstlong_index,0),3))/25)*'READ ME'!$B$7+'READ ME'!$B$8","v":"00:01:10"},null,null,"19;3;1;1;3;\"F\";\"09/10/21\";\"19:15\""]
[20,3,1,1,3,"M ",null,{"$f":"'READ ME'!$B$5","v":"2021-10-09"},"19:16:10",{"$f":"((INDEX(lstlong,MATCH(D21,lstlong_index,0),3))/25)*'READ ME'!$B$7+'READ ME'!$B$8","v":"00:01:10"},null,null,"20;3;1;1;3;\"M\";\"09/10/21\";\"19:16\""]
[21,3,1,2,1,"F",null,{"$f":"'READ ME'!$B$5","v":"2021-10-09"},"19:17:20",{"$f":"((INDEX(lstlong,MATCH(D22,lstlong_index,0),3))/25)*'READ ME'!$B$7+'READ ME'!$B$8","v":"00:01:50"},null,null,"21;3;1;2;1;\"F\";\"09/10/21\";\"19:17\""]
[22,3,1,2,1,"M ",null,{"$f":"'READ ME'!$B$5","v":"2021-10-09"},"19:19:10",{"$f":"((INDEX(lstlong,MATCH(D23,lstlong_index,0),3))/25)*'READ ME'!$B$7+'READ ME'!$B$8","v":"00:01:50"},null,null,"22;3;1;2;1;\"M\";\"09/10/21\";\"19:19\""]
[23,3,1,2,3,"F",null,{"$f":"'READ ME'!$B$5","v":"2021-10-09"},"19:21:00",{"$f":"((INDEX(lstlong,MATCH(D24,lstlong_index,0),3))/25)*'READ ME'!$B$7+'READ ME'!$B$8","v":"00:01:50"},null,null,"23;3;1;2;3;\"F\";\"09/10/21\";\"19:21\""]
[24,3,1,2,3,"M ",null,{"$f":"'READ ME'!$B$5","v":"2021-10-09"},"19:22:50",{"$f":"((INDEX(lstlong,MATCH(D25,lstlong_index,0),3))/25)*'READ ME'!$B$7+'READ ME'!$B$8","v":"00:01:50"},null,null,"24;3;1;2;3;\"M\";\"09/10/21\";\"19:22\""]
[25,3,1,2,1,"F",null,{"$f":"'READ ME'!$B$5","v":"2021-10-09"},"19:24:40",{"$f":"((INDEX(lstlong,MATCH(D26,lstlong_index,0),3))/25)*'READ ME'!$B$7+'READ ME'!$B$8","v":"00:01:50"},null,null,"25;3;1;2;1;\"F\";\"09/10/21\";\"19:24\""]
[26,3,1,2,1,"M ",null,{"$f":"'READ ME'!$B$5","v":"2021-10-09"},"19:26:30",{"$f":"((INDEX(lstlong,MATCH(D27,lstlong_index,0),3))/25)*'READ ME'!$B$7+'READ ME'!$B$8","v":"00:01:50"},null,null,"26;3;1;2;1;\"M\";\"09/10/21\";\"19:26\""]
[27,3,1,1,2,"F",null,{"$f":"'READ ME'!$B$5","v":"2021-10-09"},"19:28:20",{"$f":"((INDEX(lstlong,MATCH(D28,lstlong_index,0),3))/25)*'READ ME'!$B$7+'READ ME'!$B$8","v":"00:01:10"},null,null,"27;3;1;1;2;\"F\";\"09/10/21\";\"19:28\""]
[28,3,1,1,2,"M ",null,{"$f":"'READ ME'!$B$5","v":"2021-10-09"},"19:29:30",{"$f":"((INDEX(lstlong,MATCH(D29,lstlong_index,0),3))/25)*'READ ME'!$B$7+'READ ME'!$B$8","v":"00:01:10"},null,null,"28;3;1;1;2;\"M\";\"09/10/21\";\"19:29\""]
[29,3,1,2,3,"F",null,{"$f":"'READ ME'!$B$5","v":"2021-10-09"},"19:30:40",{"$f":"((INDEX(lstlong,MATCH(D30,lstlong_index,0),3))/25)*'READ ME'!$B$7+'READ ME'!$B$8","v":"00:01:50"},null,null,"29;3;1;2;3;\"F\";\"09/10/21\";\"19:30\""]
[30,3,1,2,3,"M ",null,{"$f":"'READ ME'!$B$5","v":"2021-10-09"},"19:32:30",{"$f":"((INDEX(lstlong,MATCH(D31,lstlong_index,0),3))/25)*'READ ME'!$B$7+'READ ME'!$B$8","v":"00:01:50"},null,null,"30;3;1;2;3;\"M\";\"09/10/21\";\"19:32\""]
[31,3,1,2,0,"F",null,{"$f":"'READ ME'!$B$5","v":"2021-10-09"},"19:34:20",{"$f":"((INDEX(lstlong,MATCH(D32,lstlong_index,0),3))/25)*'READ ME'!$B$7+'READ ME'!$B$8","v":"00:01:50"},null,null,"31;3;1;2;0;\"F\";\"09/10/21\";\"19:34\""]
[32,3,1,2,0,"M ",null,{"$f":"'READ ME'!$B$5","v":"2021-10-09"},"19:36:10",{"$f":"((INDEX(lstlong,MATCH(D33,lstlong_index,0),3))/25)*'READ ME'!$B$7+'READ ME'!$B$8","v":"00:01:50"},null,null,"32;3;1;2;0;\"M\";\"09/10/21\";\"19:36\""]
[33,3,1,2,2,"F",null,{"$f":"'READ ME'!$B$5","v":"2021-10-09"},"19:38:00",{"$f":"((INDEX(lstlong,MATCH(D34,lstlong_index,0),3))/25)*'READ ME'!$B$7+'READ ME'!$B$8","v":"00:01:50"},null,null,"33;3;1;2;2;\"F\";\"09/10/21\";\"19:38\""]
[34,3,1,2,2,"M ",null,{"$f":"'READ ME'!$B$5","v":"2021-10-09"},"19:39:50",{"$f":"((INDEX(lstlong,MATCH(D35,lstlong_index,0),3))/25)*'READ ME'!$B$7+'READ ME'!$B$8","v":"00:01:50"},null,null,"34;3;1;2;2;\"M\";\"09/10/21\";\"19:39\""]
[35,3,1,1,0,"F",null,{"$f":"'READ ME'!$B$5","v":"2021-10-09"},"19:41:40",{"$f":"((INDEX(lstlong,MATCH(D36,lstlong_index,0),3))/25)*'READ ME'!$B$7+'READ ME'!$B$8","v":"00:01:10"},null,null,"35;3;1;1;0;\"F\";\"09/10/21\";\"19:41\""]
[36,3,1,1,0,"M ",null,{"$f":"'READ ME'!$B$5","v":"2021-10-09"},"19:42:50",{"$f":"((INDEX(lstlong,MATCH(D37,lstlong_index,0),3))/25)*'READ ME'!$B$7+'READ ME'!$B$8","v":"00:01:10"},null,null,"36;3;1;1;0;\"M\";\"09/10/21\";\"19:42\""]
[37,3,1,2,0,"F",null,{"$f":"'READ ME'!$B$5","v":"2021-10-09"},"19:44:00",{"$f":"((INDEX(lstlong,MATCH(D38,lstlong_index,0),3))/25)*'READ ME'!$B$7+'READ ME'!$B$8","v":"00:01:50"},null,null,"37;3;1;2;0;\"F\";\"09/10/21\";\"19:44\""]
[38,3,1,2,0,"M ",null,{"$f":"'READ ME'!$B$5","v":"2021-10-09"},"19:45:50",{"$f":"((INDEX(lstlong,MATCH(D39,lstlong_index,0),3))/25)*'READ ME'!$B$7+'READ ME'!$B$8","v":"00:01:50"},null,null,"38;3;1;2;0;\"M\";\"09/10/21\";\"19:45\""]
[39,3,1,2,2,"F",null,{"$f":"'READ ME'!$B$5","v":"2021-10-09"},"19:47:40",{"$f":"((INDEX(lstlong,MATCH(D40,lstlong_index,0),3))/25)*'READ ME'!$B$7+'READ ME'!$B$8","v":"00:01:50"},null,null,"39;3;1;2;2;\"F\";\"09/10/21\";\"19:47\""]
[40,3,1,2,2,"M ",null,{"$f":"'READ ME'!$B$5","v":"2021-10-09"},"19:49:30",{"$f":"((INDEX(lstlong,MATCH(D41,lstlong_index,0),3))/25)*'READ ME'!$B$7+'READ ME'!$B$8","v":"00:01:50"},null,null,"40;3;1;2;2;\"M\";\"09/10/21\";\"19:49\""]
[41,3,1,2,0,"F",null,{"$f":"'READ ME'!$B$5","v":"2021-10-09"},"19:51:20",{"$f":"((INDEX(lstlong,MATCH(D42,lstlong_index,0),3))/25)*'READ ME'!$B$7+'READ ME'!$B$8","v":"00:01:50"},null,null,"41;3;1;2;0;\"F\";\"09/10/21\";\"19:51\""]
[42,3,1,2,0,"M ",null,{"$f":"'READ ME'!$B$5","v":"2021-10-09"},"19:53:10",{"$f":"((INDEX(lstlong,MATCH(D43,lstlong_index,0),3))/25)*'READ ME'!$B$7+'READ ME'!$B$8","v":"00:01:50"},null,null,"42;3;1;2;0;\"M\";\"09/10/21\";\"19:53\""]
[43,3,1,8,4,"F",null,{"$f":"'READ ME'!$B$5","v":"2021-10-09"},"19:55:00",{"$f":"((INDEX(lstlong,MATCH(D44,lstlong_index,0),3))/25)*'READ ME'!$B$7+'READ ME'!$B$8","v":"00:03:10"},null,null,"43;3;1;8;4;\"F\";\"09/10/21\";\"19:55\""]
[44,3,1,8,4,"M ",null,{"$f":"'READ ME'!$B$5","v":"2021-10-09"},"19:58:10",{"$f":"((INDEX(lstlong,MATCH(D45,lstlong_index,0),3))/25)*'READ ME'!$B$7+'READ ME'!$B$8","v":"00:03:10"},null,null,"44;3;1;8;4;\"M\";\"09/10/21\";\"19:58\""]
[45,3,1,8,0,"F",null,{"$f":"'READ ME'!$B$5","v":"2021-10-09"},"20:01:20",{"$f":"((INDEX(lstlong,MATCH(D46,lstlong_index,0),3))/25)*'READ ME'!$B$7+'READ ME'!$B$8","v":"00:03:10"},null,null,"45;3;1;8;0;\"F\";\"09/10/21\";\"20:01\""]
[46,3,1,8,0,"M ",null,{"$f":"'READ ME'!$B$5","v":"2021-10-09"},"20:04:30",{"$f":"((INDEX(lstlong,MATCH(D47,lstlong_index,0),3))/25)*'READ ME'!$B$7+'READ ME'!$B$8","v":"00:03:10"},null,null,"46;3;1;8;0;\"M\";\"09/10/21\";\"20:04\""]
[47,3,1,8,4,"F",null,{"$f":"'READ ME'!$B$5","v":"2021-10-09"},"20:07:40",{"$f":"((INDEX(lstlong,MATCH(D48,lstlong_index,0),3))/25)*'READ ME'!$B$7+'READ ME'!$B$8","v":"00:03:10"},null,null,"47;3;1;8;4;\"F\";\"09/10/21\";\"20:07\""]
[48,3,1,8,4,"M ",null,{"$f":"'READ ME'!$B$5","v":"2021-10-09"},"20:10:50",{"$f":"((INDEX(lstlong,MATCH(D49,lstlong_index,0),3))/25)*'READ ME'!$B$7+'READ ME'!$B$8","v":"00:03:10"},null,null,"48;3;1;8;4;\"M\";\"09/10/21\";\"20:10\""]
[49,3,1,8,0,"F",null,{"$f":"'READ ME'!$B$5","v":"2021-10-09"},"20:14:00",{"$f":"((INDEX(lstlong,MATCH(D50,lstlong_index,0),3))/25)*'READ ME'!$B$7+'READ ME'!$B$8","v":"00:03:10"},null,null,"49;3;1;8;0;\"F\";\"09/10/21\";\"20:14\""]
[50,3,1,8,0,"M ",null,{"$f":"'READ ME'!$B$5","v":"2021-10-09"},"20:17:10",{"$f":"((INDEX(lstlong,MATCH(D51,lstlong_index,0),3))/25)*'READ ME'!$B$7+'READ ME'!$B$8","v":"00:03:10"},null,null,"50;3;1;8;0;\"M\";\"09/10/21\";\"20:17\""]
[51,3,1,13,0,"X",null,{"$f":"'READ ME'!$B$5","v":"2021-10-09"},{"$f":"I51+J51","v":"20:20:20"},{"$f":"((INDEX(lstlong,MATCH(D52,lstlong_index,0),3))/25)*'READ ME'!$B$7+'READ ME'!$B$8","v":"00:05:50"},null,null,"51;3;1;13;0;\"X\";\"09/10/21\";\"20:20\""]

{"sheet":"LSTTITPR.txt","index":7,"n_rows":52,"n_cols":21,"rows_kept":52,"cut":false,"hidden":false,"merged":[]}
["Event",null,"Copied from NAL Programme",null,null,"Text","Title for scoreboard","Referee",null,null,null,"Looked up from other tabs",null,null,null,null,null,null,null,null,{"$f":"A1&\";\"&M1&\";\"&F1","v":"Event;;Text"}]
[1,null,"Female 16+ 200m Individual Medley","Open ",null,{"$f":"TRIM(P2)&\" \"&TRIM(D2)&\" \"&TRIM(Q2)&\" \"&TRIM(R2)","v":"Female Open 200m Medley"},{"$f":"F2","v":"Female Open 200m Medley"},{"$f":"'READ ME'!$B$9","v":"A Referee"},null,null,{"$f":"MATCH(A2,lstrace_index,0)","v":2},{"$f":"INDEX(lstrace,K2,2)","v":3},{"$f":"INDEX(lstrace,K2,6)","v":"F"},{"$f":"INDEX(lstrace,K2,5)","v":4},{"$f":"INDEX(lstrace,K2,4)","v":3},{"$f":"INDEX(lstcat,MATCH(TRIM(M2),lstcat_index,0),1)","v":"Female"},{"$f":"INDEX(lstlong,MATCH(O2,lstlong_index,0),2)","v":"200m"},{"$f":"INDEX(lststyle,MATCH(N2,lststyle_index,0),2)","v":"Medley"},null,null,{"$f":"A2&\";\"&L2&\";\"\"\"&F2&\"\"\";\"\"\"&G2&\"\"\";\"\"\"&H2&\"\"\"\"","v":"1;3;\"Female Open 200m Medley\";\"Female Open 200m Medley\";\"A Referee\""}]
[2,null,"Male/Open 16+ 200m Individual Medley","Open ",null,"Male/Open Open 200m Medley",{"$f":"F3","v":"Male/Open Open 200m Medley"},{"$f":"'READ ME'!$B$9","v":"A Referee"},null,null,3,3,"M ",4,3,"Male/Open",{"$f":"INDEX(lstlong,MATCH(O3,lstlong_index,0),2)","v":"200m"},{"$f":"INDEX(lststyle,MATCH(N3,lststyle_index,0),2)","v":"Medley"},null,null,"2;3;\"Male/Open Open 200m Medley\";\"Male/Open Open 200m Medley\";\"A Referee\""]
[3,null,"Female 9 - 11yrs. 4 x 50m Freestyle Relay","9-11 ",null,"Female 9-11 4x50m Freestyle","Female 9-11 4x50m Freestyle",{"$f":"'READ ME'!$B$9","v":"A Referee"},null,null,4,3,"F",0,8,"Female","4x50m","Freestyle",null,null,"3;3;\"Female 9-11 4x50m Freestyle\";\"Female 9-11 4x50m Freestyle\";\"A Referee\""]
[4,null,"Male/Open 9 - 11yrs. 4 x 50m Freestyle Relay","9-11 ",null,"Male/Open 9-11 4x50m Freestyle","Male/Open 9-11 4x50m Freestyle",{"$f":"'READ ME'!$B$9","v":"A Referee"},null,null,5,3,"M ",0,8,"Male/Open","4x50m","Freestyle",null,null,"4;3;\"Male/Open 9-11 4x50m Freestyle\";\"Male/Open 9-11 4x50m Freestyle\";\"A Referee\""]
[5,null,"Female 12-13 4 x 50m Medley Relay","13/U ",null,"Female 13/U 4x50m Medley","Female 13/U 4x50m Medley",{"$f":"'READ ME'!$B$9","v":"A Referee"},null,null,6,3,"F",4,8,"Female","4x50m","Medley",null,null,"5;3;\"Female 13/U 4x50m Medley\";\"Female 13/U 4x50m Medley\";\"A Referee\""]
[6,null,"Male/Open12-13 4 x 50m Medley Relay","13/U ",null,"Male/Open 13/U 4x50m Medley","Male/Open 13/U 4x50m Medley",{"$f":"'READ ME'!$B$9","v":"A Referee"},null,null,7,3,"M ",4,8,"Male/Open","4x50m","Medley",null,null,"6;3;\"Male/Open 13/U 4x50m Medley\";\"Male/Open 13/U 4x50m Medley\";\"A Referee\""]
[7,null,"Female 14-15 4 x 50m Freestyle Relay","15/U ",null,"Female 15/U 4x50m Freestyle","Female 15/U 4x50m Freestyle",{"$f":"'READ ME'!$B$9","v":"A Referee"},null,null,8,3,"F",0,8,"Female","4x50m","Freestyle",null,null,"7;3;\"Female 15/U 4x50m Freestyle\";\"Female 15/U 4x50m Freestyle\";\"A Referee\""]
[8,null,"Male/Open14-15 4 x 50m Freestyle Relay","15/U ",null,"Male/Open 15/U 4x50m Freestyle","Male/Open 15/U 4x50m Freestyle",{"$f":"'READ ME'!$B$9","v":"A Referee"},null,null,9,3,"M ",0,8,"Male/Open","4x50m","Freestyle",null,null,"8;3;\"Male/Open 15/U 4x50m Freestyle\";\"Male/Open 15/U 4x50m Freestyle\";\"A Referee\""]
[9,null,"Female 16+ 4 x 50m Medley Relay","Open ",null,"Female Open 4x50m Medley","Female Open 4x50m Medley",{"$f":"'READ ME'!$B$9","v":"A Referee"},null,null,10,3,"F",4,8,"Female","4x50m","Medley",null,null,"9;3;\"Female Open 4x50m Medley\";\"Female Open 4x50m Medley\";\"A Referee\""]
[10,null,"Male/Open 16+ 4 x 50m Medley Relay","Open ",null,"Male/Open Open 4x50m Medley","Male/Open Open 4x50m Medley",{"$f":"'READ ME'!$B$9","v":"A Referee"},null,null,11,3,"M ",4,8,"Male/Open","4x50m","Medley",null,null,"10;3;\"Male/Open Open 4x50m Medley\";\"Male/Open Open 4x50m Medley\";\"A Referee\""]
[11,null,"Female 10 - 11yrs. 50m Backstroke","10-11 ",null,"Female 10-11 50m Backstroke","Female 10-11 50m Backstroke",{"$f":"'READ ME'!$B$9","v":"A Referee"},null,null,12,3,"F",1,1,"Female","50m","Backstroke",null,null,"11;3;\"Female 10-11 50m Backstroke\";\"Female 10-11 50m Backstroke\";\"A Referee\""]
[12,null,"Male/Open 10 - 11yrs. 50m Backstroke","10-11 ",null,"Male/Open 10-11 50m Backstroke","Male/Open 10-11 50m Backstroke",{"$f":"'READ ME'!$B$9","v":"A Referee"},null,null,13,3,"M ",1,1,"Male/Open","50m","Backstroke",null,null,"12;3;\"Male/Open 10-11 50m Backstroke\";\"Male/Open 10-11 50m Backstroke\";\"A Referee\""]
[13,null,"Female 12-13 100m Breaststroke","13/U ",null,"Female 13/U 100m Breaststroke","Female 13/U 100m Breaststroke",{"$f":"'READ ME'!$B$9","v":"A Referee"},null,null,14,3,"F",2,2,"Female","100m","Breaststroke",null,null,"13;3;\"Female 13/U 100m Breaststroke\";\"Female 13/U 100m Breaststroke\";\"A Referee\""]
[14,null,"Male/Open12-13 100m Breaststroke","13/U ",null,"Male/Open 13/U 100m Breaststroke","Male/Open 13/U 100m Breaststroke",{"$f":"'READ ME'!$B$9","v":"A Referee"},null,null,15,3,"M ",2,2,"Male/Open","100m","Breaststroke",null,null,"14;3;\"Male/Open 13/U 100m Breaststroke\";\"Male/Open 13/U 100m Breaststroke\";\"A Referee\""]
[15,null,"Female 14-15 100m Backstroke","15/U ",null,"Female 15/U 100m Backstroke","Female 15/U 100m Backstroke",{"$f":"'READ ME'!$B$9","v":"A Referee"},null,null,16,3,"F",1,2,"Female","100m","Backstroke",null,null,"15;3;\"Female 15/U 100m Backstroke\";\"Female 15/U 100m Backstroke\";\"A Referee\""]
[16,null,"Male/Open14-15 100m Backstroke","15/U ",null,"Male/Open 15/U 100m Backstroke","Male/Open 15/U 100m Backstroke",{"$f":"'READ ME'!$B$9","v":"A Referee"},null,null,17,3,"M ",1,2,"Male/Open","100m","Backstroke",null,null,"16;3;\"Male/Open 15/U 100m Backstroke\";\"Male/Open 15/U 100m Backstroke\";\"A Referee\""]
[17,null,"Female 16+ 100m Butterfly","Open ",null,"Female Open 100m Butterfly","Female Open 100m Butterfly",{"$f":"'READ ME'!$B$9","v":"A Referee"},null,null,18,3,"F",3,2,"Female","100m","Butterfly",null,null,"17;3;\"Female Open 100m Butterfly\";\"Female Open 100m Butterfly\";\"A Referee\""]
[18,null,"Male/Open 16+ 100m Butterfly","Open ",null,"Male/Open Open 100m Butterfly","Male/Open Open 100m Butterfly",{"$f":"'READ ME'!$B$9","v":"A Referee"},null,null,19,3,"M ",3,2,"Male/Open","100m","Butterfly",null,null,"18;3;\"Male/Open Open 100m Butterfly\";\"Male/Open Open 100m Butterfly\";\"A Referee\""]
[19,null,"Female 10 - 11yrs. 50m Butterfly","10-11 ",null,"Female 10-11 50m Butterfly","Female 10-11 50m Butterfly",{"$f":"'READ ME'!$B$9","v":"A Referee"},null,null,20,3,"F",3,1,"Female","50m","Butterfly",null,null,"19;3;\"Female 10-11 50m Butterfly\";\"Female 10-11 50m Butterfly\";\"A Referee\""]
[20,null,"Male/Open 10 - 11yrs. 50m Butterfly","10-11 ",null,"Male/Open 10-11 50m Butterfly","Male/Open 10-11 50m Butterfly",{"$f":"'READ ME'!$B$9","v":"A Referee"},null,null,21,3,"M ",3,1,"Male/Open","50m","Butterfly",null,null,"20;3;\"Male/Open 10-11 50m Butterfly\";\"Male/Open 10-11 50m Butterfly\";\"A Referee\""]
[21,null,"Female 12-13 100m Backstroke","13/U ",null,"Female 13/U 100m Backstroke","Female 13/U 100m Backstroke",{"$f":"'READ ME'!$B$9","v":"A Referee"},null,null,22,3,"F",1,2,"Female","100m","Backstroke",null,null,"21;3;\"Female 13/U 100m Backstroke\";\"Female 13/U 100m Backstroke\";\"A Referee\""]
[22,null,"Male/Open 12-13 100m Backstroke","13/U ",null,"Male/Open 13/U 100m Backstroke","Male/Open 13/U 100m Backstroke",{"$f":"'READ ME'!$B$9","v":"A Referee"},null,null,23,3,"M ",1,2,"Male/Open","100m","Backstroke",null,null,"22;3;\"Male/Open 13/U 100m Backstroke\";\"Male/Open 13/U 100m Backstroke\";\"A Referee\""]
[23,null,"Female 14-15 100m Butterfly","15/U ",null,"Female 15/U 100m Butterfly","Female 15/U 100m Butterfly",{"$f":"'READ ME'!$B$9","v":"A Referee"},null,null,24,3,"F",3,2,"Female","100m","Butterfly",null,null,"23;3;\"Female 15/U 100m Butterfly\";\"Female 15/U 100m Butterfly\";\"A Referee\""]
[24,null,"Male/Open14-15 100m Butterfly","15/U ",null,"Male/Open 15/U 100m Butterfly","Male/Open 15/U 100m Butterfly",{"$f":"'READ ME'!$B$9","v":"A Referee"},null,null,25,3,"M ",3,2,"Male/Open","100m","Butterfly",null,null,"24;3;\"Male/Open 15/U 100m Butterfly\";\"Male/Open 15/U 100m Butterfly\";\"A Referee\""]
[25,null,"Female 16+ 100m Backstroke","Open ",null,"Female Open 100m Backstroke","Female Open 100m Backstroke",{"$f":"'READ ME'!$B$9","v":"A Referee"},null,null,26,3,"F",1,2,"Female","100m","Backstroke",null,null,"25;3;\"Female Open 100m Backstroke\";\"Female Open 100m Backstroke\";\"A Referee\""]
[26,null,"Male/Open 16+ 100m Backstroke","Open ",null,"Male/Open Open 100m Backstroke","Male/Open Open 100m Backstroke",{"$f":"'READ ME'!$B$9","v":"A Referee"},null,null,27,3,"M ",1,2,"Male/Open","100m","Backstroke",null,null,"26;3;\"Male/Open Open 100m Backstroke\";\"Male/Open Open 100m Backstroke\";\"A Referee\""]
[27,null,"Female 10 - 11yrs. 50m Breaststroke","10-11 ",null,"Female 10-11 50m Breaststroke","Female 10-11 50m Breaststroke",{"$f":"'READ ME'!$B$9","v":"A Referee"},null,null,28,3,"F",2,1,"Female","50m","Breaststroke",null,null,"27;3;\"Female 10-11 50m Breaststroke\";\"Female 10-11 50m Breaststroke\";\"A Referee\""]
[28,null,"Male/Open 10 - 11yrs. 50m Breaststroke","10-11 ",null,"Male/Open 10-11 50m Breaststroke","Male/Open 10-11 50m Breaststroke",{"$f":"'READ ME'!$B$9","v":"A Referee"},null,null,29,3,"M ",2,1,"Male/Open","50m","Breaststroke",null,null,"28;3;\"Male/Open 10-11 50m Breaststroke\";\"Male/Open 10-11 50m Breaststroke\";\"A Referee\""]
[29,null,"Female 12-13 100m Butterfly","13/U ",null,"Female 13/U 100m Butterfly","Female 13/U 100m Butterfly",{"$f":"'READ ME'!$B$9","v":"A Referee"},null,null,30,3,"F",3,2,"Female","100m","Butterfly",null,null,"29;3;\"Female 13/U 100m Butterfly\";\"Female 13/U 100m Butterfly\";\"A Referee\""]
[30,null,"Male/Open 12-13 100m Butterfly","13/U ",null,"Male/Open 13/U 100m Butterfly","Male/Open 13/U 100m Butterfly",{"$f":"'READ ME'!$B$9","v":"A Referee"},null,null,31,3,"M ",3,2,"Male/Open","100m","Butterfly",null,null,"30;3;\"Male/Open 13/U 100m Butterfly\";\"Male/Open 13/U 100m Butterfly\";\"A Referee\""]
[31,null,"Female 14-15 100m Freestyle","15/U ",null,"Female 15/U 100m Freestyle","Female 15/U 100m Freestyle",{"$f":"'READ ME'!$B$9","v":"A Referee"},null,null,32,3,"F",0,2,"Female","100m","Freestyle",null,null,"31;3;\"Female 15/U 100m Freestyle\";\"Female 15/U 100m Freestyle\";\"A Referee\""]
[32,null,"Male/Open14-15 100m Freestyle","15/U ",null,"Male/Open 15/U 100m Freestyle","Male/Open 15/U 100m Freestyle",{"$f":"'READ ME'!$B$9","v":"A Referee"},null,null,33,3,"M ",0,2,"Male/Open","100m","Freestyle",null,null,"32;3;\"Male/Open 15/U 100m Freestyle\";\"Male/Open 15/U 100m Freestyle\";\"A Referee\""]
[33,null,"Female 16+ 100m Breaststroke","Open ",null,{"$f":"TRIM(P34)&\" \"&TRIM(D34)&\" \"&TRIM(Q34)&\" \"&TRIM(R34)","v":"Female Open 100m Breaststroke"},"Female Open 100m Breaststroke",{"$f":"'READ ME'!$B$9","v":"A Referee"},null,null,{"$f":"MATCH(A34,lstrace_index,0)","v":34},{"$f":"INDEX(lstrace,K34,2)","v":3},{"$f":"INDEX(lstrace,K34,6)","v":"F"},{"$f":"INDEX(lstrace,K34,5)","v":2},{"$f":"INDEX(lstrace,K34,4)","v":2},{"$f":"INDEX(lstcat,MATCH(TRIM(M34),lstcat_index,0),1)","v":"Female"},"100m","Breaststroke",null,null,{"$f":"A34&\";\"&L34&\";\"\"\"&F34&\"\"\";\"\"\"&G34&\"\"\";\"\"\"&H34&\"\"\"\"","v":"33;3;\"Female Open 100m Breaststroke\";\"Female Open 100m Breaststroke\";\"A Referee\""}]
[34,null,"Male/Open 16+ 100m Breaststroke","Open ",null,"Male/Open Open 100m `","Male/Open Open 100m `",{"$f":"'READ ME'!$B$9","v":"A Referee"},null,null,35,3,"M ",2,2,"Male/Open","100m","`",null,null,"34;3;\"Male/Open Open 100m `\";\"Male/Open Open 100m `\";\"A Referee\""]
[35,null,"Female 10 - 11yrs. 50m Freestyle","10-11 ",null,"Female 10-11 50m Freestyle","Female 10-11 50m Freestyle",{"$f":"'READ ME'!$B$9","v":"A Referee"},null,null,36,3,"F",0,1,"Female","50m","Freestyle",null,null,"35;3;\"Female 10-11 50m Freestyle\";\"Female 10-11 50m Freestyle\";\"A Referee\""]
[36,null,"Male/Open 10 - 11yrs. 50m Freestyle","10-11 ",null,"Male/Open 10-11 50m Freestyle","Male/Open 10-11 50m Freestyle",{"$f":"'READ ME'!$B$9","v":"A Referee"},null,null,37,3,"M ",0,1,"Male/Open","50m","Freestyle",null,null,"36;3;\"Male/Open 10-11 50m Freestyle\";\"Male/Open 10-11 50m Freestyle\";\"A Referee\""]
[37,null,"Female 12-13 100m Freestyle","13/U ",null,"Female 13/U 100m Freestyle","Female 13/U 100m Freestyle",{"$f":"'READ ME'!$B$9","v":"A Referee"},null,null,38,3,"F",0,2,"Female","100m","Freestyle",null,null,"37;3;\"Female 13/U 100m Freestyle\";\"Female 13/U 100m Freestyle\";\"A Referee\""]
[38,null,"Male/Open 12-13 100m Freestyle","13/U ",null,"Male/Open 13/U 100m Freestyle","Male/Open 13/U 100m Freestyle",{"$f":"'READ ME'!$B$9","v":"A Referee"},null,null,39,3,"M ",0,2,"Male/Open","100m","Freestyle",null,null,"38;3;\"Male/Open 13/U 100m Freestyle\";\"Male/Open 13/U 100m Freestyle\";\"A Referee\""]
[39,null,"Female 14-15 100m Breaststroke","15u ",null,"Female 15u 100m Breaststroke","Female 15u 100m Breaststroke",{"$f":"'READ ME'!$B$9","v":"A Referee"},null,null,40,3,"F",2,2,"Female","100m","Breaststroke",null,null,"39;3;\"Female 15u 100m Breaststroke\";\"Female 15u 100m Breaststroke\";\"A Referee\""]
[40,null,"Male/Open14-15 100m Breaststroke","15u ",null,"Male/Open 15u 100m Breaststroke","Male/Open 15u 100m Breaststroke",{"$f":"'READ ME'!$B$9","v":"A Referee"},null,null,41,3,"M ",2,2,"Male/Open","100m","Breaststroke",null,null,"40;3;\"Male/Open 15u 100m Breaststroke\";\"Male/Open 15u 100m Breaststroke\";\"A Referee\""]
[41,null,"Female’ 16+ 100m Freestyle","Open ",null,"Female Open 100m Freestyle","Female Open 100m Freestyle",{"$f":"'READ ME'!$B$9","v":"A Referee"},null,null,42,3,"F",0,2,"Female","100m","Freestyle",null,null,"41;3;\"Female Open 100m Freestyle\";\"Female Open 100m Freestyle\";\"A Referee\""]
[42,null,"Male/Open 16+ 100m Freestyle","Open ",null,"Male/Open Open 100m Freestyle","Male/Open Open 100m Freestyle",{"$f":"'READ ME'!$B$9","v":"A Referee"},null,null,43,3,"M ",0,2,"Male/Open","100m","Freestyle",null,null,"42;3;\"Male/Open Open 100m Freestyle\";\"Male/Open Open 100m Freestyle\";\"A Referee\""]
[43,null,"Female 9 - 11yrs. 4 x 50m Medley Relay","9-11 ",null,"Female 9-11 4x50m Medley","Female 9-11 4x50m Medley",{"$f":"'READ ME'!$B$9","v":"A Referee"},null,null,44,3,"F",4,8,"Female","4x50m","Medley",null,null,"43;3;\"Female 9-11 4x50m Medley\";\"Female 9-11 4x50m Medley\";\"A Referee\""]
[44,null,"Male/Open 9 - 11yrs. 4 x 50m Medley Relay","9-11 ",null,"Male/Open 9-11 4x50m Medley","Male/Open 9-11 4x50m Medley",{"$f":"'READ ME'!$B$9","v":"A Referee"},null,null,45,3,"M ",4,8,"Male/Open","4x50m","Medley",null,null,"44;3;\"Male/Open 9-11 4x50m Medley\";\"Male/Open 9-11 4x50m Medley\";\"A Referee\""]
[45,null,"Female 12-13 4 x 50m Freestyle Relay","13/U",null,"Female 13/U 4x50m Freestyle","Female 13/U 4x50m Freestyle",{"$f":"'READ ME'!$B$9","v":"A Referee"},null,null,46,3,"F",0,8,"Female","4x50m","Freestyle",null,null,"45;3;\"Female 13/U 4x50m Freestyle\";\"Female 13/U 4x50m Freestyle\";\"A Referee\""]
[46,null,"Male/Open 12-13 4 x 50m Freestyle Relay","13/U",null,"Male/Open 13/U 4x50m Freestyle","Male/Open 13/U 4x50m Freestyle",{"$f":"'READ ME'!$B$9","v":"A Referee"},null,null,47,3,"M ",0,8,"Male/Open","4x50m","Freestyle",null,null,"46;3;\"Male/Open 13/U 4x50m Freestyle\";\"Male/Open 13/U 4x50m Freestyle\";\"A Referee\""]
[47,null,"Female 14-15 4 x 50m Medley Relay","15/U ",null,"Female 15/U 4x50m Medley","Female 15/U 4x50m Medley",{"$f":"'READ ME'!$B$9","v":"A Referee"},null,null,48,3,"F",4,8,"Female","4x50m","Medley",null,null,"47;3;\"Female 15/U 4x50m Medley\";\"Female 15/U 4x50m Medley\";\"A Referee\""]
[48,null,"Male/Open 14-15 4 x 50m Medley Relay","15/U ",null,"Male/Open 15/U 4x50m Medley","Male/Open 15/U 4x50m Medley",{"$f":"'READ ME'!$B$9","v":"A Referee"},null,null,49,3,"M ",4,8,"Male/Open","4x50m","Medley",null,null,"48;3;\"Male/Open 15/U 4x50m Medley\";\"Male/Open 15/U 4x50m Medley\";\"A Referee\""]
[49,null,"Female 16+ 4 x 50m Freestyle Relay","Open ",null,"Female Open 4x50m Freestyle","Female Open 4x50m Freestyle",{"$f":"'READ ME'!$B$9","v":"A Referee"},null,null,50,3,"F",0,8,"Female","4x50m","Freestyle",null,null,"49;3;\"Female Open 4x50m Freestyle\";\"Female Open 4x50m Freestyle\";\"A Referee\""]
[50,null,"Male/Open 16+ 4 x 50m Freestyle Relay","Open ",null,{"$f":"TRIM(P51)&\" \"&TRIM(D51)&\" \"&TRIM(Q51)&\" \"&TRIM(R51)","v":"Male/Open Open 4x50m Freestyle"},"Male/Open Open 4x50m Freestyle",{"$f":"'READ ME'!$B$9","v":"A Referee"},null,null,51,3,"M ",0,8,"Male/Open","4x50m","Freestyle",null,null,"50;3;\"Male/Open Open 4x50m Freestyle\";\"Male/Open Open 4x50m Freestyle\";\"A Referee\""]
[51,null,"Mixed Squadron 8 x 50 Freestyle relay",null,null,{"$f":"TRIM(P52)&\" \"&TRIM(D52)&\" \"&TRIM(Q52)&\" \"&TRIM(R52)","v":"Mixed  8x50m Freestyle"},{"$f":"F52","v":"Mixed  8x50m Freestyle"},{"$f":"'READ ME'!$B$9","v":"A Referee"},null,null,{"$f":"MATCH(A52,lstrace_index,0)","v":52},{"$f":"INDEX(lstrace,K52,2)","v":3},{"$f":"INDEX(lstrace,K52,6)","v":"X"},{"$f":"INDEX(lstrace,K52,5)","v":0},{"$f":"INDEX(lstrace,K52,4)","v":13},{"$f":"INDEX(lstcat,MATCH(TRIM(M52),lstcat_index,0),1)","v":"Mixed"},{"$f":"INDEX(lstlong,MATCH(O52,lstlong_index,0),2)","v":"8x50m"},{"$f":"INDEX(lststyle,MATCH(N52,lststyle_index,0),2)","v":"Freestyle"},null,null,"51;3;\"Mixed  8x50m Freestyle\";\"Mixed  8x50m Freestyle\";\"A Referee\""]

{"sheet":"LSTSTART.TXT","index":8,"n_rows":511,"n_cols":22,"rows_kept":511,"cut":false,"hidden":false,"merged":[]}
["event","round","Cat","Catoffset","heat",null,{"$f":"IF('READ ME'!B15<>\"\",'READ ME'!A15,\"\")","v":1},{"$f":"IF('READ ME'!B16<>\"\",'READ ME'!A16,\"\")","v":2},{"$f":"IF('READ ME'!B17<>\"\",'READ ME'!A17,\"\")","v":3},{"$f":"IF('READ ME'!B18<>\"\",'READ ME'!A18,\"\")","v":4},{"$f":"IF('READ ME'!B19<>\"\",'READ ME'!A19,\"\")","v":5},{"$f":"IF('READ ME'!B20<>\"\",'READ ME'!A20,\"\")","v":6},{"$f":"IF('READ ME'!B21<>\"\",'READ ME'!A21,\"\")","v":""},{"$f":"IF('READ ME'!B22<>\"\",'READ ME'!A22,\"\")","v":""},{"$f":"IF('READ ME'!B23<>\"\",'READ ME'!A23,\"\")","v":""},{"$f":"IF('READ ME'!B24<>\"\",'READ ME'!A24,\"\")","v":""},null,"#","x","y",null,"event;round;heat;lane;relais;idBib"]
[1,{"$f":"LSTTITPR.txt!L2","v":3},{"$f":"LSTTITPR.txt!M2","v":"F"},{"$f":"INDEX(Catoffset,MATCH(TRIM(C2),AbrevCat,0))","v":200},0,null,{"$f":"IF(G$1<>\"\",$A2&\";\"&$B2&\";\"&$E2&\";\"& G$1 &\";0;\"&G$1+$D2&\";\",\"\")","v":"1;3;0;1;0;201;"},{"$f":"IF(H$1<>\"\",$A2&\";\"&$B2&\";\"&$E2&\";\"& H$1 &\";0;\"&H$1+$D2&\";\",\"\")","v":"1;3;0;2;0;202;"},"1;3;0;3;0;203;","1;3;0;4;0;204;","1;3;0;5;0;205;","1;3;0;6;0;206;","","","","",null,1,{"$f":"MOD(R2-1,10)+1","v":1},{"$f":"INT((R2-1)/10)+1","v":1},null,{"$f":"INDEX(LSTstart2D,T2,S2)","v":"1;3;0;1;0;201;"}]
[2,{"$f":"LSTTITPR.txt!L3","v":3},{"$f":"LSTTITPR.txt!M3","v":"M "},100,0,null,{"$f":"IF(G$1<>\"\",$A3&\";\"&$B3&\";\"&$E3&\";\"& G$1 &\";0;\"&G$1+$D3&\";\",\"\")","v":"2;3;0;1;0;101;"},"2;3;0;2;0;102;","2;3;0;3;0;103;","2;3;0;4;0;104;","2;3;0;5;0;105;","2;3;0;6;0;106;","","","","",null,{"$f":"R2+1","v":2},{"$f":"MOD(R3-1,10)+1","v":2},{"$f":"INT((R3-1)/10)+1","v":1},null,{"$f":"INDEX(LSTstart2D,T3,S3)","v":"1;3;0;2;0;202;"}]
[3,{"$f":"LSTTITPR.txt!L4","v":3},{"$f":"LSTTITPR.txt!M4","v":"F"},200,0,null,"3;3;0;1;0;201;","3;3;0;2;0;202;","3;3;0;3;0;203;","3;3;0;4;0;204;","3;3;0;5;0;205;","3;3;0;6;0;206;","","","","",null,{"$f":"R3+1","v":3},3,1,null,{"$f":"INDEX(LSTstart2D,T4,S4)","v":"1;3;0;3;0;203;"}]
[4,{"$f":"LSTTITPR.txt!L5","v":3},{"$f":"LSTTITPR.txt!M5","v":"M "},100,0,null,"4;3;0;1;0;101;","4;3;0;2;0;102;","4;3;0;3;0;103;","4;3;0;4;0;104;","4;3;0;5;0;105;","4;3;0;6;0;106;","","","","",null,4,4,1,null,{"$f":"INDEX(LSTstart2D,T5,S5)","v":"1;3;0;4;0;204;"}]
[5,{"$f":"LSTTITPR.txt!L6","v":3},{"$f":"LSTTITPR.txt!M6","v":"F"},200,0,null,"5;3;0;1;0;201;","5;3;0;2;0;202;","5;3;0;3;0;203;","5;3;0;4;0;204;","5;3;0;5;0;205;","5;3;0;6;0;206;","","","","",null,5,5,1,null,{"$f":"INDEX(LSTstart2D,T6,S6)","v":"1;3;0;5;0;205;"}]
[6,{"$f":"LSTTITPR.txt!L7","v":3},{"$f":"LSTTITPR.txt!M7","v":"M "},100,0,null,"6;3;0;1;0;101;","6;3;0;2;0;102;","6;3;0;3;0;103;","6;3;0;4;0;104;","6;3;0;5;0;105;","6;3;0;6;0;106;","","","","",null,6,6,1,null,{"$f":"INDEX(LSTstart2D,T7,S7)","v":"1;3;0;6;0;206;"}]
[7,{"$f":"LSTTITPR.txt!L8","v":3},{"$f":"LSTTITPR.txt!M8","v":"F"},200,0,null,"7;3;0;1;0;201;","7;3;0;2;0;202;","7;3;0;3;0;203;","7;3;0;4;0;204;","7;3;0;5;0;205;","7;3;0;6;0;206;","","","","",null,7,7,1,null,{"$f":"INDEX(LSTstart2D,T8,S8)","v":""}]
[8,{"$f":"LSTTITPR.txt!L9","v":3},{"$f":"LSTTITPR.txt!M9","v":"M "},100,0,null,"8;3;0;1;0;101;","8;3;0;2;0;102;","8;3;0;3;0;103;","8;3;0;4;0;104;","8;3;0;5;0;105;","8;3;0;6;0;106;","","","","",null,8,8,1,null,{"$f":"INDEX(LSTstart2D,T9,S9)","v":""}]
[9,{"$f":"LSTTITPR.txt!L10","v":3},{"$f":"LSTTITPR.txt!M10","v":"F"},200,0,null,"9;3;0;1;0;201;","9;3;0;2;0;202;","9;3;0;3;0;203;","9;3;0;4;0;204;","9;3;0;5;0;205;","9;3;0;6;0;206;","","","","",null,9,9,1,null,{"$f":"INDEX(LSTstart2D,T10,S10)","v":""}]
[10,{"$f":"LSTTITPR.txt!L11","v":3},{"$f":"LSTTITPR.txt!M11","v":"M "},100,0,null,"10;3;0;1;0;101;","10;3;0;2;0;102;","10;3;0;3;0;103;","10;3;0;4;0;104;","10;3;0;5;0;105;","10;3;0;6;0;106;","","","","",null,10,10,1,null,{"$f":"INDEX(LSTstart2D,T11,S11)","v":""}]
[11,{"$f":"LSTTITPR.txt!L12","v":3},{"$f":"LSTTITPR.txt!M12","v":"F"},200,0,null,"11;3;0;1;0;201;","11;3;0;2;0;202;","11;3;0;3;0;203;","11;3;0;4;0;204;","11;3;0;5;0;205;","11;3;0;6;0;206;","","","","",null,11,1,2,null,{"$f":"INDEX(LSTstart2D,T12,S12)","v":"2;3;0;1;0;101;"}]
[12,{"$f":"LSTTITPR.txt!L13","v":3},{"$f":"LSTTITPR.txt!M13","v":"M "},100,0,null,"12;3;0;1;0;101;","12;3;0;2;0;102;","12;3;0;3;0;103;","12;3;0;4;0;104;","12;3;0;5;0;105;","12;3;0;6;0;106;","","","","",null,12,2,2,null,{"$f":"INDEX(LSTstart2D,T13,S13)","v":"2;3;0;2;0;102;"}]
[13,{"$f":"LSTTITPR.txt!L14","v":3},{"$f":"LSTTITPR.txt!M14","v":"F"},200,0,null,"13;3;0;1;0;201;","13;3;0;2;0;202;","13;3;0;3;0;203;","13;3;0;4;0;204;","13;3;0;5;0;205;","13;3;0;6;0;206;","","","","",null,13,3,2,null,{"$f":"INDEX(LSTstart2D,T14,S14)","v":"2;3;0;3;0;103;"}]
[14,{"$f":"LSTTITPR.txt!L15","v":3},{"$f":"LSTTITPR.txt!M15","v":"M "},100,0,null,"14;3;0;1;0;101;","14;3;0;2;0;102;","14;3;0;3;0;103;","14;3;0;4;0;104;","14;3;0;5;0;105;","14;3;0;6;0;106;","","","","",null,14,4,2,null,{"$f":"INDEX(LSTstart2D,T15,S15)","v":"2;3;0;4;0;104;"}]
[15,{"$f":"LSTTITPR.txt!L16","v":3},{"$f":"LSTTITPR.txt!M16","v":"F"},200,0,null,"15;3;0;1;0;201;","15;3;0;2;0;202;","15;3;0;3;0;203;","15;3;0;4;0;204;","15;3;0;5;0;205;","15;3;0;6;0;206;","","","","",null,15,5,2,null,{"$f":"INDEX(LSTstart2D,T16,S16)","v":"2;3;0;5;0;105;"}]
[16,{"$f":"LSTTITPR.txt!L17","v":3},{"$f":"LSTTITPR.txt!M17","v":"M "},100,0,null,"16;3;0;1;0;101;","16;3;0;2;0;102;","16;3;0;3;0;103;","16;3;0;4;0;104;","16;3;0;5;0;105;","16;3;0;6;0;106;","","","","",null,16,6,2,null,{"$f":"INDEX(LSTstart2D,T17,S17)","v":"2;3;0;6;0;106;"}]
[17,{"$f":"LSTTITPR.txt!L18","v":3},{"$f":"LSTTITPR.txt!M18","v":"F"},200,0,null,"17;3;0;1;0;201;","17;3;0;2;0;202;","17;3;0;3;0;203;","17;3;0;4;0;204;","17;3;0;5;0;205;","17;3;0;6;0;206;","","","","",null,17,7,2,null,{"$f":"INDEX(LSTstart2D,T18,S18)","v":""}]
[18,{"$f":"LSTTITPR.txt!L19","v":3},{"$f":"LSTTITPR.txt!M19","v":"M "},100,0,null,{"$f":"IF(G$1<>\"\",$A19&\";\"&$B19&\";\"&$E19&\";\"& G$1 &\";0;\"&G$1+$D19&\";\",\"\")","v":"18;3;0;1;0;101;"},"18;3;0;2;0;102;","18;3;0;3;0;103;","18;3;0;4;0;104;","18;3;0;5;0;105;","18;3;0;6;0;106;","","","","",null,18,8,2,null,{"$f":"INDEX(LSTstart2D,T19,S19)","v":""}]
[19,{"$f":"LSTTITPR.txt!L20","v":3},{"$f":"LSTTITPR.txt!M20","v":"F"},200,0,null,"19;3;0;1;0;201;","19;3;0;2;0;202;","19;3;0;3;0;203;","19;3;0;4;0;204;","19;3;0;5;0;205;","19;3;0;6;0;206;","","","","",null,19,9,2,null,{"$f":"INDEX(LSTstart2D,T20,S20)","v":""}]
[20,{"$f":"LSTTITPR.txt!L21","v":3},{"$f":"LSTTITPR.txt!M21","v":"M "},100,0,null,"20;3;0;1;0;101;","20;3;0;2;0;102;","20;3;0;3;0;103;","20;3;0;4;0;104;","20;3;0;5;0;105;","20;3;0;6;0;106;","","","","",null,20,10,2,null,{"$f":"INDEX(LSTstart2D,T21,S21)","v":""}]
[21,{"$f":"LSTTITPR.txt!L22","v":3},{"$f":"LSTTITPR.txt!M22","v":"F"},200,0,null,"21;3;0;1;0;201;","21;3;0;2;0;202;","21;3;0;3;0;203;","21;3;0;4;0;204;","21;3;0;5;0;205;","21;3;0;6;0;206;","","","","",null,21,1,3,null,{"$f":"INDEX(LSTstart2D,T22,S22)","v":"3;3;0;1;0;201;"}]
[22,{"$f":"LSTTITPR.txt!L23","v":3},{"$f":"LSTTITPR.txt!M23","v":"M "},100,0,null,"22;3;0;1;0;101;","22;3;0;2;0;102;","22;3;0;3;0;103;","22;3;0;4;0;104;","22;3;0;5;0;105;","22;3;0;6;0;106;","","","","",null,22,2,3,null,{"$f":"INDEX(LSTstart2D,T23,S23)","v":"3;3;0;2;0;202;"}]
[23,{"$f":"LSTTITPR.txt!L24","v":3},{"$f":"LSTTITPR.txt!M24","v":"F"},200,0,null,"23;3;0;1;0;201;","23;3;0;2;0;202;","23;3;0;3;0;203;","23;3;0;4;0;204;","23;3;0;5;0;205;","23;3;0;6;0;206;","","","","",null,23,3,3,null,{"$f":"INDEX(LSTstart2D,T24,S24)","v":"3;3;0;3;0;203;"}]
[24,{"$f":"LSTTITPR.txt!L25","v":3},{"$f":"LSTTITPR.txt!M25","v":"M "},100,0,null,"24;3;0;1;0;101;","24;3;0;2;0;102;","24;3;0;3;0;103;","24;3;0;4;0;104;","24;3;0;5;0;105;","24;3;0;6;0;106;","","","","",null,24,4,3,null,{"$f":"INDEX(LSTstart2D,T25,S25)","v":"3;3;0;4;0;204;"}]
[25,{"$f":"LSTTITPR.txt!L26","v":3},{"$f":"LSTTITPR.txt!M26","v":"F"},200,0,null,"25;3;0;1;0;201;","25;3;0;2;0;202;","25;3;0;3;0;203;","25;3;0;4;0;204;","25;3;0;5;0;205;","25;3;0;6;0;206;","","","","",null,25,5,3,null,{"$f":"INDEX(LSTstart2D,T26,S26)","v":"3;3;0;5;0;205;"}]
[26,{"$f":"LSTTITPR.txt!L27","v":3},{"$f":"LSTTITPR.txt!M27","v":"M "},100,0,null,"26;3;0;1;0;101;","26;3;0;2;0;102;","26;3;0;3;0;103;","26;3;0;4;0;104;","26;3;0;5;0;105;","26;3;0;6;0;106;","","","","",null,26,6,3,null,{"$f":"INDEX(LSTstart2D,T27,S27)","v":"3;3;0;6;0;206;"}]
[27,{"$f":"LSTTITPR.txt!L28","v":3},{"$f":"LSTTITPR.txt!M28","v":"F"},200,0,null,"27;3;0;1;0;201;","27;3;0;2;0;202;","27;3;0;3;0;203;","27;3;0;4;0;204;","27;3;0;5;0;205;","27;3;0;6;0;206;","","","","",null,27,7,3,null,{"$f":"INDEX(LSTstart2D,T28,S28)","v":""}]
[28,{"$f":"LSTTITPR.txt!L29","v":3},{"$f":"LSTTITPR.txt!M29","v":"M "},100,0,null,"28;3;0;1;0;101;","28;3;0;2;0;102;","28;3;0;3;0;103;","28;3;0;4;0;104;","28;3;0;5;0;105;","28;3;0;6;0;106;","","","","",null,28,8,3,null,{"$f":"INDEX(LSTstart2D,T29,S29)","v":""}]
[29,{"$f":"LSTTITPR.txt!L30","v":3},{"$f":"LSTTITPR.txt!M30","v":"F"},200,0,null,"29;3;0;1;0;201;","29;3;0;2;0;202;","29;3;0;3;0;203;","29;3;0;4;0;204;","29;3;0;5;0;205;","29;3;0;6;0;206;","","","","",null,29,9,3,null,{"$f":"INDEX(LSTstart2D,T30,S30)","v":""}]
[30,{"$f":"LSTTITPR.txt!L31","v":3},{"$f":"LSTTITPR.txt!M31","v":"M "},100,0,null,"30;3;0;1;0;101;","30;3;0;2;0;102;","30;3;0;3;0;103;","30;3;0;4;0;104;","30;3;0;5;0;105;","30;3;0;6;0;106;","","","","",null,30,10,3,null,{"$f":"INDEX(LSTstart2D,T31,S31)","v":""}]
[31,{"$f":"LSTTITPR.txt!L32","v":3},{"$f":"LSTTITPR.txt!M32","v":"F"},200,0,null,"31;3;0;1;0;201;","31;3;0;2;0;202;","31;3;0;3;0;203;","31;3;0;4;0;204;","31;3;0;5;0;205;","31;3;0;6;0;206;","","","","",null,31,1,4,null,{"$f":"INDEX(LSTstart2D,T32,S32)","v":"4;3;0;1;0;101;"}]
[32,{"$f":"LSTTITPR.txt!L33","v":3},{"$f":"LSTTITPR.txt!M33","v":"M "},100,0,null,"32;3;0;1;0;101;","32;3;0;2;0;102;","32;3;0;3;0;103;","32;3;0;4;0;104;","32;3;0;5;0;105;","32;3;0;6;0;106;","","","","",null,32,2,4,null,{"$f":"INDEX(LSTstart2D,T33,S33)","v":"4;3;0;2;0;102;"}]
[33,{"$f":"LSTTITPR.txt!L34","v":3},{"$f":"LSTTITPR.txt!M34","v":"F"},{"$f":"INDEX(Catoffset,MATCH(TRIM(C34),AbrevCat,0))","v":200},0,null,"33;3;0;1;0;201;","33;3;0;2;0;202;","33;3;0;3;0;203;","33;3;0;4;0;204;","33;3;0;5;0;205;","33;3;0;6;0;206;","","","","",null,33,3,4,null,{"$f":"INDEX(LSTstart2D,T34,S34)","v":"4;3;0;3;0;103;"}]
[34,{"$f":"LSTTITPR.txt!L35","v":3},{"$f":"LSTTITPR.txt!M35","v":"M "},100,0,null,{"$f":"IF(G$1<>\"\",$A35&\";\"&$B35&\";\"&$E35&\";\"& G$1 &\";0;\"&G$1+$D35&\";\",\"\")","v":"34;3;0;1;0;101;"},"34;3;0;2;0;102;","34;3;0;3;0;103;","34;3;0;4;0;104;","34;3;0;5;0;105;","34;3;0;6;0;106;","","","","",null,34,4,4,null,{"$f":"INDEX(LSTstart2D,T35,S35)","v":"4;3;0;4;0;104;"}]
[35,{"$f":"LSTTITPR.txt!L36","v":3},{"$f":"LSTTITPR.txt!M36","v":"F"},200,0,null,"35;3;0;1;0;201;","35;3;0;2;0;202;","35;3;0;3;0;203;","35;3;0;4;0;204;","35;3;0;5;0;205;","35;3;0;6;0;206;","","","","",null,35,5,4,null,{"$f":"INDEX(LSTstart2D,T36,S36)","v":"4;3;0;5;0;105;"}]
[36,{"$f":"LSTTITPR.txt!L37","v":3},{"$f":"LSTTITPR.txt!M37","v":"M "},100,0,null,"36;3;0;1;0;101;","36;3;0;2;0;102;","36;3;0;3;0;103;","36;3;0;4;0;104;","36;3;0;5;0;105;","36;3;0;6;0;106;","","","","",null,36,6,4,null,{"$f":"INDEX(LSTstart2D,T37,S37)","v":"4;3;0;6;0;106;"}]
[37,{"$f":"LSTTITPR.txt!L38","v":3},{"$f":"LSTTITPR.txt!M38","v":"F"},200,0,null,"37;3;0;1;0;201;","37;3;0;2;0;202;","37;3;0;3;0;203;","37;3;0;4;0;204;","37;3;0;5;0;205;","37;3;0;6;0;206;","","","","",null,37,7,4,null,{"$f":"INDEX(LSTstart2D,T38,S38)","v":""}]
[38,{"$f":"LSTTITPR.txt!L39","v":3},{"$f":"LSTTITPR.txt!M39","v":"M "},100,0,null,"38;3;0;1;0;101;","38;3;0;2;0;102;","38;3;0;3;0;103;","38;3;0;4;0;104;","38;3;0;5;0;105;","38;3;0;6;0;106;","","","","",null,38,8,4,null,{"$f":"INDEX(LSTstart2D,T39,S39)","v":""}]
[39,{"$f":"LSTTITPR.txt!L40","v":3},{"$f":"LSTTITPR.txt!M40","v":"F"},200,0,null,"39;3;0;1;0;201;","39;3;0;2;0;202;","39;3;0;3;0;203;","39;3;0;4;0;204;","39;3;0;5;0;205;","39;3;0;6;0;206;","","","","",null,39,9,4,null,{"$f":"INDEX(LSTstart2D,T40,S40)","v":""}]
[40,{"$f":"LSTTITPR.txt!L41","v":3},{"$f":"LSTTITPR.txt!M41","v":"M "},100,0,null,"40;3;0;1;0;101;","40;3;0;2;0;102;","40;3;0;3;0;103;","40;3;0;4;0;104;","40;3;0;5;0;105;","40;3;0;6;0;106;","","","","",null,40,10,4,null,{"$f":"INDEX(LSTstart2D,T41,S41)","v":""}]
[41,{"$f":"LSTTITPR.txt!L42","v":3},{"$f":"LSTTITPR.txt!M42","v":"F"},200,0,null,"41;3;0;1;0;201;","41;3;0;2;0;202;","41;3;0;3;0;203;","41;3;0;4;0;204;","41;3;0;5;0;205;","41;3;0;6;0;206;","","","","",null,41,1,5,null,{"$f":"INDEX(LSTstart2D,T42,S42)","v":"5;3;0;1;0;201;"}]
[42,{"$f":"LSTTITPR.txt!L43","v":3},{"$f":"LSTTITPR.txt!M43","v":"M "},100,0,null,"42;3;0;1;0;101;","42;3;0;2;0;102;","42;3;0;3;0;103;","42;3;0;4;0;104;","42;3;0;5;0;105;","42;3;0;6;0;106;","","","","",null,42,2,5,null,{"$f":"INDEX(LSTstart2D,T43,S43)","v":"5;3;0;2;0;202;"}]
[43,{"$f":"LSTTITPR.txt!L44","v":3},{"$f":"LSTTITPR.txt!M44","v":"F"},200,0,null,"43;3;0;1;0;201;","43;3;0;2;0;202;","43;3;0;3;0;203;","43;3;0;4;0;204;","43;3;0;5;0;205;","43;3;0;6;0;206;","","","","",null,43,3,5,null,{"$f":"INDEX(LSTstart2D,T44,S44)","v":"5;3;0;3;0;203;"}]
[44,{"$f":"LSTTITPR.txt!L45","v":3},{"$f":"LSTTITPR.txt!M45","v":"M "},100,0,null,"44;3;0;1;0;101;","44;3;0;2;0;102;","44;3;0;3;0;103;","44;3;0;4;0;104;","44;3;0;5;0;105;","44;3;0;6;0;106;","","","","",null,44,4,5,null,{"$f":"INDEX(LSTstart2D,T45,S45)","v":"5;3;0;4;0;204;"}]
[45,{"$f":"LSTTITPR.txt!L46","v":3},{"$f":"LSTTITPR.txt!M46","v":"F"},200,0,null,"45;3;0;1;0;201;","45;3;0;2;0;202;","45;3;0;3;0;203;","45;3;0;4;0;204;","45;3;0;5;0;205;","45;3;0;6;0;206;","","","","",null,45,5,5,null,{"$f":"INDEX(LSTstart2D,T46,S46)","v":"5;3;0;5;0;205;"}]
[46,{"$f":"LSTTITPR.txt!L47","v":3},{"$f":"LSTTITPR.txt!M47","v":"M "},100,0,null,"46;3;0;1;0;101;","46;3;0;2;0;102;","46;3;0;3;0;103;","46;3;0;4;0;104;","46;3;0;5;0;105;","46;3;0;6;0;106;","","","","",null,46,6,5,null,{"$f":"INDEX(LSTstart2D,T47,S47)","v":"5;3;0;6;0;206;"}]
[47,{"$f":"LSTTITPR.txt!L48","v":3},{"$f":"LSTTITPR.txt!M48","v":"F"},200,0,null,"47;3;0;1;0;201;","47;3;0;2;0;202;","47;3;0;3;0;203;","47;3;0;4;0;204;","47;3;0;5;0;205;","47;3;0;6;0;206;","","","","",null,47,7,5,null,{"$f":"INDEX(LSTstart2D,T48,S48)","v":""}]
[48,{"$f":"LSTTITPR.txt!L49","v":3},{"$f":"LSTTITPR.txt!M49","v":"M "},100,0,null,"48;3;0;1;0;101;","48;3;0;2;0;102;","48;3;0;3;0;103;","48;3;0;4;0;104;","48;3;0;5;0;105;","48;3;0;6;0;106;","","","","",null,48,8,5,null,{"$f":"INDEX(LSTstart2D,T49,S49)","v":""}]
[49,{"$f":"LSTTITPR.txt!L50","v":3},{"$f":"LSTTITPR.txt!M50","v":"F"},200,0,null,"49;3;0;1;0;201;","49;3;0;2;0;202;","49;3;0;3;0;203;","49;3;0;4;0;204;","49;3;0;5;0;205;","49;3;0;6;0;206;","","","","",null,49,9,5,null,{"$f":"INDEX(LSTstart2D,T50,S50)","v":""}]
[50,{"$f":"LSTTITPR.txt!L51","v":3},{"$f":"LSTTITPR.txt!M51","v":"M "},100,0,null,{"$f":"IF(G$1<>\"\",$A51&\";\"&$B51&\";\"&$E51&\";\"& G$1 &\";0;\"&G$1+$D51&\";\",\"\")","v":"50;3;0;1;0;101;"},"50;3;0;2;0;102;","50;3;0;3;0;103;","50;3;0;4;0;104;","50;3;0;5;0;105;","50;3;0;6;0;106;","","","","",null,50,10,5,null,{"$f":"INDEX(LSTstart2D,T51,S51)","v":""}]
[51,3,"X",{"$f":"INDEX(Catoffset,MATCH(TRIM(C52),AbrevCat,0))","v":500},0,null,"51;3;0;1;0;501;","51;3;0;2;0;502;","51;3;0;3;0;503;","51;3;0;4;0;504;","51;3;0;5;0;505;","51;3;0;6;0;506;","","","","",null,51,1,6,null,{"$f":"INDEX(LSTstart2D,T52,S52)","v":"6;3;0;1;0;101;"}]
[null,null,null,null,null,null,null,null,null,null,null,null,null,null,null,null,null,52,2,6,null,{"$f":"INDEX(LSTstart2D,T53,S53)","v":"6;3;0;2;0;102;"}]
[null,null,null,null,null,null,null,null,null,null,null,null,null,null,null,null,null,53,3,6,null,{"$f":"INDEX(LSTstart2D,T54,S54)","v":"6;3;0;3;0;103;"}]
[null,null,null,null,null,null,null,null,null,null,null,null,null,null,null,null,null,54,4,6,null,{"$f":"INDEX(LSTstart2D,T55,S55)","v":"6;3;0;4;0;104;"}]
[null,null,null,null,null,null,null,null,null,null,null,null,null,null,null,null,null,55,5,6,null,{"$f":"INDEX(LSTstart2D,T56,S56)","v":"6;3;0;5;0;105;"}]
[null,null,null,null,null,null,null,null,null,null,null,null,null,null,null,null,null,56,6,6,null,{"$f":"INDEX(LSTstart2D,T57,S57)","v":"6;3;0;6;0;106;"}]
[null,null,null,null,null,null,null,null,null,null,null,null,null,null,null,null,null,57,7,6,null,{"$f":"INDEX(LSTstart2D,T58,S58)","v":""}]
[null,null,null,null,null,null,null,null,null,null,null,null,null,null,null,null,null,58,8,6,null,{"$f":"INDEX(LSTstart2D,T59,S59)","v":""}]
[null,null,null,null,null,null,null,null,null,null,null,null,null,null,null,null,null,59,9,6,null,{"$f":"INDEX(LSTstart2D,T60,S60)","v":""}]
[null,null,null,null,null,null,null,null,null,null,null,null,null,null,null,null,null,60,10,6,null,{"$f":"INDEX(LSTstart2D,T61,S61)","v":""}]
[null,null,null,null,null,null,null,null,null,null,null,null,null,null,null,null,null,61,1,7,null,{"$f":"INDEX(LSTstart2D,T62,S62)","v":"7;3;0;1;0;201;"}]
[null,null,null,null,null,null,null,null,null,null,null,null,null,null,null,null,null,62,2,7,null,{"$f":"INDEX(LSTstart2D,T63,S63)","v":"7;3;0;2;0;202;"}]
[null,null,null,null,null,null,null,null,null,null,null,null,null,null,null,null,null,63,3,7,null,{"$f":"INDEX(LSTstart2D,T64,S64)","v":"7;3;0;3;0;203;"}]
[null,null,null,null,null,null,null,null,null,null,null,null,null,null,null,null,null,64,4,7,null,{"$f":"INDEX(LSTstart2D,T65,S65)","v":"7;3;0;4;0;204;"}]
[null,null,null,null,null,null,null,null,null,null,null,null,null,null,null,null,null,65,5,7,null,{"$f":"INDEX(LSTstart2D,T66,S66)","v":"7;3;0;5;0;205;"}]
[null,null,null,null,null,null,null,null,null,null,null,null,null,null,null,null,null,66,{"$f":"MOD(R67-1,10)+1","v":6},{"$f":"INT((R67-1)/10)+1","v":7},null,{"$f":"INDEX(LSTstart2D,T67,S67)","v":"7;3;0;6;0;206;"}]
[null,null,null,null,null,null,null,null,null,null,null,null,null,null,null,null,null,{"$f":"R67+1","v":67},7,7,null,{"$f":"INDEX(LSTstart2D,T68,S68)","v":""}]
[null,null,null,null,null,null,null,null,null,null,null,null,null,null,null,null,null,68,8,7,null,{"$f":"INDEX(LSTstart2D,T69,S69)","v":""}]
[null,null,null,null,null,null,null,null,null,null,null,null,null,null,null,null,null,69,9,7,null,{"$f":"INDEX(LSTstart2D,T70,S70)","v":""}]
[null,null,null,null,null,null,null,null,null,null,null,null,null,null,null,null,null,70,10,7,null,{"$f":"INDEX(LSTstart2D,T71,S71)","v":""}]
[null,null,null,null,null,null,null,null,null,null,null,null,null,null,null,null,null,71,1,8,null,{"$f":"INDEX(LSTstart2D,T72,S72)","v":"8;3;0;1;0;101;"}]
[null,null,null,null,null,null,null,null,null,null,null,null,null,null,null,null,null,72,2,8,null,{"$f":"INDEX(LSTstart2D,T73,S73)","v":"8;3;0;2;0;102;"}]
[null,null,null,null,null,null,null,null,null,null,null,null,null,null,null,null,null,73,3,8,null,{"$f":"INDEX(LSTstart2D,T74,S74)","v":"8;3;0;3;0;103;"}]
[null,null,null,null,null,null,null,null,null,null,null,null,null,null,null,null,null,74,4,8,null,{"$f":"INDEX(LSTstart2D,T75,S75)","v":"8;3;0;4;0;104;"}]
[null,null,null,null,null,null,null,null,null,null,null,null,null,null,null,null,null,75,5,8,null,{"$f":"INDEX(LSTstart2D,T76,S76)","v":"8;3;0;5;0;105;"}]
[null,null,null,null,null,null,null,null,null,null,null,null,null,null,null,null,null,76,6,8,null,{"$f":"INDEX(LSTstart2D,T77,S77)","v":"8;3;0;6;0;106;"}]
[null,null,null,null,null,null,null,null,null,null,null,null,null,null,null,null,null,77,7,8,null,{"$f":"INDEX(LSTstart2D,T78,S78)","v":""}]
[null,null,null,null,null,null,null,null,null,null,null,null,null,null,null,null,null,78,8,8,null,{"$f":"INDEX(LSTstart2D,T79,S79)","v":""}]
[null,null,null,null,null,null,null,null,null,null,null,null,null,null,null,null,null,79,9,8,null,{"$f":"INDEX(LSTstart2D,T80,S80)","v":""}]
[null,null,null,null,null,null,null,null,null,null,null,null,null,null,null,null,null,80,10,8,null,{"$f":"INDEX(LSTstart2D,T81,S81)","v":""}]
[null,null,null,null,null,null,null,null,null,null,null,null,null,null,null,null,null,81,1,9,null,{"$f":"INDEX(LSTstart2D,T82,S82)","v":"9;3;0;1;0;201;"}]
[null,null,null,null,null,null,null,null,null,null,null,null,null,null,null,null,null,82,2,9,null,{"$f":"INDEX(LSTstart2D,T83,S83)","v":"9;3;0;2;0;202;"}]
[null,null,null,null,null,null,null,null,null,null,null,null,null,null,null,null,null,83,3,9,null,{"$f":"INDEX(LSTstart2D,T84,S84)","v":"9;3;0;3;0;203;"}]
[null,null,null,null,null,null,null,null,null,null,null,null,null,null,null,null,null,84,4,9,null,{"$f":"INDEX(LSTstart2D,T85,S85)","v":"9;3;0;4;0;204;"}]
[null,null,null,null,null,null,null,null,null,null,null,null,null,null,null,null,null,85,5,9,null,{"$f":"INDEX(LSTstart2D,T86,S86)","v":"9;3;0;5;0;205;"}]
[null,null,null,null,null,null,null,null,null,null,null,null,null,null,null,null,null,86,6,9,null,{"$f":"INDEX(LSTstart2D,T87,S87)","v":"9;3;0;6;0;206;"}]
[null,null,null,null,null,null,null,null,null,null,null,null,null,null,null,null,null,87,7,9,null,{"$f":"INDEX(LSTstart2D,T88,S88)","v":""}]
[null,null,null,null,null,null,null,null,null,null,null,null,null,null,null,null,null,88,8,9,null,{"$f":"INDEX(LSTstart2D,T89,S89)","v":""}]
[null,null,null,null,null,null,null,null,null,null,null,null,null,null,null,null,null,89,9,9,null,{"$f":"INDEX(LSTstart2D,T90,S90)","v":""}]
[null,null,null,null,null,null,null,null,null,null,null,null,null,null,null,null,null,90,10,9,null,{"$f":"INDEX(LSTstart2D,T91,S91)","v":""}]
[null,null,null,null,null,null,null,null,null,null,null,null,null,null,null,null,null,91,1,10,null,{"$f":"INDEX(LSTstart2D,T92,S92)","v":"10;3;0;1;0;101;"}]
[null,null,null,null,null,null,null,null,null,null,null,null,null,null,null,null,null,92,2,10,null,{"$f":"INDEX(LSTstart2D,T93,S93)","v":"10;3;0;2;0;102;"}]
[null,null,null,null,null,null,null,null,null,null,null,null,null,null,null,null,null,93,3,10,null,{"$f":"INDEX(LSTstart2D,T94,S94)","v":"10;3;0;3;0;103;"}]
[null,null,null,null,null,null,null,null,null,null,null,null,null,null,null,null,null,94,4,10,null,{"$f":"INDEX(LSTstart2D,T95,S95)","v":"10;3;0;4;0;104;"}]
[null,null,null,null,null,null,null,null,null,null,null,null,null,null,null,null,null,95,5,10,null,{"$f":"INDEX(LSTstart2D,T96,S96)","v":"10;3;0;5;0;105;"}]
[null,null,null,null,null,null,null,null,null,null,null,null,null,null,null,null,null,96,6,10,null,{"$f":"INDEX(LSTstart2D,T97,S97)","v":"10;3;0;6;0;106;"}]
[null,null,null,null,null,null,null,null,null,null,null,null,null,null,null,null,null,97,7,10,null,{"$f":"INDEX(LSTstart2D,T98,S98)","v":""}]
[null,null,null,null,null,null,null,null,null,null,null,null,null,null,null,null,null,98,8,10,null,{"$f":"INDEX(LSTstart2D,T99,S99)","v":""}]
[null,null,null,null,null,null,null,null,null,null,null,null,null,null,null,null,null,99,9,10,null,{"$f":"INDEX(LSTstart2D,T100,S100)","v":""}]
[null,null,null,null,null,null,null,null,null,null,null,null,null,null,null,null,null,100,10,10,null,{"$f":"INDEX(LSTstart2D,T101,S101)","v":""}]
[null,null,null,null,null,null,null,null,null,null,null,null,null,null,null,null,null,101,1,11,null,{"$f":"INDEX(LSTstart2D,T102,S102)","v":"11;3;0;1;0;201;"}]
[null,null,null,null,null,null,null,null,null,null,null,null,null,null,null,null,null,102,2,11,null,{"$f":"INDEX(LSTstart2D,T103,S103)","v":"11;3;0;2;0;202;"}]
[null,null,null,null,null,null,null,null,null,null,null,null,null,null,null,null,null,103,3,11,null,{"$f":"INDEX(LSTstart2D,T104,S104)","v":"11;3;0;3;0;203;"}]
[null,null,null,null,null,null,null,null,null,null,null,null,null,null,null,null,null,104,4,11,null,{"$f":"INDEX(LSTstart2D,T105,S105)","v":"11;3;0;4;0;204;"}]
[null,null,null,null,null,null,null,null,null,null,null,null,null,null,null,null,null,105,5,11,null,{"$f":"INDEX(LSTstart2D,T106,S106)","v":"11;3;0;5;0;205;"}]
[null,null,null,null,null,null,null,null,null,null,null,null,null,null,null,null,null,106,6,11,null,{"$f":"INDEX(LSTstart2D,T107,S107)","v":"11;3;0;6;0;206;"}]
[null,null,null,null,null,null,null,null,null,null,null,null,null,null,null,null,null,107,7,11,null,{"$f":"INDEX(LSTstart2D,T108,S108)","v":""}]
[null,null,null,null,null,null,null,null,null,null,null,null,null,null,null,null,null,108,8,11,null,{"$f":"INDEX(LSTstart2D,T109,S109)","v":""}]
[null,null,null,null,null,null,null,null,null,null,null,null,null,null,null,null,null,109,9,11,null,{"$f":"INDEX(LSTstart2D,T110,S110)","v":""}]
[null,null,null,null,null,null,null,null,null,null,null,null,null,null,null,null,null,110,10,11,null,{"$f":"INDEX(LSTstart2D,T111,S111)","v":""}]
[null,null,null,null,null,null,null,null,null,null,null,null,null,null,null,null,null,111,1,12,null,{"$f":"INDEX(LSTstart2D,T112,S112)","v":"12;3;0;1;0;101;"}]
[null,null,null,null,null,null,null,null,null,null,null,null,null,null,null,null,null,112,2,12,null,{"$f":"INDEX(LSTstart2D,T113,S113)","v":"12;3;0;2;0;102;"}]
[null,null,null,null,null,null,null,null,null,null,null,null,null,null,null,null,null,113,3,12,null,{"$f":"INDEX(LSTstart2D,T114,S114)","v":"12;3;0;3;0;103;"}]
[null,null,null,null,null,null,null,null,null,null,null,null,null,null,null,null,null,114,4,12,null,{"$f":"INDEX(LSTstart2D,T115,S115)","v":"12;3;0;4;0;104;"}]
[null,null,null,null,null,null,null,null,null,null,null,null,null,null,null,null,null,115,5,12,null,{"$f":"INDEX(LSTstart2D,T116,S116)","v":"12;3;0;5;0;105;"}]
[null,null,null,null,null,null,null,null,null,null,null,null,null,null,null,null,null,116,6,12,null,{"$f":"INDEX(LSTstart2D,T117,S117)","v":"12;3;0;6;0;106;"}]
[null,null,null,null,null,null,null,null,null,null,null,null,null,null,null,null,null,117,7,12,null,{"$f":"INDEX(LSTstart2D,T118,S118)","v":""}]
[null,null,null,null,null,null,null,null,null,null,null,null,null,null,null,null,null,118,8,12,null,{"$f":"INDEX(LSTstart2D,T119,S119)","v":""}]
[null,null,null,null,null,null,null,null,null,null,null,null,null,null,null,null,null,119,9,12,null,{"$f":"INDEX(LSTstart2D,T120,S120)","v":""}]
[null,null,null,null,null,null,null,null,null,null,null,null,null,null,null,null,null,120,10,12,null,{"$f":"INDEX(LSTstart2D,T121,S121)","v":""}]
[null,null,null,null,null,null,null,null,null,null,null,null,null,null,null,null,null,121,1,13,null,{"$f":"INDEX(LSTstart2D,T122,S122)","v":"13;3;0;1;0;201;"}]
[null,null,null,null,null,null,null,null,null,null,null,null,null,null,null,null,null,122,2,13,null,{"$f":"INDEX(LSTstart2D,T123,S123)","v":"13;3;0;2;0;202;"}]
[null,null,null,null,null,null,null,null,null,null,null,null,null,null,null,null,null,123,3,13,null,{"$f":"INDEX(LSTstart2D,T124,S124)","v":"13;3;0;3;0;203;"}]
[null,null,null,null,null,null,null,null,null,null,null,null,null,null,null,null,null,124,4,13,null,{"$f":"INDEX(LSTstart2D,T125,S125)","v":"13;3;0;4;0;204;"}]
[null,null,null,null,null,null,null,null,null,null,null,null,null,null,null,null,null,125,5,13,null,{"$f":"INDEX(LSTstart2D,T126,S126)","v":"13;3;0;5;0;205;"}]
[null,null,null,null,null,null,null,null,null,null,null,null,null,null,null,null,null,126,6,13,null,{"$f":"INDEX(LSTstart2D,T127,S127)","v":"13;3;0;6;0;206;"}]
[null,null,null,null,null,null,null,null,null,null,null,null,null,null,null,null,null,127,7,13,null,{"$f":"INDEX(LSTstart2D,T128,S128)","v":""}]
[null,null,null,null,null,null,null,null,null,null,null,null,null,null,null,null,null,128,8,13,null,{"$f":"INDEX(LSTstart2D,T129,S129)","v":""}]
[null,null,null,null,null,null,null,null,null,null,null,null,null,null,null,null,null,129,9,13,null,{"$f":"INDEX(LSTstart2D,T130,S130)","v":""}]
[null,null,null,null,null,null,null,null,null,null,null,null,null,null,null,null,null,130,{"$f":"MOD(R131-1,10)+1","v":10},{"$f":"INT((R131-1)/10)+1","v":13},null,{"$f":"INDEX(LSTstart2D,T131,S131)","v":""}]
[null,null,null,null,null,null,null,null,null,null,null,null,null,null,null,null,null,{"$f":"R131+1","v":131},1,14,null,{"$f":"INDEX(LSTstart2D,T132,S132)","v":"14;3;0;1;0;101;"}]
[null,null,null,null,null,null,null,null,null,null,null,null,null,null,null,null,null,132,2,14,null,{"$f":"INDEX(LSTstart2D,T133,S133)","v":"14;3;0;2;0;102;"}]
[null,null,null,null,null,null,null,null,null,null,null,null,null,null,null,null,null,133,3,14,null,{"$f":"INDEX(LSTstart2D,T134,S134)","v":"14;3;0;3;0;103;"}]
[null,null,null,null,null,null,null,null,null,null,null,null,null,null,null,null,null,134,4,14,null,{"$f":"INDEX(LSTstart2D,T135,S135)","v":"14;3;0;4;0;104;"}]
[null,null,null,null,null,null,null,null,null,null,null,null,null,null,null,null,null,135,5,14,null,{"$f":"INDEX(LSTstart2D,T136,S136)","v":"14;3;0;5;0;105;"}]
[null,null,null,null,null,null,null,null,null,null,null,null,null,null,null,null,null,136,6,14,null,{"$f":"INDEX(LSTstart2D,T137,S137)","v":"14;3;0;6;0;106;"}]
[null,null,null,null,null,null,null,null,null,null,null,null,null,null,null,null,null,137,7,14,null,{"$f":"INDEX(LSTstart2D,T138,S138)","v":""}]
[null,null,null,null,null,null,null,null,null,null,null,null,null,null,null,null,null,138,8,14,null,{"$f":"INDEX(LSTstart2D,T139,S139)","v":""}]
[null,null,null,null,null,null,null,null,null,null,null,null,null,null,null,null,null,139,9,14,null,{"$f":"INDEX(LSTstart2D,T140,S140)","v":""}]
[null,null,null,null,null,null,null,null,null,null,null,null,null,null,null,null,null,140,10,14,null,{"$f":"INDEX(LSTstart2D,T141,S141)","v":""}]
[null,null,null,null,null,null,null,null,null,null,null,null,null,null,null,null,null,141,1,15,null,{"$f":"INDEX(LSTstart2D,T142,S142)","v":"15;3;0;1;0;201;"}]
[null,null,null,null,null,null,null,null,null,null,null,null,null,null,null,null,null,142,2,15,null,{"$f":"INDEX(LSTstart2D,T143,S143)","v":"15;3;0;2;0;202;"}]
[null,null,null,null,null,null,null,null,null,null,null,null,null,null,null,null,null,143,3,15,null,{"$f":"INDEX(LSTstart2D,T144,S144)","v":"15;3;0;3;0;203;"}]
[null,null,null,null,null,null,null,null,null,null,null,null,null,null,null,null,null,144,4,15,null,{"$f":"INDEX(LSTstart2D,T145,S145)","v":"15;3;0;4;0;204;"}]
[null,null,null,null,null,null,null,null,null,null,null,null,null,null,null,null,null,145,5,15,null,{"$f":"INDEX(LSTstart2D,T146,S146)","v":"15;3;0;5;0;205;"}]
[null,null,null,null,null,null,null,null,null,null,null,null,null,null,null,null,null,146,6,15,null,{"$f":"INDEX(LSTstart2D,T147,S147)","v":"15;3;0;6;0;206;"}]
[null,null,null,null,null,null,null,null,null,null,null,null,null,null,null,null,null,147,7,15,null,{"$f":"INDEX(LSTstart2D,T148,S148)","v":""}]
[null,null,null,null,null,null,null,null,null,null,null,null,null,null,null,null,null,148,8,15,null,{"$f":"INDEX(LSTstart2D,T149,S149)","v":""}]
[null,null,null,null,null,null,null,null,null,null,null,null,null,null,null,null,null,149,9,15,null,{"$f":"INDEX(LSTstart2D,T150,S150)","v":""}]
[null,null,null,null,null,null,null,null,null,null,null,null,null,null,null,null,null,150,10,15,null,{"$f":"INDEX(LSTstart2D,T151,S151)","v":""}]
[null,null,null,null,null,null,null,null,null,null,null,null,null,null,null,null,null,151,1,16,null,{"$f":"INDEX(LSTstart2D,T152,S152)","v":"16;3;0;1;0;101;"}]
[null,null,null,null,null,null,null,null,null,null,null,null,null,null,null,null,null,152,2,16,null,{"$f":"INDEX(LSTstart2D,T153,S153)","v":"16;3;0;2;0;102;"}]
[null,null,null,null,null,null,null,null,null,null,null,null,null,null,null,null,null,153,3,16,null,{"$f":"INDEX(LSTstart2D,T154,S154)","v":"16;3;0;3;0;103;"}]
[null,null,null,null,null,null,null,null,null,null,null,null,null,null,null,null,null,154,4,16,null,{"$f":"INDEX(LSTstart2D,T155,S155)","v":"16;3;0;4;0;104;"}]
[null,null,null,null,null,null,null,null,null,null,null,null,null,null,null,null,null,155,5,16,null,{"$f":"INDEX(LSTstart2D,T156,S156)","v":"16;3;0;5;0;105;"}]
[null,null,null,null,null,null,null,null,null,null,null,null,null,null,null,null,null,156,6,16,null,{"$f":"INDEX(LSTstart2D,T157,S157)","v":"16;3;0;6;0;106;"}]
[null,null,null,null,null,null,null,null,null,null,null,null,null,null,null,null,null,157,7,16,null,{"$f":"INDEX(LSTstart2D,T158,S158)","v":""}]
[null,null,null,null,null,null,null,null,null,null,null,null,null,null,null,null,null,158,8,16,null,{"$f":"INDEX(LSTstart2D,T159,S159)","v":""}]
[null,null,null,null,null,null,null,null,null,null,null,null,null,null,null,null,null,159,9,16,null,{"$f":"INDEX(LSTstart2D,T160,S160)","v":""}]
[null,null,null,null,null,null,null,null,null,null,null,null,null,null,null,null,null,160,10,16,null,{"$f":"INDEX(LSTstart2D,T161,S161)","v":""}]
[null,null,null,null,null,null,null,null,null,null,null,null,null,null,null,null,null,161,1,17,null,{"$f":"INDEX(LSTstart2D,T162,S162)","v":"17;3;0;1;0;201;"}]
[null,null,null,null,null,null,null,null,null,null,null,null,null,null,null,null,null,162,2,17,null,{"$f":"INDEX(LSTstart2D,T163,S163)","v":"17;3;0;2;0;202;"}]
[null,null,null,null,null,null,null,null,null,null,null,null,null,null,null,null,null,163,3,17,null,{"$f":"INDEX(LSTstart2D,T164,S164)","v":"17;3;0;3;0;203;"}]
[null,null,null,null,null,null,null,null,null,null,null,null,null,null,null,null,null,164,4,17,null,{"$f":"INDEX(LSTstart2D,T165,S165)","v":"17;3;0;4;0;204;"}]
[null,null,null,null,null,null,null,null,null,null,null,null,null,null,null,null,null,165,5,17,null,{"$f":"INDEX(LSTstart2D,T166,S166)","v":"17;3;0;5;0;205;"}]
[null,null,null,null,null,null,null,null,null,null,null,null,null,null,null,null,null,166,6,17,null,{"$f":"INDEX(LSTstart2D,T167,S167)","v":"17;3;0;6;0;206;"}]
[null,null,null,null,null,null,null,null,null,null,null,null,null,null,null,null,null,167,7,17,null,{"$f":"INDEX(LSTstart2D,T168,S168)","v":""}]
[null,null,null,null,null,null,null,null,null,null,null,null,null,null,null,null,null,168,8,17,null,{"$f":"INDEX(LSTstart2D,T169,S169)","v":""}]
[null,null,null,null,null,null,null,null,null,null,null,null,null,null,null,null,null,169,9,17,null,{"$f":"INDEX(LSTstart2D,T170,S170)","v":""}]
[null,null,null,null,null,null,null,null,null,null,null,null,null,null,null,null,null,170,10,17,null,{"$f":"INDEX(LSTstart2D,T171,S171)","v":""}]
[null,null,null,null,null,null,null,null,null,null,null,null,null,null,null,null,null,171,1,18,null,{"$f":"INDEX(LSTstart2D,T172,S172)","v":"18;3;0;1;0;101;"}]
[null,null,null,null,null,null,null,null,null,null,null,null,null,null,null,null,null,172,2,18,null,{"$f":"INDEX(LSTstart2D,T173,S173)","v":"18;3;0;2;0;102;"}]
[null,null,null,null,null,null,null,null,null,null,null,null,null,null,null,null,null,173,3,18,null,{"$f":"INDEX(LSTstart2D,T174,S174)","v":"18;3;0;3;0;103;"}]
[null,null,null,null,null,null,null,null,null,null,null,null,null,null,null,null,null,174,4,18,null,{"$f":"INDEX(LSTstart2D,T175,S175)","v":"18;3;0;4;0;104;"}]
[null,null,null,null,null,null,null,null,null,null,null,null,null,null,null,null,null,175,5,18,null,{"$f":"INDEX(LSTstart2D,T176,S176)","v":"18;3;0;5;0;105;"}]
[null,null,null,null,null,null,null,null,null,null,null,null,null,null,null,null,null,176,6,18,null,{"$f":"INDEX(LSTstart2D,T177,S177)","v":"18;3;0;6;0;106;"}]
[null,null,null,null,null,null,null,null,null,null,null,null,null,null,null,null,null,177,7,18,null,{"$f":"INDEX(LSTstart2D,T178,S178)","v":""}]
[null,null,null,null,null,null,null,null,null,null,null,null,null,null,null,null,null,178,8,18,null,{"$f":"INDEX(LSTstart2D,T179,S179)","v":""}]
[null,null,null,null,null,null,null,null,null,null,null,null,null,null,null,null,null,179,9,18,null,{"$f":"INDEX(LSTstart2D,T180,S180)","v":""}]
[null,null,null,null,null,null,null,null,null,null,null,null,null,null,null,null,null,180,10,18,null,{"$f":"INDEX(LSTstart2D,T181,S181)","v":""}]
[null,null,null,null,null,null,null,null,null,null,null,null,null,null,null,null,null,181,1,19,null,{"$f":"INDEX(LSTstart2D,T182,S182)","v":"19;3;0;1;0;201;"}]
[null,null,null,null,null,null,null,null,null,null,null,null,null,null,null,null,null,182,2,19,null,{"$f":"INDEX(LSTstart2D,T183,S183)","v":"19;3;0;2;0;202;"}]
[null,null,null,null,null,null,null,null,null,null,null,null,null,null,null,null,null,183,3,19,null,{"$f":"INDEX(LSTstart2D,T184,S184)","v":"19;3;0;3;0;203;"}]
[null,null,null,null,null,null,null,null,null,null,null,null,null,null,null,null,null,184,4,19,null,{"$f":"INDEX(LSTstart2D,T185,S185)","v":"19;3;0;4;0;204;"}]
[null,null,null,null,null,null,null,null,null,null,null,null,null,null,null,null,null,185,5,19,null,{"$f":"INDEX(LSTstart2D,T186,S186)","v":"19;3;0;5;0;205;"}]
[null,null,null,null,null,null,null,null,null,null,null,null,null,null,null,null,null,186,6,19,null,{"$f":"INDEX(LSTstart2D,T187,S187)","v":"19;3;0;6;0;206;"}]
[null,null,null,null,null,null,null,null,null,null,null,null,null,null,null,null,null,187,7,19,null,{"$f":"INDEX(LSTstart2D,T188,S188)","v":""}]
[null,null,null,null,null,null,null,null,null,null,null,null,null,null,null,null,null,188,8,19,null,{"$f":"INDEX(LSTstart2D,T189,S189)","v":""}]
[null,null,null,null,null,null,null,null,null,null,null,null,null,null,null,null,null,189,9,19,null,{"$f":"INDEX(LSTstart2D,T190,S190)","v":""}]
[null,null,null,null,null,null,null,null,null,null,null,null,null,null,null,null,null,190,10,19,null,{"$f":"INDEX(LSTstart2D,T191,S191)","v":""}]
[null,null,null,null,null,null,null,null,null,null,null,null,null,null,null,null,null,191,1,20,null,{"$f":"INDEX(LSTstart2D,T192,S192)","v":"20;3;0;1;0;101;"}]
[null,null,null,null,null,null,null,null,null,null,null,null,null,null,null,null,null,192,2,20,null,{"$f":"INDEX(LSTstart2D,T193,S193)","v":"20;3;0;2;0;102;"}]
[null,null,null,null,null,null,null,null,null,null,null,null,null,null,null,null,null,193,3,20,null,{"$f":"INDEX(LSTstart2D,T194,S194)","v":"20;3;0;3;0;103;"}]
[null,null,null,null,null,null,null,null,null,null,null,null,null,null,null,null,null,194,{"$f":"MOD(R195-1,10)+1","v":4},{"$f":"INT((R195-1)/10)+1","v":20},null,{"$f":"INDEX(LSTstart2D,T195,S195)","v":"20;3;0;4;0;104;"}]
[null,null,null,null,null,null,null,null,null,null,null,null,null,null,null,null,null,{"$f":"R195+1","v":195},5,20,null,{"$f":"INDEX(LSTstart2D,T196,S196)","v":"20;3;0;5;0;105;"}]
[null,null,null,null,null,null,null,null,null,null,null,null,null,null,null,null,null,196,6,20,null,{"$f":"INDEX(LSTstart2D,T197,S197)","v":"20;3;0;6;0;106;"}]
[null,null,null,null,null,null,null,null,null,null,null,null,null,null,null,null,null,197,7,20,null,{"$f":"INDEX(LSTstart2D,T198,S198)","v":""}]
[null,null,null,null,null,null,null,null,null,null,null,null,null,null,null,null,null,198,8,20,null,{"$f":"INDEX(LSTstart2D,T199,S199)","v":""}]
[null,null,null,null,null,null,null,null,null,null,null,null,null,null,null,null,null,199,9,20,null,{"$f":"INDEX(LSTstart2D,T200,S200)","v":""}]
[null,null,null,null,null,null,null,null,null,null,null,null,null,null,null,null,null,200,10,20,null,{"$f":"INDEX(LSTstart2D,T201,S201)","v":""}]
[null,null,null,null,null,null,null,null,null,null,null,null,null,null,null,null,null,201,1,21,null,{"$f":"INDEX(LSTstart2D,T202,S202)","v":"21;3;0;1;0;201;"}]
[null,null,null,null,null,null,null,null,null,null,null,null,null,null,null,null,null,202,2,21,null,{"$f":"INDEX(LSTstart2D,T203,S203)","v":"21;3;0;2;0;202;"}]
[null,null,null,null,null,null,null,null,null,null,null,null,null,null,null,null,null,203,3,21,null,{"$f":"INDEX(LSTstart2D,T204,S204)","v":"21;3;0;3;0;203;"}]
[null,null,null,null,null,null,null,null,null,null,null,null,null,null,null,null,null,204,4,21,null,{"$f":"INDEX(LSTstart2D,T205,S205)","v":"21;3;0;4;0;204;"}]
[null,null,null,null,null,null,null,null,null,null,null,null,null,null,null,null,null,205,5,21,null,{"$f":"INDEX(LSTstart2D,T206,S206)","v":"21;3;0;5;0;205;"}]
[null,null,null,null,null,null,null,null,null,null,null,null,null,null,null,null,null,206,6,21,null,{"$f":"INDEX(LSTstart2D,T207,S207)","v":"21;3;0;6;0;206;"}]
[null,null,null,null,null,null,null,null,null,null,null,null,null,null,null,null,null,207,7,21,null,{"$f":"INDEX(LSTstart2D,T208,S208)","v":""}]
[null,null,null,null,null,null,null,null,null,null,null,null,null,null,null,null,null,208,8,21,null,{"$f":"INDEX(LSTstart2D,T209,S209)","v":""}]
[null,null,null,null,null,null,null,null,null,null,null,null,null,null,null,null,null,209,9,21,null,{"$f":"INDEX(LSTstart2D,T210,S210)","v":""}]
[null,null,null,null,null,null,null,null,null,null,null,null,null,null,null,null,null,210,10,21,null,{"$f":"INDEX(LSTstart2D,T211,S211)","v":""}]
[null,null,null,null,null,null,null,null,null,null,null,null,null,null,null,null,null,211,1,22,null,{"$f":"INDEX(LSTstart2D,T212,S212)","v":"22;3;0;1;0;101;"}]
[null,null,null,null,null,null,null,null,null,null,null,null,null,null,null,null,null,212,2,22,null,{"$f":"INDEX(LSTstart2D,T213,S213)","v":"22;3;0;2;0;102;"}]
[null,null,null,null,null,null,null,null,null,null,null,null,null,null,null,null,null,213,3,22,null,{"$f":"INDEX(LSTstart2D,T214,S214)","v":"22;3;0;3;0;103;"}]
[null,null,null,null,null,null,null,null,null,null,null,null,null,null,null,null,null,214,4,22,null,{"$f":"INDEX(LSTstart2D,T215,S215)","v":"22;3;0;4;0;104;"}]
[null,null,null,null,null,null,null,null,null,null,null,null,null,null,null,null,null,215,5,22,null,{"$f":"INDEX(LSTstart2D,T216,S216)","v":"22;3;0;5;0;105;"}]
[null,null,null,null,null,null,null,null,null,null,null,null,null,null,null,null,null,216,6,22,null,{"$f":"INDEX(LSTstart2D,T217,S217)","v":"22;3;0;6;0;106;"}]
[null,null,null,null,null,null,null,null,null,null,null,null,null,null,null,null,null,217,7,22,null,{"$f":"INDEX(LSTstart2D,T218,S218)","v":""}]
[null,null,null,null,null,null,null,null,null,null,null,null,null,null,null,null,null,218,8,22,null,{"$f":"INDEX(LSTstart2D,T219,S219)","v":""}]
[null,null,null,null,null,null,null,null,null,null,null,null,null,null,null,null,null,219,9,22,null,{"$f":"INDEX(LSTstart2D,T220,S220)","v":""}]
[null,null,null,null,null,null,null,null,null,null,null,null,null,null,null,null,null,220,10,22,null,{"$f":"INDEX(LSTstart2D,T221,S221)","v":""}]
[null,null,null,null,null,null,null,null,null,null,null,null,null,null,null,null,null,221,1,23,null,{"$f":"INDEX(LSTstart2D,T222,S222)","v":"23;3;0;1;0;201;"}]
[null,null,null,null,null,null,null,null,null,null,null,null,null,null,null,null,null,222,2,23,null,{"$f":"INDEX(LSTstart2D,T223,S223)","v":"23;3;0;2;0;202;"}]
[null,null,null,null,null,null,null,null,null,null,null,null,null,null,null,null,null,223,3,23,null,{"$f":"INDEX(LSTstart2D,T224,S224)","v":"23;3;0;3;0;203;"}]
[null,null,null,null,null,null,null,null,null,null,null,null,null,null,null,null,null,224,4,23,null,{"$f":"INDEX(LSTstart2D,T225,S225)","v":"23;3;0;4;0;204;"}]
[null,null,null,null,null,null,null,null,null,null,null,null,null,null,null,null,null,225,5,23,null,{"$f":"INDEX(LSTstart2D,T226,S226)","v":"23;3;0;5;0;205;"}]
[null,null,null,null,null,null,null,null,null,null,null,null,null,null,null,null,null,226,6,23,null,{"$f":"INDEX(LSTstart2D,T227,S227)","v":"23;3;0;6;0;206;"}]
[null,null,null,null,null,null,null,null,null,null,null,null,null,null,null,null,null,227,7,23,null,{"$f":"INDEX(LSTstart2D,T228,S228)","v":""}]
[null,null,null,null,null,null,null,null,null,null,null,null,null,null,null,null,null,228,8,23,null,{"$f":"INDEX(LSTstart2D,T229,S229)","v":""}]
[null,null,null,null,null,null,null,null,null,null,null,null,null,null,null,null,null,229,9,23,null,{"$f":"INDEX(LSTstart2D,T230,S230)","v":""}]
[null,null,null,null,null,null,null,null,null,null,null,null,null,null,null,null,null,230,10,23,null,{"$f":"INDEX(LSTstart2D,T231,S231)","v":""}]
[null,null,null,null,null,null,null,null,null,null,null,null,null,null,null,null,null,231,1,24,null,{"$f":"INDEX(LSTstart2D,T232,S232)","v":"24;3;0;1;0;101;"}]
[null,null,null,null,null,null,null,null,null,null,null,null,null,null,null,null,null,232,2,24,null,{"$f":"INDEX(LSTstart2D,T233,S233)","v":"24;3;0;2;0;102;"}]
[null,null,null,null,null,null,null,null,null,null,null,null,null,null,null,null,null,233,3,24,null,{"$f":"INDEX(LSTstart2D,T234,S234)","v":"24;3;0;3;0;103;"}]
[null,null,null,null,null,null,null,null,null,null,null,null,null,null,null,null,null,234,4,24,null,{"$f":"INDEX(LSTstart2D,T235,S235)","v":"24;3;0;4;0;104;"}]
[null,null,null,null,null,null,null,null,null,null,null,null,null,null,null,null,null,235,5,24,null,{"$f":"INDEX(LSTstart2D,T236,S236)","v":"24;3;0;5;0;105;"}]
[null,null,null,null,null,null,null,null,null,null,null,null,null,null,null,null,null,236,6,24,null,{"$f":"INDEX(LSTstart2D,T237,S237)","v":"24;3;0;6;0;106;"}]
[null,null,null,null,null,null,null,null,null,null,null,null,null,null,null,null,null,237,7,24,null,{"$f":"INDEX(LSTstart2D,T238,S238)","v":""}]
[null,null,null,null,null,null,null,null,null,null,null,null,null,null,null,null,null,238,8,24,null,{"$f":"INDEX(LSTstart2D,T239,S239)","v":""}]
[null,null,null,null,null,null,null,null,null,null,null,null,null,null,null,null,null,239,9,24,null,{"$f":"INDEX(LSTstart2D,T240,S240)","v":""}]
[null,null,null,null,null,null,null,null,null,null,null,null,null,null,null,null,null,240,10,24,null,{"$f":"INDEX(LSTstart2D,T241,S241)","v":""}]
[null,null,null,null,null,null,null,null,null,null,null,null,null,null,null,null,null,241,1,25,null,{"$f":"INDEX(LSTstart2D,T242,S242)","v":"25;3;0;1;0;201;"}]
[null,null,null,null,null,null,null,null,null,null,null,null,null,null,null,null,null,242,2,25,null,{"$f":"INDEX(LSTstart2D,T243,S243)","v":"25;3;0;2;0;202;"}]
[null,null,null,null,null,null,null,null,null,null,null,null,null,null,null,null,null,243,3,25,null,{"$f":"INDEX(LSTstart2D,T244,S244)","v":"25;3;0;3;0;203;"}]
[null,null,null,null,null,null,null,null,null,null,null,null,null,null,null,null,null,244,4,25,null,{"$f":"INDEX(LSTstart2D,T245,S245)","v":"25;3;0;4;0;204;"}]
[null,null,null,null,null,null,null,null,null,null,null,null,null,null,null,null,null,245,5,25,null,{"$f":"INDEX(LSTstart2D,T246,S246)","v":"25;3;0;5;0;205;"}]
[null,null,null,null,null,null,null,null,null,null,null,null,null,null,null,null,null,246,6,25,null,{"$f":"INDEX(LSTstart2D,T247,S247)","v":"25;3;0;6;0;206;"}]
[null,null,null,null,null,null,null,null,null,null,null,null,null,null,null,null,null,247,7,25,null,{"$f":"INDEX(LSTstart2D,T248,S248)","v":""}]
[null,null,null,null,null,null,null,null,null,null,null,null,null,null,null,null,null,248,8,25,null,{"$f":"INDEX(LSTstart2D,T249,S249)","v":""}]
[null,null,null,null,null,null,null,null,null,null,null,null,null,null,null,null,null,249,9,25,null,{"$f":"INDEX(LSTstart2D,T250,S250)","v":""}]
[null,null,null,null,null,null,null,null,null,null,null,null,null,null,null,null,null,250,10,25,null,{"$f":"INDEX(LSTstart2D,T251,S251)","v":""}]
[null,null,null,null,null,null,null,null,null,null,null,null,null,null,null,null,null,251,1,26,null,{"$f":"INDEX(LSTstart2D,T252,S252)","v":"26;3;0;1;0;101;"}]
[null,null,null,null,null,null,null,null,null,null,null,null,null,null,null,null,null,252,2,26,null,{"$f":"INDEX(LSTstart2D,T253,S253)","v":"26;3;0;2;0;102;"}]
[null,null,null,null,null,null,null,null,null,null,null,null,null,null,null,null,null,253,3,26,null,{"$f":"INDEX(LSTstart2D,T254,S254)","v":"26;3;0;3;0;103;"}]
[null,null,null,null,null,null,null,null,null,null,null,null,null,null,null,null,null,254,4,26,null,{"$f":"INDEX(LSTstart2D,T255,S255)","v":"26;3;0;4;0;104;"}]
[null,null,null,null,null,null,null,null,null,null,null,null,null,null,null,null,null,255,5,26,null,{"$f":"INDEX(LSTstart2D,T256,S256)","v":"26;3;0;5;0;105;"}]
[null,null,null,null,null,null,null,null,null,null,null,null,null,null,null,null,null,256,6,26,null,{"$f":"INDEX(LSTstart2D,T257,S257)","v":"26;3;0;6;0;106;"}]
[null,null,null,null,null,null,null,null,null,null,null,null,null,null,null,null,null,257,7,26,null,{"$f":"INDEX(LSTstart2D,T258,S258)","v":""}]
[null,null,null,null,null,null,null,null,null,null,null,null,null,null,null,null,null,258,{"$f":"MOD(R259-1,10)+1","v":8},{"$f":"INT((R259-1)/10)+1","v":26},null,{"$f":"INDEX(LSTstart2D,T259,S259)","v":""}]
[null,null,null,null,null,null,null,null,null,null,null,null,null,null,null,null,null,{"$f":"R259+1","v":259},9,26,null,{"$f":"INDEX(LSTstart2D,T260,S260)","v":""}]
[null,null,null,null,null,null,null,null,null,null,null,null,null,null,null,null,null,260,10,26,null,{"$f":"INDEX(LSTstart2D,T261,S261)","v":""}]
[null,null,null,null,null,null,null,null,null,null,null,null,null,null,null,null,null,261,1,27,null,{"$f":"INDEX(LSTstart2D,T262,S262)","v":"27;3;0;1;0;201;"}]
[null,null,null,null,null,null,null,null,null,null,null,null,null,null,null,null,null,262,2,27,null,{"$f":"INDEX(LSTstart2D,T263,S263)","v":"27;3;0;2;0;202;"}]
[null,null,null,null,null,null,null,null,null,null,null,null,null,null,null,null,null,263,3,27,null,{"$f":"INDEX(LSTstart2D,T264,S264)","v":"27;3;0;3;0;203;"}]
[null,null,null,null,null,null,null,null,null,null,null,null,null,null,null,null,null,264,4,27,null,{"$f":"INDEX(LSTstart2D,T265,S265)","v":"27;3;0;4;0;204;"}]
[null,null,null,null,null,null,null,null,null,null,null,null,null,null,null,null,null,265,5,27,null,{"$f":"INDEX(LSTstart2D,T266,S266)","v":"27;3;0;5;0;205;"}]
[null,null,null,null,null,null,null,null,null,null,null,null,null,null,null,null,null,266,6,27,null,{"$f":"INDEX(LSTstart2D,T267,S267)","v":"27;3;0;6;0;206;"}]
[null,null,null,null,null,null,null,null,null,null,null,null,null,null,null,null,null,267,7,27,null,{"$f":"INDEX(LSTstart2D,T268,S268)","v":""}]
[null,null,null,null,null,null,null,null,null,null,null,null,null,null,null,null,null,268,8,27,null,{"$f":"INDEX(LSTstart2D,T269,S269)","v":""}]
[null,null,null,null,null,null,null,null,null,null,null,null,null,null,null,null,null,269,9,27,null,{"$f":"INDEX(LSTstart2D,T270,S270)","v":""}]
[null,null,null,null,null,null,null,null,null,null,null,null,null,null,null,null,null,270,10,27,null,{"$f":"INDEX(LSTstart2D,T271,S271)","v":""}]
[null,null,null,null,null,null,null,null,null,null,null,null,null,null,null,null,null,271,1,28,null,{"$f":"INDEX(LSTstart2D,T272,S272)","v":"28;3;0;1;0;101;"}]
[null,null,null,null,null,null,null,null,null,null,null,null,null,null,null,null,null,272,2,28,null,{"$f":"INDEX(LSTstart2D,T273,S273)","v":"28;3;0;2;0;102;"}]
[null,null,null,null,null,null,null,null,null,null,null,null,null,null,null,null,null,273,3,28,null,{"$f":"INDEX(LSTstart2D,T274,S274)","v":"28;3;0;3;0;103;"}]
[null,null,null,null,null,null,null,null,null,null,null,null,null,null,null,null,null,274,4,28,null,{"$f":"INDEX(LSTstart2D,T275,S275)","v":"28;3;0;4;0;104;"}]
[null,null,null,null,null,null,null,null,null,null,null,null,null,null,null,null,null,275,5,28,null,{"$f":"INDEX(LSTstart2D,T276,S276)","v":"28;3;0;5;0;105;"}]
[null,null,null,null,null,null,null,null,null,null,null,null,null,null,null,null,null,276,6,28,null,{"$f":"INDEX(LSTstart2D,T277,S277)","v":"28;3;0;6;0;106;"}]
[null,null,null,null,null,null,null,null,null,null,null,null,null,null,null,null,null,277,7,28,null,{"$f":"INDEX(LSTstart2D,T278,S278)","v":""}]
[null,null,null,null,null,null,null,null,null,null,null,null,null,null,null,null,null,278,8,28,null,{"$f":"INDEX(LSTstart2D,T279,S279)","v":""}]
[null,null,null,null,null,null,null,null,null,null,null,null,null,null,null,null,null,279,9,28,null,{"$f":"INDEX(LSTstart2D,T280,S280)","v":""}]
[null,null,null,null,null,null,null,null,null,null,null,null,null,null,null,null,null,280,10,28,null,{"$f":"INDEX(LSTstart2D,T281,S281)","v":""}]
[null,null,null,null,null,null,null,null,null,null,null,null,null,null,null,null,null,281,1,29,null,{"$f":"INDEX(LSTstart2D,T282,S282)","v":"29;3;0;1;0;201;"}]
[null,null,null,null,null,null,null,null,null,null,null,null,null,null,null,null,null,282,2,29,null,{"$f":"INDEX(LSTstart2D,T283,S283)","v":"29;3;0;2;0;202;"}]
[null,null,null,null,null,null,null,null,null,null,null,null,null,null,null,null,null,283,3,29,null,{"$f":"INDEX(LSTstart2D,T284,S284)","v":"29;3;0;3;0;203;"}]
[null,null,null,null,null,null,null,null,null,null,null,null,null,null,null,null,null,284,4,29,null,{"$f":"INDEX(LSTstart2D,T285,S285)","v":"29;3;0;4;0;204;"}]
[null,null,null,null,null,null,null,null,null,null,null,null,null,null,null,null,null,285,5,29,null,{"$f":"INDEX(LSTstart2D,T286,S286)","v":"29;3;0;5;0;205;"}]
[null,null,null,null,null,null,null,null,null,null,null,null,null,null,null,null,null,286,6,29,null,{"$f":"INDEX(LSTstart2D,T287,S287)","v":"29;3;0;6;0;206;"}]
[null,null,null,null,null,null,null,null,null,null,null,null,null,null,null,null,null,287,7,29,null,{"$f":"INDEX(LSTstart2D,T288,S288)","v":""}]
[null,null,null,null,null,null,null,null,null,null,null,null,null,null,null,null,null,288,8,29,null,{"$f":"INDEX(LSTstart2D,T289,S289)","v":""}]
[null,null,null,null,null,null,null,null,null,null,null,null,null,null,null,null,null,289,9,29,null,{"$f":"INDEX(LSTstart2D,T290,S290)","v":""}]
[null,null,null,null,null,null,null,null,null,null,null,null,null,null,null,null,null,290,10,29,null,{"$f":"INDEX(LSTstart2D,T291,S291)","v":""}]
[null,null,null,null,null,null,null,null,null,null,null,null,null,null,null,null,null,291,1,30,null,{"$f":"INDEX(LSTstart2D,T292,S292)","v":"30;3;0;1;0;101;"}]
[null,null,null,null,null,null,null,null,null,null,null,null,null,null,null,null,null,292,2,30,null,{"$f":"INDEX(LSTstart2D,T293,S293)","v":"30;3;0;2;0;102;"}]
[null,null,null,null,null,null,null,null,null,null,null,null,null,null,null,null,null,293,3,30,null,{"$f":"INDEX(LSTstart2D,T294,S294)","v":"30;3;0;3;0;103;"}]
[null,null,null,null,null,null,null,null,null,null,null,null,null,null,null,null,null,294,4,30,null,{"$f":"INDEX(LSTstart2D,T295,S295)","v":"30;3;0;4;0;104;"}]
[null,null,null,null,null,null,null,null,null,null,null,null,null,null,null,null,null,295,5,30,null,{"$f":"INDEX(LSTstart2D,T296,S296)","v":"30;3;0;5;0;105;"}]
[null,null,null,null,null,null,null,null,null,null,null,null,null,null,null,null,null,296,6,30,null,{"$f":"INDEX(LSTstart2D,T297,S297)","v":"30;3;0;6;0;106;"}]
[null,null,null,null,null,null,null,null,null,null,null,null,null,null,null,null,null,297,7,30,null,{"$f":"INDEX(LSTstart2D,T298,S298)","v":""}]
[null,null,null,null,null,null,null,null,null,null,null,null,null,null,null,null,null,298,8,30,null,{"$f":"INDEX(LSTstart2D,T299,S299)","v":""}]
[null,null,null,null,null,null,null,null,null,null,null,null,null,null,null,null,null,299,9,30,null,{"$f":"INDEX(LSTstart2D,T300,S300)","v":""}]
[null,null,null,null,null,null,null,null,null,null,null,null,null,null,null,null,null,300,10,30,null,{"$f":"INDEX(LSTstart2D,T301,S301)","v":""}]
[null,null,null,null,null,null,null,null,null,null,null,null,null,null,null,null,null,301,1,31,null,{"$f":"INDEX(LSTstart2D,T302,S302)","v":"31;3;0;1;0;201;"}]
[null,null,null,null,null,null,null,null,null,null,null,null,null,null,null,null,null,302,2,31,null,{"$f":"INDEX(LSTstart2D,T303,S303)","v":"31;3;0;2;0;202;"}]
[null,null,null,null,null,null,null,null,null,null,null,null,null,null,null,null,null,303,3,31,null,{"$f":"INDEX(LSTstart2D,T304,S304)","v":"31;3;0;3;0;203;"}]
[null,null,null,null,null,null,null,null,null,null,null,null,null,null,null,null,null,304,4,31,null,{"$f":"INDEX(LSTstart2D,T305,S305)","v":"31;3;0;4;0;204;"}]
[null,null,null,null,null,null,null,null,null,null,null,null,null,null,null,null,null,305,5,31,null,{"$f":"INDEX(LSTstart2D,T306,S306)","v":"31;3;0;5;0;205;"}]
[null,null,null,null,null,null,null,null,null,null,null,null,null,null,null,null,null,306,6,31,null,{"$f":"INDEX(LSTstart2D,T307,S307)","v":"31;3;0;6;0;206;"}]
[null,null,null,null,null,null,null,null,null,null,null,null,null,null,null,null,null,307,7,31,null,{"$f":"INDEX(LSTstart2D,T308,S308)","v":""}]
[null,null,null,null,null,null,null,null,null,null,null,null,null,null,null,null,null,308,8,31,null,{"$f":"INDEX(LSTstart2D,T309,S309)","v":""}]
[null,null,null,null,null,null,null,null,null,null,null,null,null,null,null,null,null,309,9,31,null,{"$f":"INDEX(LSTstart2D,T310,S310)","v":""}]
[null,null,null,null,null,null,null,null,null,null,null,null,null,null,null,null,null,310,10,31,null,{"$f":"INDEX(LSTstart2D,T311,S311)","v":""}]
[null,null,null,null,null,null,null,null,null,null,null,null,null,null,null,null,null,311,1,32,null,{"$f":"INDEX(LSTstart2D,T312,S312)","v":"32;3;0;1;0;101;"}]
[null,null,null,null,null,null,null,null,null,null,null,null,null,null,null,null,null,312,2,32,null,{"$f":"INDEX(LSTstart2D,T313,S313)","v":"32;3;0;2;0;102;"}]
[null,null,null,null,null,null,null,null,null,null,null,null,null,null,null,null,null,313,3,32,null,{"$f":"INDEX(LSTstart2D,T314,S314)","v":"32;3;0;3;0;103;"}]
[null,null,null,null,null,null,null,null,null,null,null,null,null,null,null,null,null,314,4,32,null,{"$f":"INDEX(LSTstart2D,T315,S315)","v":"32;3;0;4;0;104;"}]
[null,null,null,null,null,null,null,null,null,null,null,null,null,null,null,null,null,315,5,32,null,{"$f":"INDEX(LSTstart2D,T316,S316)","v":"32;3;0;5;0;105;"}]
[null,null,null,null,null,null,null,null,null,null,null,null,null,null,null,null,null,316,6,32,null,{"$f":"INDEX(LSTstart2D,T317,S317)","v":"32;3;0;6;0;106;"}]
[null,null,null,null,null,null,null,null,null,null,null,null,null,null,null,null,null,317,7,32,null,{"$f":"INDEX(LSTstart2D,T318,S318)","v":""}]
[null,null,null,null,null,null,null,null,null,null,null,null,null,null,null,null,null,318,8,32,null,{"$f":"INDEX(LSTstart2D,T319,S319)","v":""}]
[null,null,null,null,null,null,null,null,null,null,null,null,null,null,null,null,null,319,9,32,null,{"$f":"INDEX(LSTstart2D,T320,S320)","v":""}]
[null,null,null,null,null,null,null,null,null,null,null,null,null,null,null,null,null,320,10,32,null,{"$f":"INDEX(LSTstart2D,T321,S321)","v":""}]
[null,null,null,null,null,null,null,null,null,null,null,null,null,null,null,null,null,321,1,33,null,{"$f":"INDEX(LSTstart2D,T322,S322)","v":"33;3;0;1;0;201;"}]
[null,null,null,null,null,null,null,null,null,null,null,null,null,null,null,null,null,322,{"$f":"MOD(R323-1,10)+1","v":2},{"$f":"INT((R323-1)/10)+1","v":33},null,{"$f":"INDEX(LSTstart2D,T323,S323)","v":"33;3;0;2;0;202;"}]
[null,null,null,null,null,null,null,null,null,null,null,null,null,null,null,null,null,{"$f":"R323+1","v":323},3,33,null,{"$f":"INDEX(LSTstart2D,T324,S324)","v":"33;3;0;3;0;203;"}]
[null,null,null,null,null,null,null,null,null,null,null,null,null,null,null,null,null,324,4,33,null,{"$f":"INDEX(LSTstart2D,T325,S325)","v":"33;3;0;4;0;204;"}]
[null,null,null,null,null,null,null,null,null,null,null,null,null,null,null,null,null,325,5,33,null,{"$f":"INDEX(LSTstart2D,T326,S326)","v":"33;3;0;5;0;205;"}]
[null,null,null,null,null,null,null,null,null,null,null,null,null,null,null,null,null,326,6,33,null,{"$f":"INDEX(LSTstart2D,T327,S327)","v":"33;3;0;6;0;206;"}]
[null,null,null,null,null,null,null,null,null,null,null,null,null,null,null,null,null,327,7,33,null,{"$f":"INDEX(LSTstart2D,T328,S328)","v":""}]
[null,null,null,null,null,null,null,null,null,null,null,null,null,null,null,null,null,328,8,33,null,{"$f":"INDEX(LSTstart2D,T329,S329)","v":""}]
[null,null,null,null,null,null,null,null,null,null,null,null,null,null,null,null,null,329,9,33,null,{"$f":"INDEX(LSTstart2D,T330,S330)","v":""}]
[null,null,null,null,null,null,null,null,null,null,null,null,null,null,null,null,null,330,10,33,null,{"$f":"INDEX(LSTstart2D,T331,S331)","v":""}]
[null,null,null,null,null,null,null,null,null,null,null,null,null,null,null,null,null,331,1,34,null,{"$f":"INDEX(LSTstart2D,T332,S332)","v":"34;3;0;1;0;101;"}]
[null,null,null,null,null,null,null,null,null,null,null,null,null,null,null,null,null,332,2,34,null,{"$f":"INDEX(LSTstart2D,T333,S333)","v":"34;3;0;2;0;102;"}]
[null,null,null,null,null,null,null,null,null,null,null,null,null,null,null,null,null,333,3,34,null,{"$f":"INDEX(LSTstart2D,T334,S334)","v":"34;3;0;3;0;103;"}]
[null,null,null,null,null,null,null,null,null,null,null,null,null,null,null,null,null,334,4,34,null,{"$f":"INDEX(LSTstart2D,T335,S335)","v":"34;3;0;4;0;104;"}]
[null,null,null,null,null,null,null,null,null,null,null,null,null,null,null,null,null,335,5,34,null,{"$f":"INDEX(LSTstart2D,T336,S336)","v":"34;3;0;5;0;105;"}]
[null,null,null,null,null,null,null,null,null,null,null,null,null,null,null,null,null,336,6,34,null,{"$f":"INDEX(LSTstart2D,T337,S337)","v":"34;3;0;6;0;106;"}]
[null,null,null,null,null,null,null,null,null,null,null,null,null,null,null,null,null,337,7,34,null,{"$f":"INDEX(LSTstart2D,T338,S338)","v":""}]
[null,null,null,null,null,null,null,null,null,null,null,null,null,null,null,null,null,338,8,34,null,{"$f":"INDEX(LSTstart2D,T339,S339)","v":""}]
[null,null,null,null,null,null,null,null,null,null,null,null,null,null,null,null,null,339,9,34,null,{"$f":"INDEX(LSTstart2D,T340,S340)","v":""}]
[null,null,null,null,null,null,null,null,null,null,null,null,null,null,null,null,null,340,10,34,null,{"$f":"INDEX(LSTstart2D,T341,S341)","v":""}]
[null,null,null,null,null,null,null,null,null,null,null,null,null,null,null,null,null,341,1,35,null,{"$f":"INDEX(LSTstart2D,T342,S342)","v":"35;3;0;1;0;201;"}]
[null,null,null,null,null,null,null,null,null,null,null,null,null,null,null,null,null,342,2,35,null,{"$f":"INDEX(LSTstart2D,T343,S343)","v":"35;3;0;2;0;202;"}]
[null,null,null,null,null,null,null,null,null,null,null,null,null,null,null,null,null,343,3,35,null,{"$f":"INDEX(LSTstart2D,T344,S344)","v":"35;3;0;3;0;203;"}]
[null,null,null,null,null,null,null,null,null,null,null,null,null,null,null,null,null,344,4,35,null,{"$f":"INDEX(LSTstart2D,T345,S345)","v":"35;3;0;4;0;204;"}]
[null,null,null,null,null,null,null,null,null,null,null,null,null,null,null,null,null,345,5,35,null,{"$f":"INDEX(LSTstart2D,T346,S346)","v":"35;3;0;5;0;205;"}]
[null,null,null,null,null,null,null,null,null,null,null,null,null,null,null,null,null,346,6,35,null,{"$f":"INDEX(LSTstart2D,T347,S347)","v":"35;3;0;6;0;206;"}]
[null,null,null,null,null,null,null,null,null,null,null,null,null,null,null,null,null,347,7,35,null,{"$f":"INDEX(LSTstart2D,T348,S348)","v":""}]
[null,null,null,null,null,null,null,null,null,null,null,null,null,null,null,null,null,348,8,35,null,{"$f":"INDEX(LSTstart2D,T349,S349)","v":""}]
[null,null,null,null,null,null,null,null,null,null,null,null,null,null,null,null,null,349,9,35,null,{"$f":"INDEX(LSTstart2D,T350,S350)","v":""}]
[null,null,null,null,null,null,null,null,null,null,null,null,null,null,null,null,null,350,10,35,null,{"$f":"INDEX(LSTstart2D,T351,S351)","v":""}]
[null,null,null,null,null,null,null,null,null,null,null,null,null,null,null,null,null,351,1,36,null,{"$f":"INDEX(LSTstart2D,T352,S352)","v":"36;3;0;1;0;101;"}]
[null,null,null,null,null,null,null,null,null,null,null,null,null,null,null,null,null,352,2,36,null,{"$f":"INDEX(LSTstart2D,T353,S353)","v":"36;3;0;2;0;102;"}]
[null,null,null,null,null,null,null,null,null,null,null,null,null,null,null,null,null,353,3,36,null,{"$f":"INDEX(LSTstart2D,T354,S354)","v":"36;3;0;3;0;103;"}]
[null,null,null,null,null,null,null,null,null,null,null,null,null,null,null,null,null,354,4,36,null,{"$f":"INDEX(LSTstart2D,T355,S355)","v":"36;3;0;4;0;104;"}]
[null,null,null,null,null,null,null,null,null,null,null,null,null,null,null,null,null,355,5,36,null,{"$f":"INDEX(LSTstart2D,T356,S356)","v":"36;3;0;5;0;105;"}]
[null,null,null,null,null,null,null,null,null,null,null,null,null,null,null,null,null,356,6,36,null,{"$f":"INDEX(LSTstart2D,T357,S357)","v":"36;3;0;6;0;106;"}]
[null,null,null,null,null,null,null,null,null,null,null,null,null,null,null,null,null,357,7,36,null,{"$f":"INDEX(LSTstart2D,T358,S358)","v":""}]
[null,null,null,null,null,null,null,null,null,null,null,null,null,null,null,null,null,358,8,36,null,{"$f":"INDEX(LSTstart2D,T359,S359)","v":""}]
[null,null,null,null,null,null,null,null,null,null,null,null,null,null,null,null,null,359,9,36,null,{"$f":"INDEX(LSTstart2D,T360,S360)","v":""}]
[null,null,null,null,null,null,null,null,null,null,null,null,null,null,null,null,null,360,10,36,null,{"$f":"INDEX(LSTstart2D,T361,S361)","v":""}]
[null,null,null,null,null,null,null,null,null,null,null,null,null,null,null,null,null,361,1,37,null,{"$f":"INDEX(LSTstart2D,T362,S362)","v":"37;3;0;1;0;201;"}]
[null,null,null,null,null,null,null,null,null,null,null,null,null,null,null,null,null,362,2,37,null,{"$f":"INDEX(LSTstart2D,T363,S363)","v":"37;3;0;2;0;202;"}]
[null,null,null,null,null,null,null,null,null,null,null,null,null,null,null,null,null,363,3,37,null,{"$f":"INDEX(LSTstart2D,T364,S364)","v":"37;3;0;3;0;203;"}]
[null,null,null,null,null,null,null,null,null,null,null,null,null,null,null,null,null,364,4,37,null,{"$f":"INDEX(LSTstart2D,T365,S365)","v":"37;3;0;4;0;204;"}]
[null,null,null,null,null,null,null,null,null,null,null,null,null,null,null,null,null,365,5,37,null,{"$f":"INDEX(LSTstart2D,T366,S366)","v":"37;3;0;5;0;205;"}]
[null,null,null,null,null,null,null,null,null,null,null,null,null,null,null,null,null,366,6,37,null,{"$f":"INDEX(LSTstart2D,T367,S367)","v":"37;3;0;6;0;206;"}]
[null,null,null,null,null,null,null,null,null,null,null,null,null,null,null,null,null,367,7,37,null,{"$f":"INDEX(LSTstart2D,T368,S368)","v":""}]
[null,null,null,null,null,null,null,null,null,null,null,null,null,null,null,null,null,368,8,37,null,{"$f":"INDEX(LSTstart2D,T369,S369)","v":""}]
[null,null,null,null,null,null,null,null,null,null,null,null,null,null,null,null,null,369,9,37,null,{"$f":"INDEX(LSTstart2D,T370,S370)","v":""}]
[null,null,null,null,null,null,null,null,null,null,null,null,null,null,null,null,null,370,10,37,null,{"$f":"INDEX(LSTstart2D,T371,S371)","v":""}]
[null,null,null,null,null,null,null,null,null,null,null,null,null,null,null,null,null,371,1,38,null,{"$f":"INDEX(LSTstart2D,T372,S372)","v":"38;3;0;1;0;101;"}]
[null,null,null,null,null,null,null,null,null,null,null,null,null,null,null,null,null,372,2,38,null,{"$f":"INDEX(LSTstart2D,T373,S373)","v":"38;3;0;2;0;102;"}]
[null,null,null,null,null,null,null,null,null,null,null,null,null,null,null,null,null,373,3,38,null,{"$f":"INDEX(LSTstart2D,T374,S374)","v":"38;3;0;3;0;103;"}]
[null,null,null,null,null,null,null,null,null,null,null,null,null,null,null,null,null,374,4,38,null,{"$f":"INDEX(LSTstart2D,T375,S375)","v":"38;3;0;4;0;104;"}]
[null,null,null,null,null,null,null,null,null,null,null,null,null,null,null,null,null,375,5,38,null,{"$f":"INDEX(LSTstart2D,T376,S376)","v":"38;3;0;5;0;105;"}]
[null,null,null,null,null,null,null,null,null,null,null,null,null,null,null,null,null,376,6,38,null,{"$f":"INDEX(LSTstart2D,T377,S377)","v":"38;3;0;6;0;106;"}]
[null,null,null,null,null,null,null,null,null,null,null,null,null,null,null,null,null,377,7,38,null,{"$f":"INDEX(LSTstart2D,T378,S378)","v":""}]
[null,null,null,null,null,null,null,null,null,null,null,null,null,null,null,null,null,378,8,38,null,{"$f":"INDEX(LSTstart2D,T379,S379)","v":""}]
[null,null,null,null,null,null,null,null,null,null,null,null,null,null,null,null,null,379,9,38,null,{"$f":"INDEX(LSTstart2D,T380,S380)","v":""}]
[null,null,null,null,null,null,null,null,null,null,null,null,null,null,null,null,null,380,10,38,null,{"$f":"INDEX(LSTstart2D,T381,S381)","v":""}]
[null,null,null,null,null,null,null,null,null,null,null,null,null,null,null,null,null,381,1,39,null,{"$f":"INDEX(LSTstart2D,T382,S382)","v":"39;3;0;1;0;201;"}]
[null,null,null,null,null,null,null,null,null,null,null,null,null,null,null,null,null,382,2,39,null,{"$f":"INDEX(LSTstart2D,T383,S383)","v":"39;3;0;2;0;202;"}]
[null,null,null,null,null,null,null,null,null,null,null,null,null,null,null,null,null,383,3,39,null,{"$f":"INDEX(LSTstart2D,T384,S384)","v":"39;3;0;3;0;203;"}]
[null,null,null,null,null,null,null,null,null,null,null,null,null,null,null,null,null,384,4,39,null,{"$f":"INDEX(LSTstart2D,T385,S385)","v":"39;3;0;4;0;204;"}]
[null,null,null,null,null,null,null,null,null,null,null,null,null,null,null,null,null,385,5,39,null,{"$f":"INDEX(LSTstart2D,T386,S386)","v":"39;3;0;5;0;205;"}]
[null,null,null,null,null,null,null,null,null,null,null,null,null,null,null,null,null,386,{"$f":"MOD(R387-1,10)+1","v":6},{"$f":"INT((R387-1)/10)+1","v":39},null,{"$f":"INDEX(LSTstart2D,T387,S387)","v":"39;3;0;6;0;206;"}]
[null,null,null,null,null,null,null,null,null,null,null,null,null,null,null,null,null,{"$f":"R387+1","v":387},7,39,null,{"$f":"INDEX(LSTstart2D,T388,S388)","v":""}]
[null,null,null,null,null,null,null,null,null,null,null,null,null,null,null,null,null,388,8,39,null,{"$f":"INDEX(LSTstart2D,T389,S389)","v":""}]
[null,null,null,null,null,null,null,null,null,null,null,null,null,null,null,null,null,389,9,39,null,{"$f":"INDEX(LSTstart2D,T390,S390)","v":""}]
[null,null,null,null,null,null,null,null,null,null,null,null,null,null,null,null,null,390,10,39,null,{"$f":"INDEX(LSTstart2D,T391,S391)","v":""}]
[null,null,null,null,null,null,null,null,null,null,null,null,null,null,null,null,null,391,1,40,null,{"$f":"INDEX(LSTstart2D,T392,S392)","v":"40;3;0;1;0;101;"}]
[null,null,null,null,null,null,null,null,null,null,null,null,null,null,null,null,null,392,2,40,null,{"$f":"INDEX(LSTstart2D,T393,S393)","v":"40;3;0;2;0;102;"}]
[null,null,null,null,null,null,null,null,null,null,null,null,null,null,null,null,null,393,3,40,null,{"$f":"INDEX(LSTstart2D,T394,S394)","v":"40;3;0;3;0;103;"}]
[null,null,null,null,null,null,null,null,null,null,null,null,null,null,null,null,null,394,4,40,null,{"$f":"INDEX(LSTstart2D,T395,S395)","v":"40;3;0;4;0;104;"}]
[null,null,null,null,null,null,null,null,null,null,null,null,null,null,null,null,null,395,5,40,null,{"$f":"INDEX(LSTstart2D,T396,S396)","v":"40;3;0;5;0;105;"}]
[null,null,null,null,null,null,null,null,null,null,null,null,null,null,null,null,null,396,6,40,null,{"$f":"INDEX(LSTstart2D,T397,S397)","v":"40;3;0;6;0;106;"}]
[null,null,null,null,null,null,null,null,null,null,null,null,null,null,null,null,null,397,7,40,null,{"$f":"INDEX(LSTstart2D,T398,S398)","v":""}]
[null,null,null,null,null,null,null,null,null,null,null,null,null,null,null,null,null,398,8,40,null,{"$f":"INDEX(LSTstart2D,T399,S399)","v":""}]
[null,null,null,null,null,null,null,null,null,null,null,null,null,null,null,null,null,399,9,40,null,{"$f":"INDEX(LSTstart2D,T400,S400)","v":""}]
[null,null,null,null,null,null,null,null,null,null,null,null,null,null,null,null,null,400,10,40,null,{"$f":"INDEX(LSTstart2D,T401,S401)","v":""}]
[null,null,null,null,null,null,null,null,null,null,null,null,null,null,null,null,null,401,1,41,null,{"$f":"INDEX(LSTstart2D,T402,S402)","v":"41;3;0;1;0;201;"}]
[null,null,null,null,null,null,null,null,null,null,null,null,null,null,null,null,null,402,2,41,null,{"$f":"INDEX(LSTstart2D,T403,S403)","v":"41;3;0;2;0;202;"}]
[null,null,null,null,null,null,null,null,null,null,null,null,null,null,null,null,null,403,3,41,null,{"$f":"INDEX(LSTstart2D,T404,S404)","v":"41;3;0;3;0;203;"}]
[null,null,null,null,null,null,null,null,null,null,null,null,null,null,null,null,null,404,4,41,null,{"$f":"INDEX(LSTstart2D,T405,S405)","v":"41;3;0;4;0;204;"}]
[null,null,null,null,null,null,null,null,null,null,null,null,null,null,null,null,null,405,5,41,null,{"$f":"INDEX(LSTstart2D,T406,S406)","v":"41;3;0;5;0;205;"}]
[null,null,null,null,null,null,null,null,null,null,null,null,null,null,null,null,null,406,6,41,null,{"$f":"INDEX(LSTstart2D,T407,S407)","v":"41;3;0;6;0;206;"}]
[null,null,null,null,null,null,null,null,null,null,null,null,null,null,null,null,null,407,7,41,null,{"$f":"INDEX(LSTstart2D,T408,S408)","v":""}]
[null,null,null,null,null,null,null,null,null,null,null,null,null,null,null,null,null,408,8,41,null,{"$f":"INDEX(LSTstart2D,T409,S409)","v":""}]
[null,null,null,null,null,null,null,null,null,null,null,null,null,null,null,null,null,409,9,41,null,{"$f":"INDEX(LSTstart2D,T410,S410)","v":""}]
[null,null,null,null,null,null,null,null,null,null,null,null,null,null,null,null,null,410,10,41,null,{"$f":"INDEX(LSTstart2D,T411,S411)","v":""}]
[null,null,null,null,null,null,null,null,null,null,null,null,null,null,null,null,null,411,1,42,null,{"$f":"INDEX(LSTstart2D,T412,S412)","v":"42;3;0;1;0;101;"}]
[null,null,null,null,null,null,null,null,null,null,null,null,null,null,null,null,null,412,2,42,null,{"$f":"INDEX(LSTstart2D,T413,S413)","v":"42;3;0;2;0;102;"}]
[null,null,null,null,null,null,null,null,null,null,null,null,null,null,null,null,null,413,3,42,null,{"$f":"INDEX(LSTstart2D,T414,S414)","v":"42;3;0;3;0;103;"}]
[null,null,null,null,null,null,null,null,null,null,null,null,null,null,null,null,null,414,4,42,null,{"$f":"INDEX(LSTstart2D,T415,S415)","v":"42;3;0;4;0;104;"}]
[null,null,null,null,null,null,null,null,null,null,null,null,null,null,null,null,null,415,5,42,null,{"$f":"INDEX(LSTstart2D,T416,S416)","v":"42;3;0;5;0;105;"}]
[null,null,null,null,null,null,null,null,null,null,null,null,null,null,null,null,null,416,6,42,null,{"$f":"INDEX(LSTstart2D,T417,S417)","v":"42;3;0;6;0;106;"}]
[null,null,null,null,null,null,null,null,null,null,null,null,null,null,null,null,null,417,7,42,null,{"$f":"INDEX(LSTstart2D,T418,S418)","v":""}]
[null,null,null,null,null,null,null,null,null,null,null,null,null,null,null,null,null,418,8,42,null,{"$f":"INDEX(LSTstart2D,T419,S419)","v":""}]
[null,null,null,null,null,null,null,null,null,null,null,null,null,null,null,null,null,419,9,42,null,{"$f":"INDEX(LSTstart2D,T420,S420)","v":""}]
[null,null,null,null,null,null,null,null,null,null,null,null,null,null,null,null,null,420,10,42,null,{"$f":"INDEX(LSTstart2D,T421,S421)","v":""}]
[null,null,null,null,null,null,null,null,null,null,null,null,null,null,null,null,null,421,1,43,null,{"$f":"INDEX(LSTstart2D,T422,S422)","v":"43;3;0;1;0;201;"}]
[null,null,null,null,null,null,null,null,null,null,null,null,null,null,null,null,null,422,2,43,null,{"$f":"INDEX(LSTstart2D,T423,S423)","v":"43;3;0;2;0;202;"}]
[null,null,null,null,null,null,null,null,null,null,null,null,null,null,null,null,null,423,3,43,null,{"$f":"INDEX(LSTstart2D,T424,S424)","v":"43;3;0;3;0;203;"}]
[null,null,null,null,null,null,null,null,null,null,null,null,null,null,null,null,null,424,4,43,null,{"$f":"INDEX(LSTstart2D,T425,S425)","v":"43;3;0;4;0;204;"}]
[null,null,null,null,null,null,null,null,null,null,null,null,null,null,null,null,null,425,5,43,null,{"$f":"INDEX(LSTstart2D,T426,S426)","v":"43;3;0;5;0;205;"}]
[null,null,null,null,null,null,null,null,null,null,null,null,null,null,null,null,null,426,6,43,null,{"$f":"INDEX(LSTstart2D,T427,S427)","v":"43;3;0;6;0;206;"}]
[null,null,null,null,null,null,null,null,null,null,null,null,null,null,null,null,null,427,7,43,null,{"$f":"INDEX(LSTstart2D,T428,S428)","v":""}]
[null,null,null,null,null,null,null,null,null,null,null,null,null,null,null,null,null,428,8,43,null,{"$f":"INDEX(LSTstart2D,T429,S429)","v":""}]
[null,null,null,null,null,null,null,null,null,null,null,null,null,null,null,null,null,429,9,43,null,{"$f":"INDEX(LSTstart2D,T430,S430)","v":""}]
[null,null,null,null,null,null,null,null,null,null,null,null,null,null,null,null,null,430,10,43,null,{"$f":"INDEX(LSTstart2D,T431,S431)","v":""}]
[null,null,null,null,null,null,null,null,null,null,null,null,null,null,null,null,null,431,1,44,null,{"$f":"INDEX(LSTstart2D,T432,S432)","v":"44;3;0;1;0;101;"}]
[null,null,null,null,null,null,null,null,null,null,null,null,null,null,null,null,null,432,2,44,null,{"$f":"INDEX(LSTstart2D,T433,S433)","v":"44;3;0;2;0;102;"}]
[null,null,null,null,null,null,null,null,null,null,null,null,null,null,null,null,null,433,3,44,null,{"$f":"INDEX(LSTstart2D,T434,S434)","v":"44;3;0;3;0;103;"}]
[null,null,null,null,null,null,null,null,null,null,null,null,null,null,null,null,null,434,4,44,null,{"$f":"INDEX(LSTstart2D,T435,S435)","v":"44;3;0;4;0;104;"}]
[null,null,null,null,null,null,null,null,null,null,null,null,null,null,null,null,null,435,5,44,null,{"$f":"INDEX(LSTstart2D,T436,S436)","v":"44;3;0;5;0;105;"}]
[null,null,null,null,null,null,null,null,null,null,null,null,null,null,null,null,null,436,6,44,null,{"$f":"INDEX(LSTstart2D,T437,S437)","v":"44;3;0;6;0;106;"}]
[null,null,null,null,null,null,null,null,null,null,null,null,null,null,null,null,null,437,7,44,null,{"$f":"INDEX(LSTstart2D,T438,S438)","v":""}]
[null,null,null,null,null,null,null,null,null,null,null,null,null,null,null,null,null,438,8,44,null,{"$f":"INDEX(LSTstart2D,T439,S439)","v":""}]
[null,null,null,null,null,null,null,null,null,null,null,null,null,null,null,null,null,439,9,44,null,{"$f":"INDEX(LSTstart2D,T440,S440)","v":""}]
[null,null,null,null,null,null,null,null,null,null,null,null,null,null,null,null,null,440,10,44,null,{"$f":"INDEX(LSTstart2D,T441,S441)","v":""}]
[null,null,null,null,null,null,null,null,null,null,null,null,null,null,null,null,null,441,1,45,null,{"$f":"INDEX(LSTstart2D,T442,S442)","v":"45;3;0;1;0;201;"}]
[null,null,null,null,null,null,null,null,null,null,null,null,null,null,null,null,null,442,2,45,null,{"$f":"INDEX(LSTstart2D,T443,S443)","v":"45;3;0;2;0;202;"}]
[null,null,null,null,null,null,null,null,null,null,null,null,null,null,null,null,null,443,3,45,null,{"$f":"INDEX(LSTstart2D,T444,S444)","v":"45;3;0;3;0;203;"}]
[null,null,null,null,null,null,null,null,null,null,null,null,null,null,null,null,null,444,4,45,null,{"$f":"INDEX(LSTstart2D,T445,S445)","v":"45;3;0;4;0;204;"}]
[null,null,null,null,null,null,null,null,null,null,null,null,null,null,null,null,null,445,5,45,null,{"$f":"INDEX(LSTstart2D,T446,S446)","v":"45;3;0;5;0;205;"}]
[null,null,null,null,null,null,null,null,null,null,null,null,null,null,null,null,null,446,6,45,null,{"$f":"INDEX(LSTstart2D,T447,S447)","v":"45;3;0;6;0;206;"}]
[null,null,null,null,null,null,null,null,null,null,null,null,null,null,null,null,null,447,7,45,null,{"$f":"INDEX(LSTstart2D,T448,S448)","v":""}]
[null,null,null,null,null,null,null,null,null,null,null,null,null,null,null,null,null,448,8,45,null,{"$f":"INDEX(LSTstart2D,T449,S449)","v":""}]
[null,null,null,null,null,null,null,null,null,null,null,null,null,null,null,null,null,449,9,45,null,{"$f":"INDEX(LSTstart2D,T450,S450)","v":""}]
[null,null,null,null,null,null,null,null,null,null,null,null,null,null,null,null,null,450,{"$f":"MOD(R451-1,10)+1","v":10},{"$f":"INT((R451-1)/10)+1","v":45},null,{"$f":"INDEX(LSTstart2D,T451,S451)","v":""}]
[null,null,null,null,null,null,null,null,null,null,null,null,null,null,null,null,null,{"$f":"R451+1","v":451},1,46,null,{"$f":"INDEX(LSTstart2D,T452,S452)","v":"46;3;0;1;0;101;"}]
[null,null,null,null,null,null,null,null,null,null,null,null,null,null,null,null,null,452,2,46,null,{"$f":"INDEX(LSTstart2D,T453,S453)","v":"46;3;0;2;0;102;"}]
[null,null,null,null,null,null,null,null,null,null,null,null,null,null,null,null,null,453,3,46,null,{"$f":"INDEX(LSTstart2D,T454,S454)","v":"46;3;0;3;0;103;"}]
[null,null,null,null,null,null,null,null,null,null,null,null,null,null,null,null,null,454,4,46,null,{"$f":"INDEX(LSTstart2D,T455,S455)","v":"46;3;0;4;0;104;"}]
[null,null,null,null,null,null,null,null,null,null,null,null,null,null,null,null,null,455,5,46,null,{"$f":"INDEX(LSTstart2D,T456,S456)","v":"46;3;0;5;0;105;"}]
[null,null,null,null,null,null,null,null,null,null,null,null,null,null,null,null,null,456,6,46,null,{"$f":"INDEX(LSTstart2D,T457,S457)","v":"46;3;0;6;0;106;"}]
[null,null,null,null,null,null,null,null,null,null,null,null,null,null,null,null,null,457,7,46,null,{"$f":"INDEX(LSTstart2D,T458,S458)","v":""}]
[null,null,null,null,null,null,null,null,null,null,null,null,null,null,null,null,null,458,8,46,null,{"$f":"INDEX(LSTstart2D,T459,S459)","v":""}]
[null,null,null,null,null,null,null,null,null,null,null,null,null,null,null,null,null,459,9,46,null,{"$f":"INDEX(LSTstart2D,T460,S460)","v":""}]
[null,null,null,null,null,null,null,null,null,null,null,null,null,null,null,null,null,460,10,46,null,{"$f":"INDEX(LSTstart2D,T461,S461)","v":""}]
[null,null,null,null,null,null,null,null,null,null,null,null,null,null,null,null,null,461,1,47,null,{"$f":"INDEX(LSTstart2D,T462,S462)","v":"47;3;0;1;0;201;"}]
[null,null,null,null,null,null,null,null,null,null,null,null,null,null,null,null,null,462,2,47,null,{"$f":"INDEX(LSTstart2D,T463,S463)","v":"47;3;0;2;0;202;"}]
[null,null,null,null,null,null,null,null,null,null,null,null,null,null,null,null,null,463,3,47,null,{"$f":"INDEX(LSTstart2D,T464,S464)","v":"47;3;0;3;0;203;"}]
[null,null,null,null,null,null,null,null,null,null,null,null,null,null,null,null,null,464,4,47,null,{"$f":"INDEX(LSTstart2D,T465,S465)","v":"47;3;0;4;0;204;"}]
[null,null,null,null,null,null,null,null,null,null,null,null,null,null,null,null,null,465,5,47,null,{"$f":"INDEX(LSTstart2D,T466,S466)","v":"47;3;0;5;0;205;"}]
[null,null,null,null,null,null,null,null,null,null,null,null,null,null,null,null,null,466,6,47,null,{"$f":"INDEX(LSTstart2D,T467,S467)","v":"47;3;0;6;0;206;"}]
[null,null,null,null,null,null,null,null,null,null,null,null,null,null,null,null,null,467,7,47,null,{"$f":"INDEX(LSTstart2D,T468,S468)","v":""}]
[null,null,null,null,null,null,null,null,null,null,null,null,null,null,null,null,null,468,8,47,null,{"$f":"INDEX(LSTstart2D,T469,S469)","v":""}]
[null,null,null,null,null,null,null,null,null,null,null,null,null,null,null,null,null,469,9,47,null,{"$f":"INDEX(LSTstart2D,T470,S470)","v":""}]
[null,null,null,null,null,null,null,null,null,null,null,null,null,null,null,null,null,470,10,47,null,{"$f":"INDEX(LSTstart2D,T471,S471)","v":""}]
[null,null,null,null,null,null,null,null,null,null,null,null,null,null,null,null,null,471,1,48,null,{"$f":"INDEX(LSTstart2D,T472,S472)","v":"48;3;0;1;0;101;"}]
[null,null,null,null,null,null,null,null,null,null,null,null,null,null,null,null,null,472,2,48,null,{"$f":"INDEX(LSTstart2D,T473,S473)","v":"48;3;0;2;0;102;"}]
[null,null,null,null,null,null,null,null,null,null,null,null,null,null,null,null,null,473,3,48,null,{"$f":"INDEX(LSTstart2D,T474,S474)","v":"48;3;0;3;0;103;"}]
[null,null,null,null,null,null,null,null,null,null,null,null,null,null,null,null,null,474,4,48,null,{"$f":"INDEX(LSTstart2D,T475,S475)","v":"48;3;0;4;0;104;"}]
[null,null,null,null,null,null,null,null,null,null,null,null,null,null,null,null,null,475,5,48,null,{"$f":"INDEX(LSTstart2D,T476,S476)","v":"48;3;0;5;0;105;"}]
[null,null,null,null,null,null,null,null,null,null,null,null,null,null,null,null,null,476,6,48,null,{"$f":"INDEX(LSTstart2D,T477,S477)","v":"48;3;0;6;0;106;"}]
[null,null,null,null,null,null,null,null,null,null,null,null,null,null,null,null,null,477,7,48,null,{"$f":"INDEX(LSTstart2D,T478,S478)","v":""}]
[null,null,null,null,null,null,null,null,null,null,null,null,null,null,null,null,null,478,8,48,null,{"$f":"INDEX(LSTstart2D,T479,S479)","v":""}]
[null,null,null,null,null,null,null,null,null,null,null,null,null,null,null,null,null,479,9,48,null,{"$f":"INDEX(LSTstart2D,T480,S480)","v":""}]
[null,null,null,null,null,null,null,null,null,null,null,null,null,null,null,null,null,480,10,48,null,{"$f":"INDEX(LSTstart2D,T481,S481)","v":""}]
[null,null,null,null,null,null,null,null,null,null,null,null,null,null,null,null,null,481,1,49,null,{"$f":"INDEX(LSTstart2D,T482,S482)","v":"49;3;0;1;0;201;"}]
[null,null,null,null,null,null,null,null,null,null,null,null,null,null,null,null,null,482,2,49,null,{"$f":"INDEX(LSTstart2D,T483,S483)","v":"49;3;0;2;0;202;"}]
[null,null,null,null,null,null,null,null,null,null,null,null,null,null,null,null,null,483,3,49,null,{"$f":"INDEX(LSTstart2D,T484,S484)","v":"49;3;0;3;0;203;"}]
[null,null,null,null,null,null,null,null,null,null,null,null,null,null,null,null,null,484,4,49,null,{"$f":"INDEX(LSTstart2D,T485,S485)","v":"49;3;0;4;0;204;"}]
[null,null,null,null,null,null,null,null,null,null,null,null,null,null,null,null,null,485,5,49,null,{"$f":"INDEX(LSTstart2D,T486,S486)","v":"49;3;0;5;0;205;"}]
[null,null,null,null,null,null,null,null,null,null,null,null,null,null,null,null,null,486,6,49,null,{"$f":"INDEX(LSTstart2D,T487,S487)","v":"49;3;0;6;0;206;"}]
[null,null,null,null,null,null,null,null,null,null,null,null,null,null,null,null,null,487,7,49,null,{"$f":"INDEX(LSTstart2D,T488,S488)","v":""}]
[null,null,null,null,null,null,null,null,null,null,null,null,null,null,null,null,null,488,8,49,null,{"$f":"INDEX(LSTstart2D,T489,S489)","v":""}]
[null,null,null,null,null,null,null,null,null,null,null,null,null,null,null,null,null,489,9,49,null,{"$f":"INDEX(LSTstart2D,T490,S490)","v":""}]
[null,null,null,null,null,null,null,null,null,null,null,null,null,null,null,null,null,490,10,49,null,{"$f":"INDEX(LSTstart2D,T491,S491)","v":""}]
[null,null,null,null,null,null,null,null,null,null,null,null,null,null,null,null,null,491,1,50,null,{"$f":"INDEX(LSTstart2D,T492,S492)","v":"50;3;0;1;0;101;"}]
[null,null,null,null,null,null,null,null,null,null,null,null,null,null,null,null,null,492,2,50,null,{"$f":"INDEX(LSTstart2D,T493,S493)","v":"50;3;0;2;0;102;"}]
[null,null,null,null,null,null,null,null,null,null,null,null,null,null,null,null,null,493,3,50,null,{"$f":"INDEX(LSTstart2D,T494,S494)","v":"50;3;0;3;0;103;"}]
[null,null,null,null,null,null,null,null,null,null,null,null,null,null,null,null,null,494,4,50,null,{"$f":"INDEX(LSTstart2D,T495,S495)","v":"50;3;0;4;0;104;"}]
[null,null,null,null,null,null,null,null,null,null,null,null,null,null,null,null,null,495,5,50,null,{"$f":"INDEX(LSTstart2D,T496,S496)","v":"50;3;0;5;0;105;"}]
[null,null,null,null,null,null,null,null,null,null,null,null,null,null,null,null,null,496,6,50,null,{"$f":"INDEX(LSTstart2D,T497,S497)","v":"50;3;0;6;0;106;"}]
[null,null,null,null,null,null,null,null,null,null,null,null,null,null,null,null,null,497,7,50,null,{"$f":"INDEX(LSTstart2D,T498,S498)","v":""}]
[null,null,null,null,null,null,null,null,null,null,null,null,null,null,null,null,null,498,8,50,null,{"$f":"INDEX(LSTstart2D,T499,S499)","v":""}]
[null,null,null,null,null,null,null,null,null,null,null,null,null,null,null,null,null,499,9,50,null,{"$f":"INDEX(LSTstart2D,T500,S500)","v":""}]
[null,null,null,null,null,null,null,null,null,null,null,null,null,null,null,null,null,500,10,50,null,{"$f":"INDEX(LSTstart2D,T501,S501)","v":""}]
[null,null,null,null,null,null,null,null,null,null,null,null,null,null,null,null,null,501,{"$f":"MOD(R502-1,10)+1","v":1},{"$f":"INT((R502-1)/10)+1","v":51},null,{"$f":"INDEX(LSTstart2D,T502,S502)","v":"51;3;0;1;0;501;"}]
[null,null,null,null,null,null,null,null,null,null,null,null,null,null,null,null,null,502,2,51,null,{"$f":"INDEX(LSTstart2D,T503,S503)","v":"51;3;0;2;0;502;"}]
[null,null,null,null,null,null,null,null,null,null,null,null,null,null,null,null,null,503,3,51,null,{"$f":"INDEX(LSTstart2D,T504,S504)","v":"51;3;0;3;0;503;"}]
[null,null,null,null,null,null,null,null,null,null,null,null,null,null,null,null,null,504,4,51,null,{"$f":"INDEX(LSTstart2D,T505,S505)","v":"51;3;0;4;0;504;"}]
[null,null,null,null,null,null,null,null,null,null,null,null,null,null,null,null,null,505,5,51,null,{"$f":"INDEX(LSTstart2D,T506,S506)","v":"51;3;0;5;0;505;"}]
[null,null,null,null,null,null,null,null,null,null,null,null,null,null,null,null,null,506,6,51,null,{"$f":"INDEX(LSTstart2D,T507,S507)","v":"51;3;0;6;0;506;"}]
[null,null,null,null,null,null,null,null,null,null,null,null,null,null,null,null,null,507,7,51,null,{"$f":"INDEX(LSTstart2D,T508,S508)","v":""}]
[null,null,null,null,null,null,null,null,null,null,null,null,null,null,null,null,null,508,8,51,null,{"$f":"INDEX(LSTstart2D,T509,S509)","v":""}]
[null,null,null,null,null,null,null,null,null,null,null,null,null,null,null,null,null,509,9,51,null,{"$f":"INDEX(LSTstart2D,T510,S510)","v":""}]
[null,null,null,null,null,null,null,null,null,null,null,null,null,null,null,null,null,510,10,51,null,{"$f":"INDEX(LSTstart2D,T511,S511)","v":""}]