{"text_format":"1","workbook":"xlsx","n_sheets":9,"sheets":["READ ME","LSTLONG.txt","LSTSTYLE.txt","LSTCAT.txt","LSTROUND.txt","LSTCONC.txt","LSTRACE.txt","LSTTITPR.txt","LSTSTART.TXT"],"not_rendered":{"charts":0,"images":0,"macros":1,"external_links":1,"defined_names":24,"comments":0,"pivot_tables":0},"unopened":[],"bounds":{"document_bytes":16777216,"sheet_cells":100000,"rows_first":2000,"rows_last":500,"rows_between":2000,"halvings":0,"cell_chars":16384,"cell_head_chars":4096},"cells_cut":0,"cells_raw":0,"read":"whole","date_system":"1900"}

{"sheet":"READ ME","index":0,"n_rows":38,"n_cols":4,"rows_kept":38,"cut":false,"hidden":false,"merged":[]}
["Read Me"]
["Quick and dirty spreadsheet used to make all the files for Ares21 for a National Arena League swim meet."]
["Adjust the green boxes below and then hit the 'Save Ares21 files' button"]
[]
["Date of Gala","2021-10-09","DD:MM:YYYY"]
["Start time of first race","18:30:00","HH:MM:SS"]
["Average time to swim 25m","00:00:20","HH:MM:SS","This is used to roughly calculate the duration of each event to give the start of the next one"]
["Inter race interval","00:00:30","HH:MM:SS","This is used to roughly calculate the duration of each event to give the start of the next one"]
["Name of Referee","A Referee"]
[]
["Enter team names and abbreviations in the green boxes "]
["Make sure the 'team name' is empty for unused lanes"]
["Lane numbers can be changed to 0-9 or 1-10 if needed"]
["Lane","Team Name","Team Abbreviation"]
[1,"Team in Lane 1","L 1"]
{"$rows_left_out":24}
{"sheet":"LSTLONG.txt","index":1,"n_rows":15,"n_cols":7,"rows_kept":15,"cut":false,"hidden":false,"merged":[]}
["idLength","Longueur","Mlongueur","Relais",null,null,{"$f":"\"\"\"\"&A1&\"\"\";\"\"\"&B1&\"\"\";\"\"\"&C1&\"\"\";\"\"\"&D1&\"\"\"\"","v":"\"idLength\";\"Longueur\";\"Mlongueur\";\"Relais\""}]
[0,"25m",25,1,null,null,{"$f":"A2&\";\"\"\"&B2&\"\"\";\"&C2&\";\"&D2","v":"0;\"25m\";25;1"}]
[1,"50m",50,1,null,null,{"$f":"A3&\";\"\"\"&B3&\"\"\";\"&C3&\";\"&D3","v":"1;\"50m\";50;1"}]
[2,"100m",100,1,null,null,"2;\"100m\";100;1"]
[3,"200m",200,1,null,null,"3;\"200m\";200;1"]
[4,"400m",400,1,null,null,"4;\"400m\";400;1"]
[5,"800m",800,1,null,null,"5;\"800m\";800;1"]
[6,"1500m",1500,1,null,null,"6;\"1500m\";1500;1"]
[7,"4x25m",100,4,null,null,"7;\"4x25m\";100;4"]
[8,"4x50m",200,4,null,null,"8;\"4x50m\";200;4"]
[9,"4x100m",400,4,null,null,"9;\"4x100m\";400;4"]
[10,"4x200m",800,4,null,null,"10;\"4x200m\";800;4"]
[11,"8x25m",200,8,null,null,"11;\"8x25m\";200;8"]
[12,"6x50m",300,6,null,null,"12;\"6x50m\";300;6"]
[13,"8x50m",400,8,null,null,"13;\"8x50m\";400;8"]
{"$rows_left_out":1}
{"sheet":"LSTSTYLE.txt","index":2,"n_rows":6,"n_cols":6,"rows_kept":6,"cut":false,"hidden":false,"merged":[]}
["idStyle","Style","StyleAbr",null,null,{"$f":"A1&\";\"&B1&\";\"&C1","v":"idStyle;Style;StyleAbr"}]
[0,"Freestyle","FR",null,null,{"$f":"A2&\";\"\"\"&B2&\"\"\";\"\"\"&C2&\"\"\"\"","v":"0;\"Freestyle\";\"FR\""}]
[1,"Backstroke","BA",null,null,{"$f":"A3&\";\"\"\"&B3&\"\"\";\"\"\"&C3&\"\"\"\"","v":"1;\"Backstroke\";\"BA\""}]
[2,"Breaststroke","BR",null,null,"2;\"Breaststroke\";\"BR\""]
[3,"Butterfly","BU",null,null,"3;\"Butterfly\";\"BU\""]
[4,"Medley","ME",null,null,"4;\"Medley\";\"ME\""]

{"sheet":"LSTCAT.txt","index":3,"n_rows":9,"n_cols":6,"rows_kept":9,"cut":false,"hidden":false,"merged":[]}
["Category","AbrevCat","Catoffset",null,null,{"$f":"\"\"\"\"&A1&\"\"\";\"\"\"&B1&\"\"\"\"","v":"\"Category\";\"AbrevCat\""}]
["Male/Open","M",100,null,null,{"$f":"\"\"\"\"&A2&\"\"\";\"\"\"&B2&\"\"\"\"","v":"\"Male/Open\";\"M\""}]
["Female","F",200,null,null,"\"Female\";\"F\""]
["Boys","B",300,null,null,"\"Boys\";\"B\""]
["Girls","G",400,null,null,"\"Girls\";\"G\""]
["Mixed","X",500,null,null,"\"Mixed\";\"X\""]
[]
[]
[null,null,"Catoffset is added to the lane number to make unique IDs for each team/gender combination in LSTCONC.txt"]

{"sheet":"LSTROUND.txt","index":4,"n_rows":9,"n_cols":7,"rows_kept":9,"cut":false,"hidden":false,"merged":[]}
["idRound","TITLE","RoundAbrev","roundtext"," sequence",null,{"$f":"A1&\";\"&B1&\";\"&C1&\";\"&D1&\";\"&E1","v":"idRound;TITLE;RoundAbrev;roundtext; sequence"}]
[0,"Qualif.","H","Heat","1  2  3  4  5  6  7  8  9  10 11 12 13 14 15 16 17 18 19 20 21 22 23 24 25 26 27 28 29 30 31 32 33 34 35 36 37 38 39 40 41 42 43 44 45 46 47 48 49 50 51 52 53 54 55 56 57 58 59 60 61 62 63 64 65 66 67 68 69 70 71 72 73 74 75 76 77 78 79 80 81 82 83 84 85 86 87 88 89 90 91 92 93 94 95 96 97 98 99",null,{"$f":"A2&\";\"\"\"&B2&\"\"\";\"\"\"&C2&\"\"\";\"\"\"&D2&\"\"\";\"\"\"&E2&\"\"\"\"","v":"0;\"Qualif.\";\"H\";\"Heat\";\"1  2  3  4  5  6  7  8  9  10 11 12 13 14 15 16 17 18 19 20 21 22 23 24 25 26 27 28 29 30 31 32 33 34 35 36 37 38 39 40 41 42 43 44 45 46 47 48 49 50 51 52 53 54 55 56 57 58 59 60 61 62 63 64 65 66 67 68 69 70 71 72 73 74 75 76 77 78 79 80 81 82 83 84 85 86 87 88 89 90 91 92 93 94 95 96 97 98 99\""}]
[1,"SwimmOff","SOff","SOff","1  2  3  4  5  6  7  8  9  10 11 12 13 14 15 16 17 18 19 20",null,{"$f":"A3&\";\"\"\"&B3&\"\"\";\"\"\"&C3&\"\"\";\"\"\"&D3&\"\"\";\"\"\"&E3&\"\"\"\"","v":"1;\"SwimmOff\";\"SOff\";\"SOff\";\"1  2  3  4  5  6  7  8  9  10 11 12 13 14 15 16 17 18 19 20\""}]
[2,"Semi-finals ","SFI ","S-Final","1  2",null,"2;\"Semi-finals \";\"SFI \";\"S-Final\";\"1  2\""]
[3,"Finals ","FI ","Final","A  B",null,"3;\"Finals \";\"FI \";\"Final\";\"A  B\""]
[4,"TESTS","TE","Test","1  2  3  4  5  6  7  8  9  10 11 12 13 14 15 16 17 18 19 20",null,"4;\"TESTS\";\"TE\";\"Test\";\"1  2  3  4  5  6  7  8  9  10 11 12 13 14 15 16 17 18 19 20\""]
[5,"Consolation","CO","Consol","1 2 3 4 5 6 7 8 9 10 ",null,"5;\"Consolation\";\"CO\";\"Consol\";\"1 2 3 4 5 6 7 8 9 10 \""]
[6,"Bonus Final","BF","B-Final","A  B ",null,"6;\"Bonus Final\";\"BF\";\"B-Final\";\"A  B \""]
[7,"Timed Final","TF","T-Final","1  2  3  4  5  6  7  8  9  10 11 12 13 14 15 16 17 18 19 20 21 22 23 24 25 26 27 28 29 30 31 32 33 34 35 36 37 38 39 40 41 42 43 44 45 46 47 48 49 50 51 52 53 54 55 56 57 58 59 60 61 62 63 64 65 66 67 68 69 70 71 72 73 74 75 76 77 78 79 80 81 82 83 84 85 86 87 88 89 90 91 92 93 94 95 96 97 98 99 ",null,"7;\"Timed Final\";\"TF\";\"T-Final\";\"1  2  3  4  5  6  7  8  9  10 11 12 13 14 15 16 17 18 19 20 21 22 23 24 25 26 27 28 29 30 31 32 33 34 35 36 37 38 39 40 41 42 43 44 45 46 47 48 49 50 51 52 53 54 55 56 57 58 59 60 61 62 63 64 65 66 67 68 69 70 71 72 73 74 75 76 77 78 79 80 81 82 83 84 85 86 87 88 89 90 91 92 93 94 95 96 97 98 99 \""]

{"sheet":"LSTCONC.txt","index":5,"n_rows":51,"n_cols":5,"rows_kept":51,"cut":false,"hidden":false,"merged":[]}
["Gender","ID",null,null,"id;bib;lastname;firstname;birthyear;abNat;abCat"]
["M",100,null,null,{"$f":"IF('READ ME'!B15<>\"\",'READ ME'!A15+B2 &\";\"\"\"&'READ ME'!A15+B2&\"\"\";\"\"\" &'READ ME'!B15& \"\"\";\"\"\"\";\"\"\"\";\"\"\"&'READ ME'!C15&\"\"\";\"\"\"&A2&\"\"\";\",\"\")","v":"101;\"101\";\"Team in Lane 1\";\"\";\"\";\"L 1\";\"M\";"}]
["M",100,null,null,{"$f":"IF('READ ME'!B16<>\"\",'READ ME'!A16+B3 &\";\"\"\"&'READ ME'!A16+B3&\"\"\";\"\"\" &'READ ME'!B16& \"\"\";\"\"\"\";\"\"\"\";\"\"\"&'READ ME'!C16&\"\"\";\"\"\"&A3&\"\"\";\",\"\")","v":"102;\"102\";\"Team in Lane 2\";\"\";\"\";\"L2\";\"M\";"}]
["M",100,null,null,{"$f":"IF('READ ME'!B17<>\"\",'READ ME'!A17+B4 &\";\"\"\"&'READ ME'!A17+B4&\"\"\";\"\"\" &'READ ME'!B17& \"\"\";\"\"\"\";\"\"\"\";\"\"\"&'READ ME'!C17&\"\"\";\"\"\"&A4&\"\"\";\",\"\")","v":"103;\"103\";\"Team in Lane 3\";\"\";\"\";\"L3\";\"M\";"}]
["M",100,null,null,{"$f":"IF('READ ME'!B18<>\"\",'READ ME'!A18+B5 &\";\"\"\"&'READ ME'!A18+B5&\"\"\";\"\"\" &'READ ME'!B18& \"\"\";\"\"\"\";\"\"\"\";\"\"\"&'READ ME'!C18&\"\"\";\"\"\"&A5&\"\"\";\",\"\")","v":"104;\"104\";\"Team in Lane 4\";\"\";\"\";\"L4\";\"M\";"}]
["M",100,null,null,{"$f":"IF('READ ME'!B19<>\"\",'READ ME'!A19+B6 &\";\"\"\"&'READ ME'!A19+B6&\"\"\";\"\"\" &'READ ME'!B19& \"\"\";\"\"\"\";\"\"\"\";\"\"\"&'READ ME'!C19&\"\"\";\"\"\"&A6&\"\"\";\",\"\")","v":"105;\"105\";\"Team in Lane 5\";\"\";\"\";\"L5\";\"M\";"}]
["M",100,null,null,{"$f":"IF('READ ME'!B20<>\"\",'READ ME'!A20+B7 &\";\"\"\"&'READ ME'!A20+B7&\"\"\";\"\"\" &'READ ME'!B20& \"\"\";\"\"\"\";\"\"\"\";\"\"\"&'READ ME'!C20&\"\"\";\"\"\"&A7&\"\"\";\",\"\")","v":"106;\"106\";\"Team in Lane 6\";\"\";\"\";\"L6\";\"M\";"}]
["M",100,null,null,{"$f":"IF('READ ME'!B21<>\"\",'READ ME'!A21+B8 &\";\"\"\"&'READ ME'!A21+B8&\"\"\";\"\"\" &'READ ME'!B21& \"\"\";\"\"\"\";\"\"\"\";\"\"\"&'READ ME'!C21&\"\"\";\"\"\"&A8&\"\"\";\",\"\")","v":""}]
["M",100,null,null,{"$f":"IF('READ ME'!B22<>\"\",'READ ME'!A22+B9 &\";\"\"\"&'READ ME'!A22+B9&\"\"\";\"\"\" &'READ ME'!B22& \"\"\";\"\"\"\";\"\"\"\";\"\"\"&'READ ME'!C22&\"\"\";\"\"\"&A9&\"\"\";\",\"\")","v":""}]
["M",100,null,null,{"$f":"IF('READ ME'!B23<>\"\",'READ ME'!A23+B10 &\";\"\"\"&'READ ME'!A23+B10&\"\"\";\"\"\" &'READ ME'!B23& \"\"\";\"\"\"\";\"\"\"\";\"\"\"&'READ ME'!C23&\"\"\";\"\"\"&A10&\"\"\";\",\"\")","v":""}]
["M",100,null,null,{"$f":"IF('READ ME'!B24<>\"\",'READ ME'!A24+B11 &\";\"\"\"&'READ ME'!A24+B11&\"\"\";\"\"\" &'READ ME'!B24& \"\"\";\"\"\"\";\"\"\"\";\"\"\"&'READ ME'!C24&\"\"\";\"\"\"&A11&\"\"\";\",\"\")","v":""}]
["F",200,null,null,{"$f":"IF('READ ME'!B15<>\"\",'READ ME'!A15+B12 &\";\"\"\"&'READ ME'!A15+B12&\"\"\";\"\"\" &'READ ME'!B15& \"\"\";\"\"\"\";\"\"\"\";\"\"\"&'READ ME'!C15&\"\"\";\"\"\"&A12&\"\"\";\",\"\")","v":"201;\"201\";\"Team in Lane 1\";\"\";\"\";\"L 1\";\"F\";"}]
["F",200,null,null,{"$f":"IF('READ ME'!B16<>\"\",'READ ME'!A16+B13 &\";\"\"\"&'READ ME'!A16+B13&\"\"\";\"\"\" &'READ ME'!B16& \"\"\";\"\"\"\";\"\"\"\";\"\"\"&'READ ME'!C16&\"\"\";\"\"\"&A13&\"\"\";\",\"\")","v":"202;\"202\";\"Team in Lane 2\";\"\";\"\";\"L2\";\"F\";"}]
["F",200,null,null,{"$f":"IF('READ ME'!B17<>\"\",'READ ME'!A17+B14 &\";\"\"\"&'READ ME'!A17+B14&\"\"\";\"\"\" &'READ ME'!B17& \"\"\";\"\"\"\";\"\"\"\";\"\"\"&'READ ME'!C17&\"\"\";\"\"\"&A14&\"\"\";\",\"\")","v":"203;\"203\";\"Team in Lane 3\";\"\";\"\";\"L3\";\"F\";"}]
["F",200,null,null,{"$f":"IF('READ ME'!B18<>\"\",'READ ME'!A18+B15 &\";\"\"\"&'READ ME'!A18+B15&\"\"\";\"\"\" &'READ ME'!B18& \"\"\";\"\"\"\";\"\"\"\";\"\"\"&'READ ME'!C18&\"\"\";\"\"\"&A15&\"\"\";\",\"\")","v":"204;\"204\";\"Team in Lane 4\";\"\";\"\";\"L4\";\"F\";"}]
{"$rows_left_out":37}
{"sheet":"LSTRACE.txt","index":6,"n_rows":52,"n_cols":13,"rows_kept":52,"cut":false,"hidden":false,"merged":[]}
["event","round","nbHeat","idLen","idStyle","abCat",null,"Date","Time","Race duration",null,null,{"$f":"A1&\";\"&B1&\";\"&C1&\";\"&D1&\";\"&E1&\";\"&F1&\";\"&H1&\";\"&I1","v":"event;round;nbHeat;idLen;idStyle;abCat;Date;Time"}]
[1,3,1,3,4,"F",null,{"$f":"'READ ME'!$B$5","v":"2021-10-09"},{"$f":"'READ ME'!B6","v":"18:30:00"},{"$f":"((INDEX(lstlong,MATCH(D2,lstlong_index,0),3))/25)*'READ ME'!$B$7+'READ ME'!$B$8","v":"00:03:10"},null,null,{"$f":"A2&\";\"&B2&\";\"&C2&\";\"&D2&\";\"&E2&\";\"\"\"&TRIM(F2)&\"\"\";\"\"\"&TEXT(H2,\"DD/MM/YY\")&\"\"\";\"\"\"&TEXT(I2,\"HH:MM\")&\"\"\"\"","v":"1;3;1;3;4;\"F\";\"09/10/21\";\"18:30\""}]
[2,3,1,3,4,"M ",null,{"$f":"'READ ME'!$B$5","v":"2021-10-09"},{"$f":"I2+J2","v":"18:33:10"},{"$f":"((INDEX(lstlong,MATCH(D3,lstlong_index,0),3))/25)*'READ ME'!$B$7+'READ ME'!$B$8","v":"00:03:10"},null,null,"2;3;1;3;4;\"M\";\"09/10/21\";\"18:33\""]
[3,3,1,8,0,"F",null,{"$f":"'READ ME'!$B$5","v":"2021-10-09"},{"$f":"I3+J3","v":"18:36:20"},{"$f":"((INDEX(lstlong,MATCH(D4,lstlong_index,0),3))/25)*'READ ME'!$B$7+'READ ME'!$B$8","v":"00:03:10"},null,null,"3;3;1;8;0;\"F\";\"09/10/21\";\"18:36\""]
[4,3,1,8,0,"M ",null,{"$f":"'READ ME'!$B$5","v":"2021-10-09"},"18:39:30",{"$f":"((INDEX(lstlong,MATCH(D5,lstlong_index,0),3))/25)*'READ ME'!$B$7+'READ ME'!$B$8","v":"00:03:10"},null,null,"4;3;1;8;0;\"M\";\"09/10/21\";\"18:39\""]
[5,3,1,8,4,"F",null,{"$f":"'READ ME'!$B$5","v":"2021-10-09"},"18:42:40",{"$f":"((INDEX(lstlong,MATCH(D6,lstlong_index,0),3))/25)*'READ ME'!$B$7+'READ ME'!$B$8","v":"00:03:10"},null,null,"5;3;1;8;4;\"F\";\"09/10/21\";\"18:42\""]
[6,3,1,8,4,"M ",null,{"$f":"'READ ME'!$B$5","v":"2021-10-09"},"18:45:50",{"$f":"((INDEX(lstlong,MATCH(D7,lstlong_index,0),3))/25)*'READ ME'!$B$7+'READ ME'!$B$8","v":"00:03:10"},null,null,"6;3;1;8;4;\"M\";\"09/10/21\";\"18:45\""]
[7,3,1,8,0,"F",null,{"$f":"'READ ME'!$B$5","v":"2021-10-09"},"18:49:00",{"$f":"((INDEX(lstlong,MATCH(D8,lstlong_index,0),3))/25)*'READ ME'!$B$7+'READ ME'!$B$8","v":"00:03:10"},null,null,"7;3;1;8;0;\"F\";\"09/10/21\";\"18:49\""]
[8,3,1,8,0,"M ",null,{"$f":"'READ ME'!$B$5","v":"2021-10-09"},"18:52:10",{"$f":"((INDEX(lstlong,MATCH(D9,lstlong_index,0),3))/25)*'READ ME'!$B$7+'READ ME'!$B$8","v":"00:03:10"},null,null,"8;3;1;8;0;\"M\";\"09/10/21\";\"18:52\""]
[9,3,1,8,4,"F",null,{"$f":"'READ ME'!$B$5","v":"2021-10-09"},"18:55:20",{"$f":"((INDEX(lstlong,MATCH(D10,lstlong_index,0),3))/25)*'READ ME'!$B$7+'READ ME'!$B$8","v":"00:03:10"},null,null,"9;3;1;8;4;\"F\";\"09/10/21\";\"18:55\""]
[10,3,1,8,4,"M ",null,{"$f":"'READ ME'!$B$5","v":"2021-10-09"},"18:58:30",{"$f":"((INDEX(lstlong,MATCH(D11,lstlong_index,0),3))/25)*'READ ME'!$B$7+'READ ME'!$B$8","v":"00:03:10"},null,null,"10;3;1;8;4;\"M\";\"09/10/21\";\"18:58\""]
[11,3,1,1,1,"F",null,{"$f":"'READ ME'!$B$5","v":"2021-10-09"},"19:01:40",{"$f":"((INDEX(lstlong,MATCH(D12,lstlong_index,0),3))/25)*'READ ME'!$B$7+'READ ME'!$B$8","v":"00:01:10"},null,null,"11;3;1;1;1;\"F\";\"09/10/21\";\"19:01\""]
[12,3,1,1,1,"M ",null,{"$f":"'READ ME'!$B$5","v":"2021-10-09"},"19:02:50",{"$f":"((INDEX(lstlong,MATCH(D13,lstlong_index,0),3))/25)*'READ ME'!$B$7+'READ ME'!$B$8","v":"00:01:10"},null,null,"12;3;1;1;1;\"M\";\"09/10/21\";\"19:02\""]
[13,3,1,2,2,"F",null,{"$f":"'READ ME'!$B$5","v":"2021-10-09"},"19:04:00",{"$f":"((INDEX(lstlong,MATCH(D14,lstlong_index,0),3))/25)*'READ ME'!$B$7+'READ ME'!$B$8","v":"00:01:50"},null,null,"13;3;1;2;2;\"F\";\"09/10/21\";\"19:04\""]
[14,3,1,2,2,"M ",null,{"$f":"'READ ME'!$B$5","v":"2021-10-09"},"19:05:50",{"$f":"((INDEX(lstlong,MATCH(D15,lstlong_index,0),3))/25)*'READ ME'!$B$7+'READ ME'!$B$8","v":"00:01:50"},null,null,"14;3;1;2;2;\"M\";\"09/10/21\";\"19:05\""]
{"$rows_left_out":38}
{"sheet":"LSTTITPR.txt","index":7,"n_rows":52,"n_cols":21,"rows_kept":52,"cut":false,"hidden":false,"merged":[]}
["Event",null,"Copied from NAL Programme",null,null,"Text","Title for scoreboard","Referee",null,null,null,"Looked up from other tabs",null,null,null,null,null,null,null,null,{"$f":"A1&\";\"&M1&\";\"&F1","v":"Event;;Text"}]
[1,null,"Female 16+ 200m Individual Medley","Open ",null,{"$f":"TRIM(P2)&\" \"&TRIM(D2)&\" \"&TRIM(Q2)&\" \"&TRIM(R2)","v":"Female Open 200m Medley"},{"$f":"F2","v":"Female Open 200m Medley"},{"$f":"'READ ME'!$B$9","v":"A Referee"},null,null,{"$f":"MATCH(A2,lstrace_index,0)","v":2},{"$f":"INDEX(lstrace,K2,2)","v":3},{"$f":"INDEX(lstrace,K2,6)","v":"F"},{"$f":"INDEX(lstrace,K2,5)","v":4},{"$f":"INDEX(lstrace,K2,4)","v":3},{"$f":"INDEX(lstcat,MATCH(TRIM(M2),lstcat_index,0),1)","v":"Female"},{"$f":"INDEX(lstlong,MATCH(O2,lstlong_index,0),2)","v":"200m"},{"$f":"INDEX(lststyle,MATCH(N2,lststyle_index,0),2)","v":"Medley"},null,null,{"$f":"A2&\";\"&L2&\";\"\"\"&F2&\"\"\";\"\"\"&G2&\"\"\";\"\"\"&H2&\"\"\"\"","v":"1;3;\"Female Open 200m Medley\";\"Female Open 200m Medley\";\"A Referee\""}]
[2,null,"Male/Open 16+ 200m Individual Medley","Open ",null,"Male/Open Open 200m Medley",{"$f":"F3","v":"Male/Open Open 200m Medley"},{"$f":"'READ ME'!$B$9","v":"A Referee"},null,null,3,3,"M ",4,3,"Male/Open",{"$f":"INDEX(lstlong,MATCH(O3,lstlong_index,0),2)","v":"200m"},{"$f":"INDEX(lststyle,MATCH(N3,lststyle_index,0),2)","v":"Medley"},null,null,"2;3;\"Male/Open Open 200m Medley\";\"Male/Open Open 200m Medley\";\"A Referee\""]
[3,null,"Female 9 - 11yrs. 4 x 50m Freestyle Relay","9-11 ",null,"Female 9-11 4x50m Freestyle","Female 9-11 4x50m Freestyle",{"$f":"'READ ME'!$B$9","v":"A Referee"},null,null,4,3,"F",0,8,"Female","4x50m","Freestyle",null,null,"3;3;\"Female 9-11 4x50m Freestyle\";\"Female 9-11 4x50m Freestyle\";\"A Referee\""]
[4,null,"Male/Open 9 - 11yrs. 4 x 50m Freestyle Relay","9-11 ",null,"Male/Open 9-11 4x50m Freestyle","Male/Open 9-11 4x50m Freestyle",{"$f":"'READ ME'!$B$9","v":"A Referee"},null,null,5,3,"M ",0,8,"Male/Open","4x50m","Freestyle",null,null,"4;3;\"Male/Open 9-11 4x50m Freestyle\";\"Male/Open 9-11 4x50m Freestyle\";\"A Referee\""]
[5,null,"Female 12-13 4 x 50m Medley Relay","13/U ",null,"Female 13/U 4x50m Medley","Female 13/U 4x50m Medley",{"$f":"'READ ME'!$B$9","v":"A Referee"},null,null,6,3,"F",4,8,"Female","4x50m","Medley",null,null,"5;3;\"Female 13/U 4x50m Medley\";\"Female 13/U 4x50m Medley\";\"A Referee\""]
[6,null,"Male/Open12-13 4 x 50m Medley Relay","13/U ",null,"Male/Open 13/U 4x50m Medley","Male/Open 13/U 4x50m Medley",{"$f":"'READ ME'!$B$9","v":"A Referee"},null,null,7,3,"M ",4,8,"Male/Open","4x50m","Medley",null,null,"6;3;\"Male/Open 13/U 4x50m Medley\";\"Male/Open 13/U 4x50m Medley\";\"A Referee\""]
[7,null,"Female 14-15 4 x 50m Freestyle Relay","15/U ",null,"Female 15/U 4x50m Freestyle","Female 15/U 4x50m Freestyle",{"$f":"'READ ME'!$B$9","v":"A Referee"},null,null,8,3,"F",0,8,"Female","4x50m","Freestyle",null,null,"7;3;\"Female 15/U 4x50m Freestyle\";\"Female 15/U 4x50m Freestyle\";\"A Referee\""]
[8,null,"Male/Open14-15 4 x 50m Freestyle Relay","15/U ",null,"Male/Open 15/U 4x50m Freestyle","Male/Open 15/U 4x50m Freestyle",{"$f":"'READ ME'!$B$9","v":"A Referee"},null,null,9,3,"M ",0,8,"Male/Open","4x50m","Freestyle",null,null,"8;3;\"Male/Open 15/U 4x50m Freestyle\";\"Male/Open 15/U 4x50m Freestyle\";\"A Referee\""]
[9,null,"Female 16+ 4 x 50m Medley Relay","Open ",null,"Female Open 4x50m Medley","Female Open 4x50m Medley",{"$f":"'READ ME'!$B$9","v":"A Referee"},null,null,10,3,"F",4,8,"Female","4x50m","Medley",null,null,"9;3;\"Female Open 4x50m Medley\";\"Female Open 4x50m Medley\";\"A Referee\""]
[10,null,"Male/Open 16+ 4 x 50m Medley Relay","Open ",null,"Male/Open Open 4x50m Medley","Male/Open Open 4x50m Medley",{"$f":"'READ ME'!$B$9","v":"A Referee"},null,null,11,3,"M ",4,8,"Male/Open","4x50m","Medley",null,null,"10;3;\"Male/Open Open 4x50m Medley\";\"Male/Open Open 4x50m Medley\";\"A Referee\""]
[11,null,"Female 10 - 11yrs. 50m Backstroke","10-11 ",null,"Female 10-11 50m Backstroke","Female 10-11 50m Backstroke",{"$f":"'READ ME'!$B$9","v":"A Referee"},null,null,12,3,"F",1,1,"Female","50m","Backstroke",null,null,"11;3;\"Female 10-11 50m Backstroke\";\"Female 10-11 50m Backstroke\";\"A Referee\""]
[12,null,"Male/Open 10 - 11yrs. 50m Backstroke","10-11 ",null,"Male/Open 10-11 50m Backstroke","Male/Open 10-11 50m Backstroke",{"$f":"'READ ME'!$B$9","v":"A Referee"},null,null,13,3,"M ",1,1,"Male/Open","50m","Backstroke",null,null,"12;3;\"Male/Open 10-11 50m Backstroke\";\"Male/Open 10-11 50m Backstroke\";\"A Referee\""]
[13,null,"Female 12-13 100m Breaststroke","13/U ",null,"Female 13/U 100m Breaststroke","Female 13/U 100m Breaststroke",{"$f":"'READ ME'!$B$9","v":"A Referee"},null,null,14,3,"F",2,2,"Female","100m","Breaststroke",null,null,"13;3;\"Female 13/U 100m Breaststroke\";\"Female 13/U 100m Breaststroke\";\"A Referee\""]
[14,null,"Male/Open12-13 100m Breaststroke","13/U ",null,"Male/Open 13/U 100m Breaststroke","Male/Open 13/U 100m Breaststroke",{"$f":"'READ ME'!$B$9","v":"A Referee"},null,null,15,3,"M ",2,2,"Male/Open","100m","Breaststroke",null,null,"14;3;\"Male/Open 13/U 100m Breaststroke\";\"Male/Open 13/U 100m Breaststroke\";\"A Referee\""]
{"$rows_left_out":38}
{"sheet":"LSTSTART.TXT","index":8,"n_rows":511,"n_cols":22,"rows_kept":511,"cut":false,"hidden":false,"merged":[]}
["event","round","Cat","Catoffset","heat",null,{"$f":"IF('READ ME'!B15<>\"\",'READ ME'!A15,\"\")","v":1},{"$f":"IF('READ ME'!B16<>\"\",'READ ME'!A16,\"\")","v":2},{"$f":"IF('READ ME'!B17<>\"\",'READ ME'!A17,\"\")","v":3},{"$f":"IF('READ ME'!B18<>\"\",'READ ME'!A18,\"\")","v":4},{"$f":"IF('READ ME'!B19<>\"\",'READ ME'!A19,\"\")","v":5},{"$f":"IF('READ ME'!B20<>\"\",'READ ME'!A20,\"\")","v":6},{"$f":"IF('READ ME'!B21<>\"\",'READ ME'!A21,\"\")","v":""},{"$f":"IF('READ ME'!B22<>\"\",'READ ME'!A22,\"\")","v":""},{"$f":"IF('READ ME'!B23<>\"\",'READ ME'!A23,\"\")","v":""},{"$f":"IF('READ ME'!B24<>\"\",'READ ME'!A24,\"\")","v":""},null,"#","x","y",null,"event;round;heat;lane;relais;idBib"]
[1,{"$f":"LSTTITPR.txt!L2","v":3},{"$f":"LSTTITPR.txt!M2","v":"F"},{"$f":"INDEX(Catoffset,MATCH(TRIM(C2),AbrevCat,0))","v":200},0,null,{"$f":"IF(G$1<>\"\",$A2&\";\"&$B2&\";\"&$E2&\";\"& G$1 &\";0;\"&G$1+$D2&\";\",\"\")","v":"1;3;0;1;0;201;"},{"$f":"IF(H$1<>\"\",$A2&\";\"&$B2&\";\"&$E2&\";\"& H$1 &\";0;\"&H$1+$D2&\";\",\"\")","v":"1;3;0;2;0;202;"},"1;3;0;3;0;203;","1;3;0;4;0;204;","1;3;0;5;0;205;","1;3;0;6;0;206;","","","","",null,1,{"$f":"MOD(R2-1,10)+1","v":1},{"$f":"INT((R2-1)/10)+1","v":1},null,{"$f":"INDEX(LSTstart2D,T2,S2)","v":"1;3;0;1;0;201;"}]
[2,{"$f":"LSTTITPR.txt!L3","v":3},{"$f":"LSTTITPR.txt!M3","v":"M "},100,0,null,{"$f":"IF(G$1<>\"\",$A3&\";\"&$B3&\";\"&$E3&\";\"& G$1 &\";0;\"&G$1+$D3&\";\",\"\")","v":"2;3;0;1;0;101;"},"2;3;0;2;0;102;","2;3;0;3;0;103;","2;3;0;4;0;104;","2;3;0;5;0;105;","2;3;0;6;0;106;","","","","",null,{"$f":"R2+1","v":2},{"$f":"MOD(R3-1,10)+1","v":2},{"$f":"INT((R3-1)/10)+1","v":1},null,{"$f":"INDEX(LSTstart2D,T3,S3)","v":"1;3;0;2;0;202;"}]
[3,{"$f":"LSTTITPR.txt!L4","v":3},{"$f":"LSTTITPR.txt!M4","v":"F"},200,0,null,"3;3;0;1;0;201;","3;3;0;2;0;202;","3;3;0;3;0;203;","3;3;0;4;0;204;","3;3;0;5;0;205;","3;3;0;6;0;206;","","","","",null,{"$f":"R3+1","v":3},3,1,null,{"$f":"INDEX(LSTstart2D,T4,S4)","v":"1;3;0;3;0;203;"}]
[4,{"$f":"LSTTITPR.txt!L5","v":3},{"$f":"LSTTITPR.txt!M5","v":"M "},100,0,null,"4;3;0;1;0;101;","4;3;0;2;0;102;","4;3;0;3;0;103;","4;3;0;4;0;104;","4;3;0;5;0;105;","4;3;0;6;0;106;","","","","",null,4,4,1,null,{"$f":"INDEX(LSTstart2D,T5,S5)","v":"1;3;0;4;0;204;"}]
[5,{"$f":"LSTTITPR.txt!L6","v":3},{"$f":"LSTTITPR.txt!M6","v":"F"},200,0,null,"5;3;0;1;0;201;","5;3;0;2;0;202;","5;3;0;3;0;203;","5;3;0;4;0;204;","5;3;0;5;0;205;","5;3;0;6;0;206;","","","","",null,5,5,1,null,{"$f":"INDEX(LSTstart2D,T6,S6)","v":"1;3;0;5;0;205;"}]
[6,{"$f":"LSTTITPR.txt!L7","v":3},{"$f":"LSTTITPR.txt!M7","v":"M "},100,0,null,"6;3;0;1;0;101;","6;3;0;2;0;102;","6;3;0;3;0;103;","6;3;0;4;0;104;","6;3;0;5;0;105;","6;3;0;6;0;106;","","","","",null,6,6,1,null,{"$f":"INDEX(LSTstart2D,T7,S7)","v":"1;3;0;6;0;206;"}]
[7,{"$f":"LSTTITPR.txt!L8","v":3},{"$f":"LSTTITPR.txt!M8","v":"F"},200,0,null,"7;3;0;1;0;201;","7;3;0;2;0;202;","7;3;0;3;0;203;","7;3;0;4;0;204;","7;3;0;5;0;205;","7;3;0;6;0;206;","","","","",null,7,7,1,null,{"$f":"INDEX(LSTstart2D,T8,S8)","v":""}]
[8,{"$f":"LSTTITPR.txt!L9","v":3},{"$f":"LSTTITPR.txt!M9","v":"M "},100,0,null,"8;3;0;1;0;101;","8;3;0;2;0;102;","8;3;0;3;0;103;","8;3;0;4;0;104;","8;3;0;5;0;105;","8;3;0;6;0;106;","","","","",null,8,8,1,null,{"$f":"INDEX(LSTstart2D,T9,S9)","v":""}]
[9,{"$f":"LSTTITPR.txt!L10","v":3},{"$f":"LSTTITPR.txt!M10","v":"F"},200,0,null,"9;3;0;1;0;201;","9;3;0;2;0;202;","9;3;0;3;0;203;","9;3;0;4;0;204;","9;3;0;5;0;205;","9;3;0;6;0;206;","","","","",null,9,9,1,null,{"$f":"INDEX(LSTstart2D,T10,S10)","v":""}]
[10,{"$f":"LSTTITPR.txt!L11","v":3},{"$f":"LSTTITPR.txt!M11","v":"M "},100,0,null,"10;3;0;1;0;101;","10;3;0;2;0;102;","10;3;0;3;0;103;","10;3;0;4;0;104;","10;3;0;5;0;105;","10;3;0;6;0;106;","","","","",null,10,10,1,null,{"$f":"INDEX(LSTstart2D,T11,S11)","v":""}]
[11,{"$f":"LSTTITPR.txt!L12","v":3},{"$f":"LSTTITPR.txt!M12","v":"F"},200,0,null,"11;3;0;1;0;201;","11;3;0;2;0;202;","11;3;0;3;0;203;","11;3;0;4;0;204;","11;3;0;5;0;205;","11;3;0;6;0;206;","","","","",null,11,1,2,null,{"$f":"INDEX(LSTstart2D,T12,S12)","v":"2;3;0;1;0;101;"}]
[12,{"$f":"LSTTITPR.txt!L13","v":3},{"$f":"LSTTITPR.txt!M13","v":"M "},100,0,null,"12;3;0;1;0;101;","12;3;0;2;0;102;","12;3;0;3;0;103;","12;3;0;4;0;104;","12;3;0;5;0;105;","12;3;0;6;0;106;","","","","",null,12,2,2,null,{"$f":"INDEX(LSTstart2D,T13,S13)","v":"2;3;0;2;0;102;"}]
[13,{"$f":"LSTTITPR.txt!L14","v":3},{"$f":"LSTTITPR.txt!M14","v":"F"},200,0,null,"13;3;0;1;0;201;","13;3;0;2;0;202;","13;3;0;3;0;203;","13;3;0;4;0;204;","13;3;0;5;0;205;","13;3;0;6;0;206;","","","","",null,13,3,2,null,{"$f":"INDEX(LSTstart2D,T14,S14)","v":"2;3;0;3;0;103;"}]
[14,{"$f":"LSTTITPR.txt!L15","v":3},{"$f":"LSTTITPR.txt!M15","v":"M "},100,0,null,"14;3;0;1;0;101;","14;3;0;2;0;102;","14;3;0;3;0;103;","14;3;0;4;0;104;","14;3;0;5;0;105;","14;3;0;6;0;106;","","","","",null,14,4,2,null,{"$f":"INDEX(LSTstart2D,T15,S15)","v":"2;3;0;4;0;104;"}]
{"$rows_left_out":496}