{"text_format":"1","workbook":"xlsx","n_sheets":4,"sheets":["Readme","List of Swimmers in the club","Events and Times","Events"],"not_rendered":{"charts":0,"images":0,"macros":1,"external_links":0,"defined_names":14,"comments":0,"pivot_tables":0},"unopened":[],"bounds":{"document_bytes":16777216,"sheet_cells":100000,"rows_first":2000,"rows_last":500,"rows_between":2000,"halvings":0,"cell_chars":16384,"cell_head_chars":4096},"cells_cut":0,"cells_raw":0,"read":"whole","date_system":"1900"}

{"sheet":"Readme","index":0,"n_rows":46,"n_cols":5,"rows_kept":46,"cut":false,"hidden":false,"merged":[]}
[]
[null,"A simple spread sheet to generate rankings results files "]
[null,"Probably suitable for level 4 meets and Level-X etc.",null,null,"Change Log"]
[null,"Created by Mark Leman for RTW Monson"]
[null,null,null,null,"0.6 - First release version"]
[null,"(C) May 2021 mark@leman.net / www.leman.net and released under MIT Licence https://opensource.org/licenses/MIT",null,null,"0.7 -  Added a formatted results table to print, press ctrl-p on the events tab"]
[]
[null,"The latest version can be found on my blog at www.leman.net ",null,null,"0.8 - Fixed a problem with the times in the .mrf results file, leading zeros are required on time so 59.59 must be 005959 in the .mrf file."]
[]
[null,"If you find problems please let me know with a comment on my blog",null,null,"0.9 - Fixed a problem with the event code in the .mrf results file, leading zeros are required."]
[]
[null,"If this is useful to you please let me know with a comment on my blog and perhaps consider buying me a beer."]
[]
[null,"Introduction:"]
[null,"Producing the results for level X events is a PITA J. The events are deliberately run in training sessions with many small groups, many sessions and occasionally ad-hoc swims for swimmers who were missing or want another go. This does not work well with normal meet management software like Hytek or Sportsystems which expect to know the swimmers & events in advance to generate heat sheets and then record the results."]
[]
[null,"So I thought, what we really need is a simple excel sheet where we just enter the swimmers names, events and times and it makes the correct results files to send off to rankings…… several late nights later, here it is."]
[]
[null,"Instructions :"]
[null,"1.       Go to the ‘List of swimmer in club’ tab, this needs to be filled in first. Rather than typing them read the instructions on that tab for how to fetch all the data from Swim England and paste it in.  Don’t edit the names in the ‘List of Swimmers in the club’ tab because they need to be correct for rankings submission. Once the swimmers have been entered the sheet needs to be kept under control due to GDPR and not shared publicly. If you have a new swimmer, carefully add them to the end of the list with details that match with what you are submitting to Swim England."]
[]
[null,"2.       Go to the ‘Events and times’ tab"]
[]
[null,"3.       Fill in the Event Date, name, venue, session etc."]
[]
[null,"4.       Enter the swimmers names who are competing in the session."]
[]
[null,"5.       The sheet looks the swimmers other details and works out their Age. If the swimmer is not found then name box turns red to let you know that something needs fixing. First thing to check is given first name –vs-  known as name, you need to use their formal given name as shown in the ‘list of swimmers tab’. Secondly check they are actually in the ‘list of swimmers’ tab."]
[]
[null,"6.       Then select an event, the event boxes have little drop down selectors so you can only enter valid events. The sheet  space for 100 swimmers and 10 events per sheet, so if you use one sheet per session that should be enough."]
[]
[null,"7.       Enter all the times for that event down the column. Times need to be entered without punctuation and with hundredths e.g.  45.23seconds is entered as 4523 and 1:09.10 in entered as 10910. The sheet does some simple checking of the times and the box turns red if something is wrong."]
[]
[null,"8.       Repeat 6&7 for each event"]
[]
[null,"9.       Fix any problems that are causing red boxes anywhere"]
[]
[null,"10.   When all the swimmers and times have been entered, hit the ‘Generate Results Files for Rankings’ buttons and it creates the files ready for rankings in the same folder you saved the sheet in. Results will not be generated for swimmers who’s names are in red."]
[]
[null,"Things to note:"]
[]
[null,"·         This sheet contains macros to handle saving the results and name/time validation. Excel will warn you that the sheet contains macros because they are capable of doing “bad things” to your PC if written to do so. I wrote the macros and know they are safe for me. You either have to trust me and click to enable macros, or inspect them yourself if you want use the ‘Generate results files’ button and have name and time checking."]
[]
[null,"·         Avoid dragging cells it tends to break things. Copy and paste is generally ok. If you manage to break thinks I suggest opening a new copy of the sheet and Copy and “paste values” the swimmers and results across to a the new sheet."]
[]
[null,"·         This probably needs a fairly recent version of excel and has not been tested on Mac versions, so may not work on Macs."]

{"sheet":"List of Swimmers in the club","index":1,"n_rows":1000,"n_cols":13,"rows_kept":1000,"cut":false,"hidden":false,"merged":[[1,14,52,14],[1,12,40,12]]}
["Fish","Fred","2006-11-20","RTW Monson","M",1234567,0,0,0,null,{"$f":"IF(A1<>\"\",TRIM(B1)&\" \"&TRIM(A1),\"\")","v":"Fred Fish"}]
["Mermaid","Miranda","2007-03-07","RTW Monson","F",2345678,0,0,0,null,{"$f":"IF(A2<>\"\",TRIM(B2)&\" \"&TRIM(A2),\"\")","v":"Miranda Mermaid"},null,"How to download your clubs swimmers details  from Swim England and add them here.\n\nThe swimmers details in columns A-J\n  A: Family name\n  B: Given Name\n  C: DOB\n  D: Club\n  E: Sex (M/F)\n  F: Swim England number\nG-J: Not currently used, but retained to make it easy to follow the instruction below\n\nThis information must exactly match the details held by Swim England so rather than type it all in it is much easier to use the SS Entry manager (or Club Rankings) program to download a file containing all your clubs swimmers. \n\nTo do this run Sportsystems Entry Manager, on the \"tools\" menu select  \"Download valid swimmers file\".  \nTo see where this file is saved, on the \"tools\" menu select  \"Select valid swimmers file\" and note which folder the file is saved in.\n\nGo to that folder and take a copy of the Valid swimmers file, rename the copy from .txt to .csv\n\nDouble click on the .csv file and it should open in excel\n\nCopy and paste columns A to J from the .csv in excel to columns A to J in this spread sheet. \n\nRepeat this process when new swimmers join the club\n\nIf you use the club rankings program this can also download a valid swimmers file.\n\nAn alternative if your club uses Team Unify is to use the 'Custom Excel Export' option in Team admin -> account/member admin -> Members Tab -> Export button, to produce a list of members in the right order to paste in to here (only cols A-E are actually needed)."]
["Dory","John","2010-05-23","RTW Monson","M",3456789,0,0,0,null,"John Dory"]
["Fish","Rainbow","2008-07-12","RTW Monson","F",4567890,0,0,0,null,"Rainbow Fish"]
["Flounder","Phil","2010-11-22","RTW Monson","M",5678901,0,0,0,null,"Phil Flounder"]
["Dolphin","Flipper","2011-07-06","RTW Monson","M",6789012,0,0,0,null,"Flipper Dolphin"]
["Sponge","Bob","2003-04-22","RTW Monson","M",7890123,0,0,0,null,"Bob Sponge"]
["Cousteau","Jaques ","2005-09-17","RTW Monson","M",8901234,0,0,0,null,"Jaques  Cousteau"]
["Chips","Fishn","2011-01-04","RTW Monson","M",9012345,0,0,0,null,"Fishn Chips"]
[null,null,null,null,null,null,null,null,null,null,""]
[null,null,null,null,null,null,null,null,null,null,""]
[null,null,null,null,null,null,null,null,null,null,""]
[null,null,null,null,null,null,null,null,null,null,""]
[null,null,null,null,null,null,null,null,null,null,""]
[null,null,null,null,null,null,null,null,null,null,""]
[null,null,null,null,null,null,null,null,null,null,""]
[null,null,null,null,null,null,null,null,null,null,""]
[null,null,null,null,null,null,null,null,null,null,""]
[null,null,null,null,null,null,null,null,null,null,""]
[null,null,null,null,null,null,null,null,null,null,""]
[null,null,null,null,null,null,null,null,null,null,""]
[null,null,null,null,null,null,null,null,null,null,""]
[null,null,null,null,null,null,null,null,null,null,""]
[null,null,null,null,null,null,null,null,null,null,""]
[null,null,null,null,null,null,null,null,null,null,""]
[null,null,null,null,null,null,null,null,null,null,""]
[null,null,null,null,null,null,null,null,null,null,""]
[null,null,null,null,null,null,null,null,null,null,""]
[null,null,null,null,null,null,null,null,null,null,""]
[null,null,null,null,null,null,null,null,null,null,""]
[null,null,null,null,null,null,null,null,null,null,""]
[null,null,null,null,null,null,null,null,null,null,""]
[null,null,null,null,null,null,null,null,null,null,""]
[null,null,null,null,null,null,null,null,null,null,""]
[null,null,null,null,null,null,null,null,null,null,""]
[null,null,null,null,null,null,null,null,null,null,""]
[null,null,null,null,null,null,null,null,null,null,""]
[null,null,null,null,null,null,null,null,null,null,""]
[null,null,null,null,null,null,null,null,null,null,""]
[null,null,null,null,null,null,null,null,null,null,""]
[null,null,null,null,null,null,null,null,null,null,""]
[null,null,null,null,null,null,null,null,null,null,""]
[null,null,null,null,null,null,null,null,null,null,""]
[null,null,null,null,null,null,null,null,null,null,""]
[null,null,null,null,null,null,null,null,null,null,""]
[null,null,null,null,null,null,null,null,null,null,""]
[null,null,null,null,null,null,null,null,null,null,""]
[null,null,null,null,null,null,null,null,null,null,""]
[null,null,null,null,null,null,null,null,null,null,""]
[null,null,null,null,null,null,null,null,null,null,""]
[null,null,null,null,null,null,null,null,null,null,""]
[null,null,null,null,null,null,null,null,null,null,""]
[null,null,null,null,null,null,null,null,null,null,""]
[null,null,null,null,null,null,null,null,null,null,""]
[null,null,null,null,null,null,null,null,null,null,""]
[null,null,null,null,null,null,null,null,null,null,""]
[null,null,null,null,null,null,null,null,null,null,""]
[null,null,null,null,null,null,null,null,null,null,""]
[null,null,null,null,null,null,null,null,null,null,""]
[null,null,null,null,null,null,null,null,null,null,""]
[null,null,null,null,null,null,null,null,null,null,""]
[null,null,null,null,null,null,null,null,null,null,""]
[null,null,null,null,null,null,null,null,null,null,""]
[null,null,null,null,null,null,null,null,null,null,""]
[null,null,null,null,null,null,null,null,null,null,""]
[null,null,null,null,null,null,null,null,null,null,{"$f":"IF(A66<>\"\",TRIM(B66)&\" \"&TRIM(A66),\"\")","v":""}]
[null,null,null,null,null,null,null,null,null,null,""]
[null,null,null,null,null,null,null,null,null,null,""]
[null,null,null,null,null,null,null,null,null,null,""]
[null,null,null,null,null,null,null,null,null,null,""]
[null,null,null,null,null,null,null,null,null,null,""]
[null,null,null,null,null,null,null,null,null,null,""]
[null,null,null,null,null,null,null,null,null,null,""]
[null,null,null,null,null,null,null,null,null,null,""]
[null,null,null,null,null,null,null,null,null,null,""]
[null,null,null,null,null,null,null,null,null,null,""]
[null,null,null,null,null,null,null,null,null,null,""]
[null,null,null,null,null,null,null,null,null,null,""]
[null,null,null,null,null,null,null,null,null,null,""]
[null,null,null,null,null,null,null,null,null,null,""]
[null,null,null,null,null,null,null,null,null,null,""]
[null,null,null,null,null,null,null,null,null,null,""]
[null,null,null,null,null,null,null,null,null,null,""]
[null,null,null,null,null,null,null,null,null,null,""]
[null,null,null,null,null,null,null,null,null,null,""]
[null,null,null,null,null,null,null,null,null,null,""]
[null,null,null,null,null,null,null,null,null,null,""]
[null,null,null,null,null,null,null,null,null,null,""]
[null,null,null,null,null,null,null,null,null,null,""]
[null,null,null,null,null,null,null,null,null,null,""]
[null,null,null,null,null,null,null,null,null,null,""]
[null,null,null,null,null,null,null,null,null,null,""]
[null,null,null,null,null,null,null,null,null,null,""]
[null,null,null,null,null,null,null,null,null,null,""]
[null,null,null,null,null,null,null,null,null,null,""]
[null,null,null,null,null,null,null,null,null,null,""]
[null,null,null,null,null,null,null,null,null,null,""]
[null,null,null,null,null,null,null,null,null,null,""]
[null,null,null,null,null,null,null,null,null,null,""]
[null,null,null,null,null,null,null,null,null,null,""]
[null,null,null,null,null,null,null,null,null,null,""]
[null,null,null,null,null,null,null,null,null,null,""]
[null,null,null,null,null,null,null,null,null,null,""]
[null,null,null,null,null,null,null,null,null,null,""]
[null,null,null,null,null,null,null,null,null,null,""]
[null,null,null,null,null,null,null,null,null,null,""]
[null,null,null,null,null,null,null,null,null,null,""]
[null,null,null,null,null,null,null,null,null,null,""]
[null,null,null,null,null,null,null,null,null,null,""]
[null,null,null,null,null,null,null,null,null,null,""]
[null,null,null,null,null,null,null,null,null,null,""]
[null,null,null,null,null,null,null,null,null,null,""]
[null,null,null,null,null,null,null,null,null,null,""]
[null,null,null,null,null,null,null,null,null,null,""]
[null,null,null,null,null,null,null,null,null,null,""]
[null,null,null,null,null,null,null,null,null,null,""]
[null,null,null,null,null,null,null,null,null,null,""]
[null,null,null,null,null,null,null,null,null,null,""]
[null,null,null,null,null,null,null,null,null,null,""]
[null,null,null,null,null,null,null,null,null,null,""]
[null,null,null,null,null,null,null,null,null,null,""]
[null,null,null,null,null,null,null,null,null,null,""]
[null,null,null,null,null,null,null,null,null,null,""]
[null,null,null,null,null,null,null,null,null,null,""]
[null,null,null,null,null,null,null,null,null,null,""]
[null,null,null,null,null,null,null,null,null,null,""]
[null,null,null,null,null,null,null,null,null,null,""]
[null,null,null,null,null,null,null,null,null,null,""]
[null,null,null,null,null,null,null,null,null,null,""]
[null,null,null,null,null,null,null,null,null,null,{"$f":"IF(A130<>\"\",TRIM(B130)&\" \"&TRIM(A130),\"\")","v":""}]
[null,null,null,null,null,null,null,null,null,null,""]
[null,null,null,null,null,null,null,null,null,null,""]
[null,null,null,null,null,null,null,null,null,null,""]
[null,null,null,null,null,null,null,null,null,null,""]
[null,null,null,null,null,null,null,null,null,null,""]
[null,null,null,null,null,null,null,null,null,null,""]
[null,null,null,null,null,null,null,null,null,null,""]
[null,null,null,null,null,null,null,null,null,null,""]
[null,null,null,null,null,null,null,null,null,null,""]
[null,null,null,null,null,null,null,null,null,null,""]
[null,null,null,null,null,null,null,null,null,null,""]
[null,null,null,null,null,null,null,null,null,null,""]
[null,null,null,null,null,null,null,null,null,null,""]
[null,null,null,null,null,null,null,null,null,null,""]
[null,null,null,null,null,null,null,null,null,null,""]
[null,null,null,null,null,null,null,null,null,null,""]
[null,null,null,null,null,null,null,null,null,null,""]
[null,null,null,null,null,null,null,null,null,null,""]
[null,null,null,null,null,null,null,null,null,null,""]
[null,null,null,null,null,null,null,null,null,null,""]
[null,null,null,null,null,null,null,null,null,null,""]
[null,null,null,null,null,null,null,null,null,null,""]
[null,null,null,null,null,null,null,null,null,null,""]
[null,null,null,null,null,null,null,null,null,null,""]
[null,null,null,null,null,null,null,null,null,null,""]
[null,null,null,null,null,null,null,null,null,null,""]
[null,null,null,null,null,null,null,null,null,null,""]
[null,null,null,null,null,null,null,null,null,null,""]
[null,null,null,null,null,null,null,null,null,null,""]
[null,null,null,null,null,null,null,null,null,null,""]
[null,null,null,null,null,null,null,null,null,null,""]
[null,null,null,null,null,null,null,null,null,null,""]
[null,null,null,null,null,null,null,null,null,null,""]
[null,null,null,null,null,null,null,null,null,null,""]
[null,null,null,null,null,null,null,null,null,null,""]
[null,null,null,null,null,null,null,null,null,null,""]
[null,null,null,null,null,null,null,null,null,null,""]
[null,null,null,null,null,null,null,null,null,null,""]
[null,null,null,null,null,null,null,null,null,null,""]
[null,null,null,null,null,null,null,null,null,null,""]
[null,null,null,null,null,null,null,null,null,null,""]
[null,null,null,null,null,null,null,null,null,null,""]
[null,null,null,null,null,null,null,null,null,null,""]
[null,null,null,null,null,null,null,null,null,null,""]
[null,null,null,null,null,null,null,null,null,null,""]
[null,null,null,null,null,null,null,null,null,null,""]
[null,null,null,null,null,null,null,null,null,null,""]
[null,null,null,null,null,null,null,null,null,null,""]
[null,null,null,null,null,null,null,null,null,null,""]
[null,null,null,null,null,null,null,null,null,null,""]
[null,null,null,null,null,null,null,null,null,null,""]
[null,null,null,null,null,null,null,null,null,null,""]
[null,null,null,null,null,null,null,null,null,null,""]
[null,null,null,null,null,null,null,null,null,null,""]
[null,null,null,null,null,null,null,null,null,null,""]
[null,null,null,null,null,null,null,null,null,null,""]
[null,null,null,null,null,null,null,null,null,null,""]
[null,null,null,null,null,null,null,null,null,null,""]
[null,null,null,null,null,null,null,null,null,null,""]
[null,null,null,null,null,null,null,null,null,null,""]
[null,null,null,null,null,null,null,null,null,null,""]
[null,null,null,null,null,null,null,null,null,null,""]
[null,null,null,null,null,null,null,null,null,null,""]
[null,null,null,null,null,null,null,null,null,null,{"$f":"IF(A194<>\"\",TRIM(B194)&\" \"&TRIM(A194),\"\")","v":""}]
[null,null,null,null,null,null,null,null,null,null,""]
[null,null,null,null,null,null,null,null,null,null,""]
[null,null,null,null,null,null,null,null,null,null,""]
[null,null,null,null,null,null,null,null,null,null,""]
[null,null,null,null,null,null,null,null,null,null,""]
[null,null,null,null,null,null,null,null,null,null,""]
[null,null,null,null,null,null,null,null,null,null,""]
[null,null,null,null,null,null,null,null,null,null,""]
[null,null,null,null,null,null,null,null,null,null,""]
[null,null,null,null,null,null,null,null,null,null,""]
[null,null,null,null,null,null,null,null,null,null,""]
[null,null,null,null,null,null,null,null,null,null,""]
[null,null,null,null,null,null,null,null,null,null,""]
[null,null,null,null,null,null,null,null,null,null,""]
[null,null,null,null,null,null,null,null,null,null,""]
[null,null,null,null,null,null,null,null,null,null,""]
[null,null,null,null,null,null,null,null,null,null,""]
[null,null,null,null,null,null,null,null,null,null,""]
[null,null,null,null,null,null,null,null,null,null,""]
[null,null,null,null,null,null,null,null,null,null,""]
[null,null,null,null,null,null,null,null,null,null,""]
[null,null,null,null,null,null,null,null,null,null,""]
[null,null,null,null,null,null,null,null,null,null,""]
[null,null,null,null,null,null,null,null,null,null,""]
[null,null,null,null,null,null,null,null,null,null,""]
[null,null,null,null,null,null,null,null,null,null,""]
[null,null,null,null,null,null,null,null,null,null,""]
[null,null,null,null,null,null,null,null,null,null,""]
[null,null,null,null,null,null,null,null,null,null,""]
[null,null,null,null,null,null,null,null,null,null,""]
[null,null,null,null,null,null,null,null,null,null,""]
[null,null,null,null,null,null,null,null,null,null,""]
[null,null,null,null,null,null,null,null,null,null,""]
[null,null,null,null,null,null,null,null,null,null,""]
[null,null,null,null,null,null,null,null,null,null,""]
[null,null,null,null,null,null,null,null,null,null,""]
[null,null,null,null,null,null,null,null,null,null,""]
[null,null,null,null,null,null,null,null,null,null,""]
[null,null,null,null,null,null,null,null,null,null,""]
[null,null,null,null,null,null,null,null,null,null,""]
[null,null,null,null,null,null,null,null,null,null,""]
[null,null,null,null,null,null,null,null,null,null,""]
[null,null,null,null,null,null,null,null,null,null,""]
[null,null,null,null,null,null,null,null,null,null,""]
[null,null,null,null,null,null,null,null,null,null,""]
[null,null,null,null,null,null,null,null,null,null,""]
[null,null,null,null,null,null,null,null,null,null,""]
[null,null,null,null,null,null,null,null,null,null,""]
[null,null,null,null,null,null,null,null,null,null,""]
[null,null,null,null,null,null,null,null,null,null,""]
[null,null,null,null,null,null,null,null,null,null,""]
[null,null,null,null,null,null,null,null,null,null,""]
[null,null,null,null,null,null,null,null,null,null,""]
[null,null,null,null,null,null,null,null,null,null,""]
[null,null,null,null,null,null,null,null,null,null,""]
[null,null,null,null,null,null,null,null,null,null,""]
[null,null,null,null,null,null,null,null,null,null,""]
[null,null,null,null,null,null,null,null,null,null,""]
[null,null,null,null,null,null,null,null,null,null,""]
[null,null,null,null,null,null,null,null,null,null,""]
[null,null,null,null,null,null,null,null,null,null,""]
[null,null,null,null,null,null,null,null,null,null,""]
[null,null,null,null,null,null,null,null,null,null,""]
[null,null,null,null,null,null,null,null,null,null,{"$f":"IF(A258<>\"\",TRIM(B258)&\" \"&TRIM(A258),\"\")","v":""}]
[null,null,null,null,null,null,null,null,null,null,""]
[null,null,null,null,null,null,null,null,null,null,""]
[null,null,null,null,null,null,null,null,null,null,""]
[null,null,null,null,null,null,null,null,null,null,""]
[null,null,null,null,null,null,null,null,null,null,""]
[null,null,null,null,null,null,null,null,null,null,""]
[null,null,null,null,null,null,null,null,null,null,""]
[null,null,null,null,null,null,null,null,null,null,""]
[null,null,null,null,null,null,null,null,null,null,""]
[null,null,null,null,null,null,null,null,null,null,""]
[null,null,null,null,null,null,null,null,null,null,""]
[null,null,null,null,null,null,null,null,null,null,""]
[null,null,null,null,null,null,null,null,null,null,""]
[null,null,null,null,null,null,null,null,null,null,""]
[null,null,null,null,null,null,null,null,null,null,""]
[null,null,null,null,null,null,null,null,null,null,""]
[null,null,null,null,null,null,null,null,null,null,""]
[null,null,null,null,null,null,null,null,null,null,""]
[null,null,null,null,null,null,null,null,null,null,""]
[null,null,null,null,null,null,null,null,null,null,""]
[null,null,null,null,null,null,null,null,null,null,""]
[null,null,null,null,null,null,null,null,null,null,""]
[null,null,null,null,null,null,null,null,null,null,""]
[null,null,null,null,null,null,null,null,null,null,""]
[null,null,null,null,null,null,null,null,null,null,""]
[null,null,null,null,null,null,null,null,null,null,""]
[null,null,null,null,null,null,null,null,null,null,""]
[null,null,null,null,null,null,null,null,null,null,""]
[null,null,null,null,null,null,null,null,null,null,""]
[null,null,null,null,null,null,null,null,null,null,""]
[null,null,null,null,null,null,null,null,null,null,""]
[null,null,null,null,null,null,null,null,null,null,""]
[null,null,null,null,null,null,null,null,null,null,""]
[null,null,null,null,null,null,null,null,null,null,""]
[null,null,null,null,null,null,null,null,null,null,""]
[null,null,null,null,null,null,null,null,null,null,""]
[null,null,null,null,null,null,null,null,null,null,""]
[null,null,null,null,null,null,null,null,null,null,""]
[null,null,null,null,null,null,null,null,null,null,""]
[null,null,null,null,null,null,null,null,null,null,""]
[null,null,null,null,null,null,null,null,null,null,""]
[null,null,null,null,null,null,null,null,null,null,""]
[null,null,null,null,null,null,null,null,null,null,""]
[null,null,null,null,null,null,null,null,null,null,""]
[null,null,null,null,null,null,null,null,null,null,""]
[null,null,null,null,null,null,null,null,null,null,""]
[null,null,null,null,null,null,null,null,null,null,""]
[null,null,null,null,null,null,null,null,null,null,""]
[null,null,null,null,null,null,null,null,null,null,""]
[null,null,null,null,null,null,null,null,null,null,""]
[null,null,null,null,null,null,null,null,null,null,""]
[null,null,null,null,null,null,null,null,null,null,""]
[null,null,null,null,null,null,null,null,null,null,""]
[null,null,null,null,null,null,null,null,null,null,""]
[null,null,null,null,null,null,null,null,null,null,""]
[null,null,null,null,null,null,null,null,null,null,""]
[null,null,null,null,null,null,null,null,null,null,""]
[null,null,null,null,null,null,null,null,null,null,""]
[null,null,null,null,null,null,null,null,null,null,""]
[null,null,null,null,null,null,null,null,null,null,""]
[null,null,null,null,null,null,null,null,null,null,""]
[null,null,null,null,null,null,null,null,null,null,""]
[null,null,null,null,null,null,null,null,null,null,""]
[null,null,null,null,null,null,null,null,null,null,{"$f":"IF(A322<>\"\",TRIM(B322)&\" \"&TRIM(A322),\"\")","v":""}]
[null,null,null,null,null,null,null,null,null,null,""]
[null,null,null,null,null,null,null,null,null,null,""]
[null,null,null,null,null,null,null,null,null,null,""]
[null,null,null,null,null,null,null,null,null,null,""]
[null,null,null,null,null,null,null,null,null,null,""]
[null,null,null,null,null,null,null,null,null,null,""]
[null,null,null,null,null,null,null,null,null,null,""]
[null,null,null,null,null,null,null,null,null,null,""]
[null,null,null,null,null,null,null,null,null,null,""]
[null,null,null,null,null,null,null,null,null,null,""]
[null,null,null,null,null,null,null,null,null,null,""]
[null,null,null,null,null,null,null,null,null,null,""]
[null,null,null,null,null,null,null,null,null,null,""]
[null,null,null,null,null,null,null,null,null,null,""]
[null,null,null,null,null,null,null,null,null,null,""]
[null,null,null,null,null,null,null,null,null,null,""]
[null,null,null,null,null,null,null,null,null,null,""]
[null,null,null,null,null,null,null,null,null,null,""]
[null,null,null,null,null,null,null,null,null,null,""]
[null,null,null,null,null,null,null,null,null,null,""]
[null,null,null,null,null,null,null,null,null,null,""]
[null,null,null,null,null,null,null,null,null,null,""]
[null,null,null,null,null,null,null,null,null,null,""]
[null,null,null,null,null,null,null,null,null,null,""]
[null,null,null,null,null,null,null,null,null,null,""]
[null,null,null,null,null,null,null,null,null,null,""]
[null,null,null,null,null,null,null,null,null,null,""]
[null,null,null,null,null,null,null,null,null,null,""]
[null,null,null,null,null,null,null,null,null,null,""]
[null,null,null,null,null,null,null,null,null,null,""]
[null,null,null,null,null,null,null,null,null,null,""]
[null,null,null,null,null,null,null,null,null,null,""]
[null,null,null,null,null,null,null,null,null,null,""]
[null,null,null,null,null,null,null,null,null,null,""]
[null,null,null,null,null,null,null,null,null,null,""]
[null,null,null,null,null,null,null,null,null,null,""]
[null,null,null,null,null,null,null,null,null,null,""]
[null,null,null,null,null,null,null,null,null,null,""]
[null,null,null,null,null,null,null,null,null,null,""]
[null,null,null,null,null,null,null,null,null,null,""]
[null,null,null,null,null,null,null,null,null,null,""]
[null,null,null,null,null,null,null,null,null,null,""]
[null,null,null,null,null,null,null,null,null,null,""]
[null,null,null,null,null,null,null,null,null,null,""]
[null,null,null,null,null,null,null,null,null,null,""]
[null,null,null,null,null,null,null,null,null,null,""]
[null,null,null,null,null,null,null,null,null,null,""]
[null,null,null,null,null,null,null,null,null,null,""]
[null,null,null,null,null,null,null,null,null,null,""]
[null,null,null,null,null,null,null,null,null,null,""]
[null,null,null,null,null,null,null,null,null,null,""]
[null,null,null,null,null,null,null,null,null,null,""]
[null,null,null,null,null,null,null,null,null,null,""]
[null,null,null,null,null,null,null,null,null,null,""]
[null,null,null,null,null,null,null,null,null,null,""]
[null,null,null,null,null,null,null,null,null,null,""]
[null,null,null,null,null,null,null,null,null,null,""]
[null,null,null,null,null,null,null,null,null,null,""]
[null,null,null,null,null,null,null,null,null,null,""]
[null,null,null,null,null,null,null,null,null,null,""]
[null,null,null,null,null,null,null,null,null,null,""]
[null,null,null,null,null,null,null,null,null,null,""]
[null,null,null,null,null,null,null,null,null,null,""]
[null,null,null,null,null,null,null,null,null,null,{"$f":"IF(A386<>\"\",TRIM(B386)&\" \"&TRIM(A386),\"\")","v":""}]
[null,null,null,null,null,null,null,null,null,null,""]
[null,null,null,null,null,null,null,null,null,null,""]
[null,null,null,null,null,null,null,null,null,null,""]
[null,null,null,null,null,null,null,null,null,null,""]
[null,null,null,null,null,null,null,null,null,null,""]
[null,null,null,null,null,null,null,null,null,null,""]
[null,null,null,null,null,null,null,null,null,null,""]
[null,null,null,null,null,null,null,null,null,null,""]
[null,null,null,null,null,null,null,null,null,null,""]
[null,null,null,null,null,null,null,null,null,null,""]
[null,null,null,null,null,null,null,null,null,null,""]
[null,null,null,null,null,null,null,null,null,null,""]
[null,null,null,null,null,null,null,null,null,null,""]
[null,null,null,null,null,null,null,null,null,null,""]
[null,null,null,null,null,null,null,null,null,null,""]
[null,null,null,null,null,null,null,null,null,null,""]
[null,null,null,null,null,null,null,null,null,null,""]
[null,null,null,null,null,null,null,null,null,null,""]
[null,null,null,null,null,null,null,null,null,null,""]
[null,null,null,null,null,null,null,null,null,null,""]
[null,null,null,null,null,null,null,null,null,null,""]
[null,null,null,null,null,null,null,null,null,null,""]
[null,null,null,null,null,null,null,null,null,null,""]
[null,null,null,null,null,null,null,null,null,null,""]
[null,null,null,null,null,null,null,null,null,null,""]
[null,null,null,null,null,null,null,null,null,null,""]
[null,null,null,null,null,null,null,null,null,null,""]
[null,null,null,null,null,null,null,null,null,null,""]
[null,null,null,null,null,null,null,null,null,null,""]
[null,null,null,null,null,null,null,null,null,null,""]
[null,null,null,null,null,null,null,null,null,null,""]
[null,null,null,null,null,null,null,null,null,null,""]
[null,null,null,null,null,null,null,null,null,null,""]
[null,null,null,null,null,null,null,null,null,null,""]
[null,null,null,null,null,null,null,null,null,null,""]
[null,null,null,null,null,null,null,null,null,null,""]
[null,null,null,null,null,null,null,null,null,null,""]
[null,null,null,null,null,null,null,null,null,null,""]
[null,null,null,null,null,null,null,null,null,null,""]
[null,null,null,null,null,null,null,null,null,null,""]
[null,null,null,null,null,null,null,null,null,null,""]
[null,null,null,null,null,null,null,null,null,null,""]
[null,null,null,null,null,null,null,null,null,null,""]
[null,null,null,null,null,null,null,null,null,null,""]
[null,null,null,null,null,null,null,null,null,null,""]
[null,null,null,null,null,null,null,null,null,null,""]
[null,null,null,null,null,null,null,null,null,null,""]
[null,null,null,null,null,null,null,null,null,null,""]
[null,null,null,null,null,null,null,null,null,null,""]
[null,null,null,null,null,null,null,null,null,null,""]
[null,null,null,null,null,null,null,null,null,null,""]
[null,null,null,null,null,null,null,null,null,null,""]
[null,null,null,null,null,null,null,null,null,null,""]
[null,null,null,null,null,null,null,null,null,null,""]
[null,null,null,null,null,null,null,null,null,null,""]
[null,null,null,null,null,null,null,null,null,null,""]
[null,null,null,null,null,null,null,null,null,null,""]
[null,null,null,null,null,null,null,null,null,null,""]
[null,null,null,null,null,null,null,null,null,null,""]
[null,null,null,null,null,null,null,null,null,null,""]
[null,null,null,null,null,null,null,null,null,null,""]
[null,null,null,null,null,null,null,null,null,null,""]
[null,null,null,null,null,null,null,null,null,null,""]
[null,null,null,null,null,null,null,null,null,null,{"$f":"IF(A450<>\"\",TRIM(B450)&\" \"&TRIM(A450),\"\")","v":""}]
[null,null,null,null,null,null,null,null,null,null,""]
[null,null,null,null,null,null,null,null,null,null,""]
[null,null,null,null,null,null,null,null,null,null,""]
[null,null,null,null,null,null,null,null,null,null,""]
[null,null,null,null,null,null,null,null,null,null,""]
[null,null,null,null,null,null,null,null,null,null,""]
[null,null,null,null,null,null,null,null,null,null,""]
[null,null,null,null,null,null,null,null,null,null,""]
[null,null,null,null,null,null,null,null,null,null,""]
[null,null,null,null,null,null,null,null,null,null,""]
[null,null,null,null,null,null,null,null,null,null,""]
[null,null,null,null,null,null,null,null,null,null,""]
[null,null,null,null,null,null,null,null,null,null,""]
[null,null,null,null,null,null,null,null,null,null,""]
[null,null,null,null,null,null,null,null,null,null,""]
[null,null,null,null,null,null,null,null,null,null,""]
[null,null,null,null,null,null,null,null,null,null,""]
[null,null,null,null,null,null,null,null,null,null,""]
[null,null,null,null,null,null,null,null,null,null,""]
[null,null,null,null,null,null,null,null,null,null,""]
[null,null,null,null,null,null,null,null,null,null,""]
[null,null,null,null,null,null,null,null,null,null,""]
[null,null,null,null,null,null,null,null,null,null,""]
[null,null,null,null,null,null,null,null,null,null,""]
[null,null,null,null,null,null,null,null,null,null,""]
[null,null,null,null,null,null,null,null,null,null,""]
[null,null,null,null,null,null,null,null,null,null,""]
[null,null,null,null,null,null,null,null,null,null,""]
[null,null,null,null,null,null,null,null,null,null,""]
[null,null,null,null,null,null,null,null,null,null,""]
[null,null,null,null,null,null,null,null,null,null,""]
[null,null,null,null,null,null,null,null,null,null,""]
[null,null,null,null,null,null,null,null,null,null,""]
[null,null,null,null,null,null,null,null,null,null,""]
[null,null,null,null,null,null,null,null,null,null,""]
[null,null,null,null,null,null,null,null,null,null,""]
[null,null,null,null,null,null,null,null,null,null,""]
[null,null,null,null,null,null,null,null,null,null,""]
[null,null,null,null,null,null,null,null,null,null,""]
[null,null,null,null,null,null,null,null,null,null,""]
[null,null,null,null,null,null,null,null,null,null,""]
[null,null,null,null,null,null,null,null,null,null,""]
[null,null,null,null,null,null,null,null,null,null,""]
[null,null,null,null,null,null,null,null,null,null,""]
[null,null,null,null,null,null,null,null,null,null,""]
[null,null,null,null,null,null,null,null,null,null,""]
[null,null,null,null,null,null,null,null,null,null,""]
[null,null,null,null,null,null,null,null,null,null,""]
[null,null,null,null,null,null,null,null,null,null,""]
[null,null,null,null,null,null,null,null,null,null,""]
[null,null,null,null,null,null,null,null,null,null,""]
[null,null,null,null,null,null,null,null,null,null,""]
[null,null,null,null,null,null,null,null,null,null,""]
[null,null,null,null,null,null,null,null,null,null,""]
[null,null,null,null,null,null,null,null,null,null,""]
[null,null,null,null,null,null,null,null,null,null,""]
[null,null,null,null,null,null,null,null,null,null,""]
[null,null,null,null,null,null,null,null,null,null,""]
[null,null,null,null,null,null,null,null,null,null,""]
[null,null,null,null,null,null,null,null,null,null,""]
[null,null,null,null,null,null,null,null,null,null,""]
[null,null,null,null,null,null,null,null,null,null,""]
[null,null,null,null,null,null,null,null,null,null,""]
[null,null,null,null,null,null,null,null,null,null,{"$f":"IF(A514<>\"\",TRIM(B514)&\" \"&TRIM(A514),\"\")","v":""}]
[null,null,null,null,null,null,null,null,null,null,""]
[null,null,null,null,null,null,null,null,null,null,""]
[null,null,null,null,null,null,null,null,null,null,""]
[null,null,null,null,null,null,null,null,null,null,""]
[null,null,null,null,null,null,null,null,null,null,""]
[null,null,null,null,null,null,null,null,null,null,""]
[null,null,null,null,null,null,null,null,null,null,""]
[null,null,null,null,null,null,null,null,null,null,""]
[null,null,null,null,null,null,null,null,null,null,""]
[null,null,null,null,null,null,null,null,null,null,""]
[null,null,null,null,null,null,null,null,null,null,""]
[null,null,null,null,null,null,null,null,null,null,""]
[null,null,null,null,null,null,null,null,null,null,""]
[null,null,null,null,null,null,null,null,null,null,""]
[null,null,null,null,null,null,null,null,null,null,""]
[null,null,null,null,null,null,null,null,null,null,""]
[null,null,null,null,null,null,null,null,null,null,""]
[null,null,null,null,null,null,null,null,null,null,""]
[null,null,null,null,null,null,null,null,null,null,""]
[null,null,null,null,null,null,null,null,null,null,""]
[null,null,null,null,null,null,null,null,null,null,""]
[null,null,null,null,null,null,null,null,null,null,""]
[null,null,null,null,null,null,null,null,null,null,""]
[null,null,null,null,null,null,null,null,null,null,""]
[null,null,null,null,null,null,null,null,null,null,""]
[null,null,null,null,null,null,null,null,null,null,""]
[null,null,null,null,null,null,null,null,null,null,""]
[null,null,null,null,null,null,null,null,null,null,""]
[null,null,null,null,null,null,null,null,null,null,""]
[null,null,null,null,null,null,null,null,null,null,""]
[null,null,null,null,null,null,null,null,null,null,""]
[null,null,null,null,null,null,null,null,null,null,""]
[null,null,null,null,null,null,null,null,null,null,""]
[null,null,null,null,null,null,null,null,null,null,""]
[null,null,null,null,null,null,null,null,null,null,""]
[null,null,null,null,null,null,null,null,null,null,""]
[null,null,null,null,null,null,null,null,null,null,""]
[null,null,null,null,null,null,null,null,null,null,""]
[null,null,null,null,null,null,null,null,null,null,""]
[null,null,null,null,null,null,null,null,null,null,""]
[null,null,null,null,null,null,null,null,null,null,""]
[null,null,null,null,null,null,null,null,null,null,""]
[null,null,null,null,null,null,null,null,null,null,""]
[null,null,null,null,null,null,null,null,null,null,""]
[null,null,null,null,null,null,null,null,null,null,""]
[null,null,null,null,null,null,null,null,null,null,""]
[null,null,null,null,null,null,null,null,null,null,""]
[null,null,null,null,null,null,null,null,null,null,""]
[null,null,null,null,null,null,null,null,null,null,""]
[null,null,null,null,null,null,null,null,null,null,""]
[null,null,null,null,null,null,null,null,null,null,""]
[null,null,null,null,null,null,null,null,null,null,""]
[null,null,null,null,null,null,null,null,null,null,""]
[null,null,null,null,null,null,null,null,null,null,""]
[null,null,null,null,null,null,null,null,null,null,""]
[null,null,null,null,null,null,null,null,null,null,""]
[null,null,null,null,null,null,null,null,null,null,""]
[null,null,null,null,null,null,null,null,null,null,""]
[null,null,null,null,null,null,null,null,null,null,""]
[null,null,null,null,null,null,null,null,null,null,""]
[null,null,null,null,null,null,null,null,null,null,""]
[null,null,null,null,null,null,null,null,null,null,""]
[null,null,null,null,null,null,null,null,null,null,""]
[null,null,null,null,null,null,null,null,null,null,{"$f":"IF(A578<>\"\",TRIM(B578)&\" \"&TRIM(A578),\"\")","v":""}]
[null,null,null,null,null,null,null,null,null,null,""]
[null,null,null,null,null,null,null,null,null,null,""]
[null,null,null,null,null,null,null,null,null,null,""]
[null,null,null,null,null,null,null,null,null,null,""]
[null,null,null,null,null,null,null,null,null,null,""]
[null,null,null,null,null,null,null,null,null,null,""]
[null,null,null,null,null,null,null,null,null,null,""]
[null,null,null,null,null,null,null,null,null,null,""]
[null,null,null,null,null,null,null,null,null,null,""]
[null,null,null,null,null,null,null,null,null,null,""]
[null,null,null,null,null,null,null,null,null,null,""]
[null,null,null,null,null,null,null,null,null,null,""]
[null,null,null,null,null,null,null,null,null,null,""]
[null,null,null,null,null,null,null,null,null,null,""]
[null,null,null,null,null,null,null,null,null,null,""]
[null,null,null,null,null,null,null,null,null,null,""]
[null,null,null,null,null,null,null,null,null,null,""]
[null,null,null,null,null,null,null,null,null,null,""]
[null,null,null,null,null,null,null,null,null,null,""]
[null,null,null,null,null,null,null,null,null,null,""]
[null,null,null,null,null,null,null,null,null,null,""]
[null,null,null,null,null,null,null,null,null,null,""]
[null,null,null,null,null,null,null,null,null,null,""]
[null,null,null,null,null,null,null,null,null,null,""]
[null,null,null,null,null,null,null,null,null,null,""]
[null,null,null,null,null,null,null,null,null,null,""]
[null,null,null,null,null,null,null,null,null,null,""]
[null,null,null,null,null,null,null,null,null,null,""]
[null,null,null,null,null,null,null,null,null,null,""]
[null,null,null,null,null,null,null,null,null,null,""]
[null,null,null,null,null,null,null,null,null,null,""]
[null,null,null,null,null,null,null,null,null,null,""]
[null,null,null,null,null,null,null,null,null,null,""]
[null,null,null,null,null,null,null,null,null,null,""]
[null,null,null,null,null,null,null,null,null,null,""]
[null,null,null,null,null,null,null,null,null,null,""]
[null,null,null,null,null,null,null,null,null,null,""]
[null,null,null,null,null,null,null,null,null,null,""]
[null,null,null,null,null,null,null,null,null,null,""]
[null,null,null,null,null,null,null,null,null,null,""]
[null,null,null,null,null,null,null,null,null,null,""]
[null,null,null,null,null,null,null,null,null,null,""]
[null,null,null,null,null,null,null,null,null,null,""]
[null,null,null,null,null,null,null,null,null,null,""]
[null,null,null,null,null,null,null,null,null,null,""]
[null,null,null,null,null,null,null,null,null,null,""]
[null,null,null,null,null,null,null,null,null,null,""]
[null,null,null,null,null,null,null,null,null,null,""]
[null,null,null,null,null,null,null,null,null,null,""]
[null,null,null,null,null,null,null,null,null,null,""]
[null,null,null,null,null,null,null,null,null,null,""]
[null,null,null,null,null,null,null,null,null,null,""]
[null,null,null,null,null,null,null,null,null,null,""]
[null,null,null,null,null,null,null,null,null,null,""]
[null,null,null,null,null,null,null,null,null,null,""]
[null,null,null,null,null,null,null,null,null,null,""]
[null,null,null,null,null,null,null,null,null,null,""]
[null,null,null,null,null,null,null,null,null,null,""]
[null,null,null,null,null,null,null,null,null,null,""]
[null,null,null,null,null,null,null,null,null,null,""]
[null,null,null,null,null,null,null,null,null,null,""]
[null,null,null,null,null,null,null,null,null,null,""]
[null,null,null,null,null,null,null,null,null,null,""]
[null,null,null,null,null,null,null,null,null,null,{"$f":"IF(A642<>\"\",TRIM(B642)&\" \"&TRIM(A642),\"\")","v":""}]
[null,null,null,null,null,null,null,null,null,null,""]
[null,null,null,null,null,null,null,null,null,null,""]
[null,null,null,null,null,null,null,null,null,null,""]
[null,null,null,null,null,null,null,null,null,null,""]
[null,null,null,null,null,null,null,null,null,null,""]
[null,null,null,null,null,null,null,null,null,null,""]
[null,null,null,null,null,null,null,null,null,null,""]
[null,null,null,null,null,null,null,null,null,null,""]
[null,null,null,null,null,null,null,null,null,null,""]
[null,null,null,null,null,null,null,null,null,null,""]
[null,null,null,null,null,null,null,null,null,null,""]
[null,null,null,null,null,null,null,null,null,null,""]
[null,null,null,null,null,null,null,null,null,null,""]
[null,null,null,null,null,null,null,null,null,null,""]
[null,null,null,null,null,null,null,null,null,null,""]
[null,null,null,null,null,null,null,null,null,null,""]
[null,null,null,null,null,null,null,null,null,null,""]
[null,null,null,null,null,null,null,null,null,null,""]
[null,null,null,null,null,null,null,null,null,null,""]
[null,null,null,null,null,null,null,null,null,null,""]
[null,null,null,null,null,null,null,null,null,null,""]
[null,null,null,null,null,null,null,null,null,null,""]
[null,null,null,null,null,null,null,null,null,null,""]
[null,null,null,null,null,null,null,null,null,null,""]
[null,null,null,null,null,null,null,null,null,null,""]
[null,null,null,null,null,null,null,null,null,null,""]
[null,null,null,null,null,null,null,null,null,null,""]
[null,null,null,null,null,null,null,null,null,null,""]
[null,null,null,null,null,null,null,null,null,null,""]
[null,null,null,null,null,null,null,null,null,null,""]
[null,null,null,null,null,null,null,null,null,null,""]
[null,null,null,null,null,null,null,null,null,null,""]
[null,null,null,null,null,null,null,null,null,null,""]
[null,null,null,null,null,null,null,null,null,null,""]
[null,null,null,null,null,null,null,null,null,null,""]
[null,null,null,null,null,null,null,null,null,null,""]
[null,null,null,null,null,null,null,null,null,null,""]
[null,null,null,null,null,null,null,null,null,null,""]
[null,null,null,null,null,null,null,null,null,null,""]
[null,null,null,null,null,null,null,null,null,null,""]
[null,null,null,null,null,null,null,null,null,null,""]
[null,null,null,null,null,null,null,null,null,null,""]
[null,null,null,null,null,null,null,null,null,null,""]
[null,null,null,null,null,null,null,null,null,null,""]
[null,null,null,null,null,null,null,null,null,null,""]
[null,null,null,null,null,null,null,null,null,null,""]
[null,null,null,null,null,null,null,null,null,null,""]
[null,null,null,null,null,null,null,null,null,null,""]
[null,null,null,null,null,null,null,null,null,null,""]
[null,null,null,null,null,null,null,null,null,null,""]
[null,null,null,null,null,null,null,null,null,null,""]
[null,null,null,null,null,null,null,null,null,null,""]
[null,null,null,null,null,null,null,null,null,null,""]
[null,null,null,null,null,null,null,null,null,null,""]
[null,null,null,null,null,null,null,null,null,null,""]
[null,null,null,null,null,null,null,null,null,null,""]
[null,null,null,null,null,null,null,null,null,null,""]
[null,null,null,null,null,null,null,null,null,null,""]
[null,null,null,null,null,null,null,null,null,null,""]
[null,null,null,null,null,null,null,null,null,null,""]
[null,null,null,null,null,null,null,null,null,null,""]
[null,null,null,null,null,null,null,null,null,null,""]
[null,null,null,null,null,null,null,null,null,null,""]
[null,null,null,null,null,null,null,null,null,null,{"$f":"IF(A706<>\"\",TRIM(B706)&\" \"&TRIM(A706),\"\")","v":""}]
[null,null,null,null,null,null,null,null,null,null,""]
[null,null,null,null,null,null,null,null,null,null,""]
[null,null,null,null,null,null,null,null,null,null,""]
[null,null,null,null,null,null,null,null,null,null,""]
[null,null,null,null,null,null,null,null,null,null,""]
[null,null,null,null,null,null,null,null,null,null,""]
[null,null,null,null,null,null,null,null,null,null,""]
[null,null,null,null,null,null,null,null,null,null,""]
[null,null,null,null,null,null,null,null,null,null,""]
[null,null,null,null,null,null,null,null,null,null,""]
[null,null,null,null,null,null,null,null,null,null,""]
[null,null,null,null,null,null,null,null,null,null,""]
[null,null,null,null,null,null,null,null,null,null,""]
[null,null,null,null,null,null,null,null,null,null,""]
[null,null,null,null,null,null,null,null,null,null,""]
[null,null,null,null,null,null,null,null,null,null,""]
[null,null,null,null,null,null,null,null,null,null,""]
[null,null,null,null,null,null,null,null,null,null,""]
[null,null,null,null,null,null,null,null,null,null,""]
[null,null,null,null,null,null,null,null,null,null,""]
[null,null,null,null,null,null,null,null,null,null,""]
[null,null,null,null,null,null,null,null,null,null,""]
[null,null,null,null,null,null,null,null,null,null,""]
[null,null,null,null,null,null,null,null,null,null,""]
[null,null,null,null,null,null,null,null,null,null,""]
[null,null,null,null,null,null,null,null,null,null,""]
[null,null,null,null,null,null,null,null,null,null,""]
[null,null,null,null,null,null,null,null,null,null,""]
[null,null,null,null,null,null,null,null,null,null,""]
[null,null,null,null,null,null,null,null,null,null,""]
[null,null,null,null,null,null,null,null,null,null,""]
[null,null,null,null,null,null,null,null,null,null,""]
[null,null,null,null,null,null,null,null,null,null,""]
[null,null,null,null,null,null,null,null,null,null,""]
[null,null,null,null,null,null,null,null,null,null,""]
[null,null,null,null,null,null,null,null,null,null,""]
[null,null,null,null,null,null,null,null,null,null,""]
[null,null,null,null,null,null,null,null,null,null,""]
[null,null,null,null,null,null,null,null,null,null,""]
[null,null,null,null,null,null,null,null,null,null,""]
[null,null,null,null,null,null,null,null,null,null,""]
[null,null,null,null,null,null,null,null,null,null,""]
[null,null,null,null,null,null,null,null,null,null,""]
[null,null,null,null,null,null,null,null,null,null,""]
[null,null,null,null,null,null,null,null,null,null,""]
[null,null,null,null,null,null,null,null,null,null,""]
[null,null,null,null,null,null,null,null,null,null,""]
[null,null,null,null,null,null,null,null,null,null,""]
[null,null,null,null,null,null,null,null,null,null,""]
[null,null,null,null,null,null,null,null,null,null,""]
[null,null,null,null,null,null,null,null,null,null,""]
[null,null,null,null,null,null,null,null,null,null,""]
[null,null,null,null,null,null,null,null,null,null,""]
[null,null,null,null,null,null,null,null,null,null,""]
[null,null,null,null,null,null,null,null,null,null,""]
[null,null,null,null,null,null,null,null,null,null,""]
[null,null,null,null,null,null,null,null,null,null,""]
[null,null,null,null,null,null,null,null,null,null,""]
[null,null,null,null,null,null,null,null,null,null,""]
[null,null,null,null,null,null,null,null,null,null,""]
[null,null,null,null,null,null,null,null,null,null,""]
[null,null,null,null,null,null,null,null,null,null,""]
[null,null,null,null,null,null,null,null,null,null,""]
[null,null,null,null,null,null,null,null,null,null,{"$f":"IF(A770<>\"\",TRIM(B770)&\" \"&TRIM(A770),\"\")","v":""}]
[null,null,null,null,null,null,null,null,null,null,""]
[null,null,null,null,null,null,null,null,null,null,""]
[null,null,null,null,null,null,null,null,null,null,""]
[null,null,null,null,null,null,null,null,null,null,""]
[null,null,null,null,null,null,null,null,null,null,""]
[null,null,null,null,null,null,null,null,null,null,""]
[null,null,null,null,null,null,null,null,null,null,""]
[null,null,null,null,null,null,null,null,null,null,""]
[null,null,null,null,null,null,null,null,null,null,""]
[null,null,null,null,null,null,null,null,null,null,""]
[null,null,null,null,null,null,null,null,null,null,""]
[null,null,null,null,null,null,null,null,null,null,""]
[null,null,null,null,null,null,null,null,null,null,""]
[null,null,null,null,null,null,null,null,null,null,""]
[null,null,null,null,null,null,null,null,null,null,""]
[null,null,null,null,null,null,null,null,null,null,""]
[null,null,null,null,null,null,null,null,null,null,""]
[null,null,null,null,null,null,null,null,null,null,""]
[null,null,null,null,null,null,null,null,null,null,""]
[null,null,null,null,null,null,null,null,null,null,""]
[null,null,null,null,null,null,null,null,null,null,""]
[null,null,null,null,null,null,null,null,null,null,""]
[null,null,null,null,null,null,null,null,null,null,""]
[null,null,null,null,null,null,null,null,null,null,""]
[null,null,null,null,null,null,null,null,null,null,""]
[null,null,null,null,null,null,null,null,null,null,""]
[null,null,null,null,null,null,null,null,null,null,""]
[null,null,null,null,null,null,null,null,null,null,""]
[null,null,null,null,null,null,null,null,null,null,""]
[null,null,null,null,null,null,null,null,null,null,""]
[null,null,null,null,null,null,null,null,null,null,""]
[null,null,null,null,null,null,null,null,null,null,""]
[null,null,null,null,null,null,null,null,null,null,""]
[null,null,null,null,null,null,null,null,null,null,""]
[null,null,null,null,null,null,null,null,null,null,""]
[null,null,null,null,null,null,null,null,null,null,""]
[null,null,null,null,null,null,null,null,null,null,""]
[null,null,null,null,null,null,null,null,null,null,""]
[null,null,null,null,null,null,null,null,null,null,""]
[null,null,null,null,null,null,null,null,null,null,""]
[null,null,null,null,null,null,null,null,null,null,""]
[null,null,null,null,null,null,null,null,null,null,""]
[null,null,null,null,null,null,null,null,null,null,""]
[null,null,null,null,null,null,null,null,null,null,""]
[null,null,null,null,null,null,null,null,null,null,""]
[null,null,null,null,null,null,null,null,null,null,""]
[null,null,null,null,null,null,null,null,null,null,""]
[null,null,null,null,null,null,null,null,null,null,""]
[null,null,null,null,null,null,null,null,null,null,""]
[null,null,null,null,null,null,null,null,null,null,""]
[null,null,null,null,null,null,null,null,null,null,""]
[null,null,null,null,null,null,null,null,null,null,""]
[null,null,null,null,null,null,null,null,null,null,""]
[null,null,null,null,null,null,null,null,null,null,""]
[null,null,null,null,null,null,null,null,null,null,""]
[null,null,null,null,null,null,null,null,null,null,""]
[null,null,null,null,null,null,null,null,null,null,""]
[null,null,null,null,null,null,null,null,null,null,""]
[null,null,null,null,null,null,null,null,null,null,""]
[null,null,null,null,null,null,null,null,null,null,""]
[null,null,null,null,null,null,null,null,null,null,""]
[null,null,null,null,null,null,null,null,null,null,""]
[null,null,null,null,null,null,null,null,null,null,""]
[null,null,null,null,null,null,null,null,null,null,{"$f":"IF(A834<>\"\",TRIM(B834)&\" \"&TRIM(A834),\"\")","v":""}]
[null,null,null,null,null,null,null,null,null,null,""]
[null,null,null,null,null,null,null,null,null,null,""]
[null,null,null,null,null,null,null,null,null,null,""]
[null,null,null,null,null,null,null,null,null,null,""]
[null,null,null,null,null,null,null,null,null,null,""]
[null,null,null,null,null,null,null,null,null,null,""]
[null,null,null,null,null,null,null,null,null,null,""]
[null,null,null,null,null,null,null,null,null,null,""]
[null,null,null,null,null,null,null,null,null,null,""]
[null,null,null,null,null,null,null,null,null,null,""]
[null,null,null,null,null,null,null,null,null,null,""]
[null,null,null,null,null,null,null,null,null,null,""]
[null,null,null,null,null,null,null,null,null,null,""]
[null,null,null,null,null,null,null,null,null,null,""]
[null,null,null,null,null,null,null,null,null,null,""]
[null,null,null,null,null,null,null,null,null,null,""]
[null,null,null,null,null,null,null,null,null,null,""]
[null,null,null,null,null,null,null,null,null,null,""]
[null,null,null,null,null,null,null,null,null,null,""]
[null,null,null,null,null,null,null,null,null,null,""]
[null,null,null,null,null,null,null,null,null,null,""]
[null,null,null,null,null,null,null,null,null,null,""]
[null,null,null,null,null,null,null,null,null,null,""]
[null,null,null,null,null,null,null,null,null,null,""]
[null,null,null,null,null,null,null,null,null,null,""]
[null,null,null,null,null,null,null,null,null,null,""]
[null,null,null,null,null,null,null,null,null,null,""]
[null,null,null,null,null,null,null,null,null,null,""]
[null,null,null,null,null,null,null,null,null,null,""]
[null,null,null,null,null,null,null,null,null,null,""]
[null,null,null,null,null,null,null,null,null,null,""]
[null,null,null,null,null,null,null,null,null,null,""]
[null,null,null,null,null,null,null,null,null,null,""]
[null,null,null,null,null,null,null,null,null,null,""]
[null,null,null,null,null,null,null,null,null,null,""]
[null,null,null,null,null,null,null,null,null,null,""]
[null,null,null,null,null,null,null,null,null,null,""]
[null,null,null,null,null,null,null,null,null,null,""]
[null,null,null,null,null,null,null,null,null,null,""]
[null,null,null,null,null,null,null,null,null,null,""]
[null,null,null,null,null,null,null,null,null,null,""]
[null,null,null,null,null,null,null,null,null,null,""]
[null,null,null,null,null,null,null,null,null,null,""]
[null,null,null,null,null,null,null,null,null,null,""]
[null,null,null,null,null,null,null,null,null,null,""]
[null,null,null,null,null,null,null,null,null,null,""]
[null,null,null,null,null,null,null,null,null,null,""]
[null,null,null,null,null,null,null,null,null,null,""]
[null,null,null,null,null,null,null,null,null,null,""]
[null,null,null,null,null,null,null,null,null,null,""]
[null,null,null,null,null,null,null,null,null,null,""]
[null,null,null,null,null,null,null,null,null,null,""]
[null,null,null,null,null,null,null,null,null,null,""]
[null,null,null,null,null,null,null,null,null,null,""]
[null,null,null,null,null,null,null,null,null,null,""]
[null,null,null,null,null,null,null,null,null,null,""]
[null,null,null,null,null,null,null,null,null,null,""]
[null,null,null,null,null,null,null,null,null,null,""]
[null,null,null,null,null,null,null,null,null,null,""]
[null,null,null,null,null,null,null,null,null,null,""]
[null,null,null,null,null,null,null,null,null,null,""]
[null,null,null,null,null,null,null,null,null,null,""]
[null,null,null,null,null,null,null,null,null,null,""]
[null,null,null,null,null,null,null,null,null,null,{"$f":"IF(A898<>\"\",TRIM(B898)&\" \"&TRIM(A898),\"\")","v":""}]
[null,null,null,null,null,null,null,null,null,null,""]
[null,null,null,null,null,null,null,null,null,null,""]
[null,null,null,null,null,null,null,null,null,null,""]
[null,null,null,null,null,null,null,null,null,null,""]
[null,null,null,null,null,null,null,null,null,null,""]
[null,null,null,null,null,null,null,null,null,null,""]
[null,null,null,null,null,null,null,null,null,null,""]
[null,null,null,null,null,null,null,null,null,null,""]
[null,null,null,null,null,null,null,null,null,null,""]
[null,null,null,null,null,null,null,null,null,null,""]
[null,null,null,null,null,null,null,null,null,null,""]
[null,null,null,null,null,null,null,null,null,null,""]
[null,null,null,null,null,null,null,null,null,null,""]
[null,null,null,null,null,null,null,null,null,null,""]
[null,null,null,null,null,null,null,null,null,null,""]
[null,null,null,null,null,null,null,null,null,null,""]
[null,null,null,null,null,null,null,null,null,null,""]
[null,null,null,null,null,null,null,null,null,null,""]
[null,null,null,null,null,null,null,null,null,null,""]
[null,null,null,null,null,null,null,null,null,null,""]
[null,null,null,null,null,null,null,null,null,null,""]
[null,null,null,null,null,null,null,null,null,null,""]
[null,null,null,null,null,null,null,null,null,null,""]
[null,null,null,null,null,null,null,null,null,null,""]
[null,null,null,null,null,null,null,null,null,null,""]
[null,null,null,null,null,null,null,null,null,null,""]
[null,null,null,null,null,null,null,null,null,null,""]
[null,null,null,null,null,null,null,null,null,null,""]
[null,null,null,null,null,null,null,null,null,null,""]
[null,null,null,null,null,null,null,null,null,null,""]
[null,null,null,null,null,null,null,null,null,null,""]
[null,null,null,null,null,null,null,null,null,null,""]
[null,null,null,null,null,null,null,null,null,null,""]
[null,null,null,null,null,null,null,null,null,null,""]
[null,null,null,null,null,null,null,null,null,null,""]
[null,null,null,null,null,null,null,null,null,null,""]
[null,null,null,null,null,null,null,null,null,null,""]
[null,null,null,null,null,null,null,null,null,null,""]
[null,null,null,null,null,null,null,null,null,null,""]
[null,null,null,null,null,null,null,null,null,null,""]
[null,null,null,null,null,null,null,null,null,null,""]
[null,null,null,null,null,null,null,null,null,null,""]
[null,null,null,null,null,null,null,null,null,null,""]
[null,null,null,null,null,null,null,null,null,null,""]
[null,null,null,null,null,null,null,null,null,null,""]
[null,null,null,null,null,null,null,null,null,null,""]
[null,null,null,null,null,null,null,null,null,null,""]
[null,null,null,null,null,null,null,null,null,null,""]
[null,null,null,null,null,null,null,null,null,null,""]
[null,null,null,null,null,null,null,null,null,null,""]
[null,null,null,null,null,null,null,null,null,null,""]
[null,null,null,null,null,null,null,null,null,null,""]
[null,null,null,null,null,null,null,null,null,null,""]
[null,null,null,null,null,null,null,null,null,null,""]
[null,null,null,null,null,null,null,null,null,null,""]
[null,null,null,null,null,null,null,null,null,null,""]
[null,null,null,null,null,null,null,null,null,null,""]
[null,null,null,null,null,null,null,null,null,null,""]
[null,null,null,null,null,null,null,null,null,null,""]
[null,null,null,null,null,null,null,null,null,null,""]
[null,null,null,null,null,null,null,null,null,null,""]
[null,null,null,null,null,null,null,null,null,null,""]
[null,null,null,null,null,null,null,null,null,null,""]
[null,null,null,null,null,null,null,null,null,null,{"$f":"IF(A962<>\"\",TRIM(B962)&\" \"&TRIM(A962),\"\")","v":""}]
[null,null,null,null,null,null,null,null,null,null,""]
[null,null,null,null,null,null,null,null,null,null,""]
[null,null,null,null,null,null,null,null,null,null,""]
[null,null,null,null,null,null,null,null,null,null,""]
[null,null,null,null,null,null,null,null,null,null,""]
[null,null,null,null,null,null,null,null,null,null,""]
[null,null,null,null,null,null,null,null,null,null,""]
[null,null,null,null,null,null,null,null,null,null,""]
[null,null,null,null,null,null,null,null,null,null,""]
[null,null,null,null,null,null,null,null,null,null,""]
[null,null,null,null,null,null,null,null,null,null,""]
[null,null,null,null,null,null,null,null,null,null,""]
[null,null,null,null,null,null,null,null,null,null,""]
[null,null,null,null,null,null,null,null,null,null,""]
[null,null,null,null,null,null,null,null,null,null,""]
[null,null,null,null,null,null,null,null,null,null,""]
[null,null,null,null,null,null,null,null,null,null,""]
[null,null,null,null,null,null,null,null,null,null,""]
[null,null,null,null,null,null,null,null,null,null,""]
[null,null,null,null,null,null,null,null,null,null,""]
[null,null,null,null,null,null,null,null,null,null,""]
[null,null,null,null,null,null,null,null,null,null,""]
[null,null,null,null,null,null,null,null,null,null,""]
[null,null,null,null,null,null,null,null,null,null,""]
[null,null,null,null,null,null,null,null,null,null,""]
[null,null,null,null,null,null,null,null,null,null,""]
[null,null,null,null,null,null,null,null,null,null,""]
[null,null,null,null,null,null,null,null,null,null,""]
[null,null,null,null,null,null,null,null,null,null,""]
[null,null,null,null,null,null,null,null,null,null,""]
[null,null,null,null,null,null,null,null,null,null,""]
[null,null,null,null,null,null,null,null,null,null,""]
[null,null,null,null,null,null,null,null,null,null,""]
[null,null,null,null,null,null,null,null,null,null,""]
[null,null,null,null,null,null,null,null,null,null,""]
[null,null,null,null,null,null,null,null,null,null,""]
[null,null,null,null,null,null,null,null,null,null,""]
[null,null,null,null,null,null,null,null,null,null,""]

{"sheet":"Events and Times","index":2,"n_rows":112,"n_cols":43,"rows_kept":112,"cut":false,"hidden":false,"merged":[[7,2,7,4],[9,2,10,3],[6,2,6,4],[1,2,1,4],[2,2,2,4],[3,2,3,4],[4,2,4,4],[5,2,5,4]]}
["Press Ctrl-P to print results",null,null,null,null,null,null,null,null,null,null,null,null,null,null,null,null,null,null,null,null,null,null,null,null,null,null,null,null,null,"Do not edit the cells below, they are updated using formulas that will break if you do. Copy and 'paste values' in to a different sheet to play with them."]
["Event Date",null,"2021-05-16",null,null,null,null,null,null,null,null,null,null,"LevelX",null,null,null,null,null,null,null,null,null,null,null,null,null,null,null,null,"Printable Results"]
["Event Name",null,"Level X racing",null,null,"(max 48 characters)",null,null,null,null,null,null,null,null,null,null,null,null,null,null,null,null,null,null,null,null,null,null,null,null,"Events to print",{"$f":"COUNTA(E11:N11)","v":10}]
["Event Venue",null,"Tunbridge Wells",null,null,"(max 20 characters)",null,null,null,null,null,null,null,null,null,null,null,null,null,null,null,null,null,null,null,null,null,null,null,null,"Swimmer to print",{"$f":"COUNTIF(B13:B112,\">0\")","v":4}]
["Session",null,1,null,null,"(give each session in an event a unique number 1-99 to ensure the results files have unique names)"]
["Licence Number",null,null,null,null,"(not needed for LevelX)",null,null,null,null,null,null,null,null,null,null,null,null,"The results in yellow are saved in the results files"]
["Pool Length",null,25,null,null,"(Level X is 25m, but useful for later)",null,null,null,null,null,null,null,null,null,null,null,null,"Contents for .HDR file:",{"$f":"\"LX\"&TEXT($C$2,\"YY\")&IF(ISNUMBER($C$5),IF($C$5>9,$C$5,\"S\"&$C$5),\"S1\")&\".HDR\"","v":"LX21S1.HDR"}]
["Age at date",null,"2021-12-31",null,null,"(useful to show the swimmers age group)",null,null,null,null,null,null,null,null,null,null,null,null,{"$f":"LEFT(C3,48)&\",\"&LEFT(C4,20)&\",\"&TEXT(C2,\"ddmmYY\")&\",\"&IF(C7=25,\"31\",\"11\")","v":"Level X racing,Tunbridge Wells,160521,31"}]
[null,null,null,null,"Times to be entered without punctuation and with hundredths e.g.  45.23 seconds is entered as 4523 and 1:09.10 is entered as 10910",null,null,null,null,null,null,null,null,null,null,null,null,null,null,null,null,null,null,null,null,null,null,null,null,null,"Do not edit the cells below, they are updated using formulas that will break if you do. Copy and 'paste values' in to a different sheet to play with them."]
[null,null,"Event",null,1,2,3,4,5,6,7,8,9,10,null,null,null,null,"NDF event code for MRF file:",null,null,null,null,null,null,null,null,null,null,null,{"$f":"C2","v":"2021-05-16"},null,null,{"$f":"C3","v":"Level X racing"},null,null,null,{"$f":"C4","v":"Tunbridge Wells"},null,null,null,"Session",{"$f":"C5","v":1}]
[null,null,null,null,"50m BUTTERFLY","50m BACKSTROKE","50m BREASTSTROKE","50m FREESTYLE","100m FREESTYLE","100m BREASTSTROKE","200m BUTTERFLY","100m BACKSTROKE","100m INDIVIDUAL MEDLEY","200m INDIVIDUAL MEDLEY",null,null,null,null,{"$f":"IF(E11<>\"\",INDEX(NDF_events_code,MATCH(E11,NDF_events,0)),\"\")","v":"10"},"13","07","01","02","08","12","14","29","16",null,null,"Swimmer","Age","Sex",{"$f":"IF(E11<>\"\",INDEX(NDF_events_abbreviation,MATCH(E11,NDF_events,0)),\"\")","v":"50m FLY"},"50m BC","50m BRST","50m FC","100m FC","100m BRST","200m FLY","100m BC","100m IM","200m IM"]
["Swimmer",null,"Age","Sex","Time","Time","Time","Time","Time","Time","Time","Time","Time","Time",null,null,null,null,"Contents for .MRF file:",{"$f":"\"LX\"&TEXT($C$2,\"YY\")&IF(ISNUMBER($C$5),IF($C$5>9,$C$5,\"S\"&$C$5),\"S1\")&\".MRF\"","v":"LX21S1.MRF"}]
["Fred Fish",{"$f":"IF(A13<>\"\",IFERROR(MATCH(A13,swimmers_fullname,0),0),\"\")","v":1},{"$f":"IF(AND(ISNUMBER(B13),B13>0),DATEDIF(INDEX(swimmers_data,B13,3),$C$8,\"Y\"),\"\")","v":15},{"$f":"IF(AND(ISNUMBER(B13),B13>0),INDEX(swimmers_data,B13,5),\"\")","v":"M"},"4401",4402,null,4404,14405,14406,14407,14408,14409,24410,null,null,null,null,{"$f":"IF(AND(ISNUMBER($B13),$B13>0,E13<>\"\"),INDEX(swimmers_data,$B13,5)&\",\"&INDEX(swimmers_data,$B13,1)&\",\"&INDEX(swimmers_data,$B13,2)&\",\"&INDEX(swimmers_data,$B13,4)&\",\"&TEXT(INDEX(swimmers_data,$B13,3),\"ddmmYy\")&\",\"&LEFT(\"000000\",6-LEN(E13))&E13&\",\"&S$11&\",\"&\"F\",\"\")","v":"M,Fish,Fred,RTW Monson,201106,004401,10,F"},{"$f":"IF(AND(ISNUMBER($B13),$B13>0,F13<>\"\"),INDEX(swimmers_data,$B13,5)&\",\"&INDEX(swimmers_data,$B13,1)&\",\"&INDEX(swimmers_data,$B13,2)&\",\"&INDEX(swimmers_data,$B13,4)&\",\"&TEXT(INDEX(swimmers_data,$B13,3),\"ddmmYy\")&\",\"&LEFT(\"000000\",6-LEN(F13))&F13&\",\"&T$11&\",\"&\"F\",\"\")","v":"M,Fish,Fred,RTW Monson,201106,004402,13,F"},{"$f":"IF(AND(ISNUMBER($B13),$B13>0,G13<>\"\"),INDEX(swimmers_data,$B13,5)&\",\"&INDEX(swimmers_data,$B13,1)&\",\"&INDEX(swimmers_data,$B13,2)&\",\"&INDEX(swimmers_data,$B13,4)&\",\"&TEXT(INDEX(swimmers_data,$B13,3),\"ddmmYy\")&\",\"&LEFT(\"000000\",6-LEN(G13))&G13&\",\"&U$11&\",\"&\"F\",\"\")","v":""},{"$f":"IF(AND(ISNUMBER($B13),$B13>0,H13<>\"\"),INDEX(swimmers_data,$B13,5)&\",\"&INDEX(swimmers_data,$B13,1)&\",\"&INDEX(swimmers_data,$B13,2)&\",\"&INDEX(swimmers_data,$B13,4)&\",\"&TEXT(INDEX(swimmers_data,$B13,3),\"ddmmYy\")&\",\"&LEFT(\"000000\",6-LEN(H13))&H13&\",\"&V$11&\",\"&\"F\",\"\")","v":"M,Fish,Fred,RTW Monson,201106,004404,01,F"},{"$f":"IF(AND(ISNUMBER($B13),$B13>0,I13<>\"\"),INDEX(swimmers_data,$B13,5)&\",\"&INDEX(swimmers_data,$B13,1)&\",\"&INDEX(swimmers_data,$B13,2)&\",\"&INDEX(swimmers_data,$B13,4)&\",\"&TEXT(INDEX(swimmers_data,$B13,3),\"ddmmYy\")&\",\"&LEFT(\"000000\",6-LEN(I13))&I13&\",\"&W$11&\",\"&\"F\",\"\")","v":"M,Fish,Fred,RTW Monson,201106,014405,02,F"},{"$f":"IF(AND(ISNUMBER($B13),$B13>0,J13<>\"\"),INDEX(swimmers_data,$B13,5)&\",\"&INDEX(swimmers_data,$B13,1)&\",\"&INDEX(swimmers_data,$B13,2)&\",\"&INDEX(swimmers_data,$B13,4)&\",\"&TEXT(INDEX(swimmers_data,$B13,3),\"ddmmYy\")&\",\"&LEFT(\"000000\",6-LEN(J13))&J13&\",\"&X$11&\",\"&\"F\",\"\")","v":"M,Fish,Fred,RTW Monson,201106,014406,08,F"},{"$f":"IF(AND(ISNUMBER($B13),$B13>0,K13<>\"\"),INDEX(swimmers_data,$B13,5)&\",\"&INDEX(swimmers_data,$B13,1)&\",\"&INDEX(swimmers_data,$B13,2)&\",\"&INDEX(swimmers_data,$B13,4)&\",\"&TEXT(INDEX(swimmers_data,$B13,3),\"ddmmYy\")&\",\"&LEFT(\"000000\",6-LEN(K13))&K13&\",\"&Y$11&\",\"&\"F\",\"\")","v":"M,Fish,Fred,RTW Monson,201106,014407,12,F"},{"$f":"IF(AND(ISNUMBER($B13),$B13>0,L13<>\"\"),INDEX(swimmers_data,$B13,5)&\",\"&INDEX(swimmers_data,$B13,1)&\",\"&INDEX(swimmers_data,$B13,2)&\",\"&INDEX(swimmers_data,$B13,4)&\",\"&TEXT(INDEX(swimmers_data,$B13,3),\"ddmmYy\")&\",\"&LEFT(\"000000\",6-LEN(L13))&L13&\",\"&Z$11&\",\"&\"F\",\"\")","v":"M,Fish,Fred,RTW Monson,201106,014408,14,F"},{"$f":"IF(AND(ISNUMBER($B13),$B13>0,M13<>\"\"),INDEX(swimmers_data,$B13,5)&\",\"&INDEX(swimmers_data,$B13,1)&\",\"&INDEX(swimmers_data,$B13,2)&\",\"&INDEX(swimmers_data,$B13,4)&\",\"&TEXT(INDEX(swimmers_data,$B13,3),\"ddmmYy\")&\",\"&LEFT(\"000000\",6-LEN(M13))&M13&\",\"&AA$11&\",\"&\"F\",\"\")","v":"M,Fish,Fred,RTW Monson,201106,014409,29,F"},{"$f":"IF(AND(ISNUMBER($B13),$B13>0,N13<>\"\"),INDEX(swimmers_data,$B13,5)&\",\"&INDEX(swimmers_data,$B13,1)&\",\"&INDEX(swimmers_data,$B13,2)&\",\"&INDEX(swimmers_data,$B13,4)&\",\"&TEXT(INDEX(swimmers_data,$B13,3),\"ddmmYy\")&\",\"&LEFT(\"000000\",6-LEN(N13))&N13&\",\"&AB$11&\",\"&\"F\",\"\")","v":"M,Fish,Fred,RTW Monson,201106,024410,16,F"},null,null,{"$f":"IF(AND(ISNUMBER($B13),$B13>0),A13,\"\")","v":"Fred Fish"},{"$f":"C13","v":15},{"$f":"D13","v":"M"},{"$f":"IF(AND(ISNUMBER($B13),$B13>0,E13<>\"\"),formatMMSSHHtime(E13),\"\")","v":"44.01"},{"$f":"IF(AND(ISNUMBER($B13),$B13>0,F13<>\"\"),formatMMSSHHtime(F13),\"\")","v":"44.02"},{"$f":"IF(AND(ISNUMBER($B13),$B13>0,G13<>\"\"),formatMMSSHHtime(G13),\"\")","v":""},{"$f":"IF(AND(ISNUMBER($B13),$B13>0,H13<>\"\"),formatMMSSHHtime(H13),\"\")","v":"44.04"},{"$f":"IF(AND(ISNUMBER($B13),$B13>0,I13<>\"\"),formatMMSSHHtime(I13),\"\")","v":"1:44.05"},{"$f":"IF(AND(ISNUMBER($B13),$B13>0,J13<>\"\"),formatMMSSHHtime(J13),\"\")","v":"1:44.06"},{"$f":"IF(AND(ISNUMBER($B13),$B13>0,K13<>\"\"),formatMMSSHHtime(K13),\"\")","v":"1:44.07"},{"$f":"IF(AND(ISNUMBER($B13),$B13>0,L13<>\"\"),formatMMSSHHtime(L13),\"\")","v":"1:44.08"},{"$f":"IF(AND(ISNUMBER($B13),$B13>0,M13<>\"\"),formatMMSSHHtime(M13),\"\")","v":"1:44.09"},{"$f":"IF(AND(ISNUMBER($B13),$B13>0,N13<>\"\"),formatMMSSHHtime(N13),\"\")","v":"2:44.10"}]
["Fishn Chips",9,{"$f":"IF(AND(ISNUMBER(B14),B14>0),DATEDIF(INDEX(swimmers_data,B14,3),$C$8,\"Y\"),\"\")","v":10},{"$f":"IF(AND(ISNUMBER(B14),B14>0),INDEX(swimmers_data,B14,5),\"\")","v":"M"},5501,null,5503,5504,null,null,null,null,null,"105510",null,null,null,null,{"$f":"IF(AND(ISNUMBER($B14),$B14>0,E14<>\"\"),INDEX(swimmers_data,$B14,5)&\",\"&INDEX(swimmers_data,$B14,1)&\",\"&INDEX(swimmers_data,$B14,2)&\",\"&INDEX(swimmers_data,$B14,4)&\",\"&TEXT(INDEX(swimmers_data,$B14,3),\"ddmmYy\")&\",\"&LEFT(\"000000\",6-LEN(E14))&E14&\",\"&S$11&\",\"&\"F\",\"\")","v":"M,Chips,Fishn,RTW Monson,040111,005501,10,F"},{"$f":"IF(AND(ISNUMBER($B14),$B14>0,F14<>\"\"),INDEX(swimmers_data,$B14,5)&\",\"&INDEX(swimmers_data,$B14,1)&\",\"&INDEX(swimmers_data,$B14,2)&\",\"&INDEX(swimmers_data,$B14,4)&\",\"&TEXT(INDEX(swimmers_data,$B14,3),\"ddmmYy\")&\",\"&LEFT(\"000000\",6-LEN(F14))&F14&\",\"&T$11&\",\"&\"F\",\"\")","v":""},{"$f":"IF(AND(ISNUMBER($B14),$B14>0,G14<>\"\"),INDEX(swimmers_data,$B14,5)&\",\"&INDEX(swimmers_data,$B14,1)&\",\"&INDEX(swimmers_data,$B14,2)&\",\"&INDEX(swimmers_data,$B14,4)&\",\"&TEXT(INDEX(swimmers_data,$B14,3),\"ddmmYy\")&\",\"&LEFT(\"000000\",6-LEN(G14))&G14&\",\"&U$11&\",\"&\"F\",\"\")","v":"M,Chips,Fishn,RTW Monson,040111,005503,07,F"},{"$f":"IF(AND(ISNUMBER($B14),$B14>0,H14<>\"\"),INDEX(swimmers_data,$B14,5)&\",\"&INDEX(swimmers_data,$B14,1)&\",\"&INDEX(swimmers_data,$B14,2)&\",\"&INDEX(swimmers_data,$B14,4)&\",\"&TEXT(INDEX(swimmers_data,$B14,3),\"ddmmYy\")&\",\"&LEFT(\"000000\",6-LEN(H14))&H14&\",\"&V$11&\",\"&\"F\",\"\")","v":"M,Chips,Fishn,RTW Monson,040111,005504,01,F"},{"$f":"IF(AND(ISNUMBER($B14),$B14>0,I14<>\"\"),INDEX(swimmers_data,$B14,5)&\",\"&INDEX(swimmers_data,$B14,1)&\",\"&INDEX(swimmers_data,$B14,2)&\",\"&INDEX(swimmers_data,$B14,4)&\",\"&TEXT(INDEX(swimmers_data,$B14,3),\"ddmmYy\")&\",\"&LEFT(\"000000\",6-LEN(I14))&I14&\",\"&W$11&\",\"&\"F\",\"\")","v":""},{"$f":"IF(AND(ISNUMBER($B14),$B14>0,J14<>\"\"),INDEX(swimmers_data,$B14,5)&\",\"&INDEX(swimmers_data,$B14,1)&\",\"&INDEX(swimmers_data,$B14,2)&\",\"&INDEX(swimmers_data,$B14,4)&\",\"&TEXT(INDEX(swimmers_data,$B14,3),\"ddmmYy\")&\",\"&LEFT(\"000000\",6-LEN(J14))&J14&\",\"&X$11&\",\"&\"F\",\"\")","v":""},{"$f":"IF(AND(ISNUMBER($B14),$B14>0,K14<>\"\"),INDEX(swimmers_data,$B14,5)&\",\"&INDEX(swimmers_data,$B14,1)&\",\"&INDEX(swimmers_data,$B14,2)&\",\"&INDEX(swimmers_data,$B14,4)&\",\"&TEXT(INDEX(swimmers_data,$B14,3),\"ddmmYy\")&\",\"&LEFT(\"000000\",6-LEN(K14))&K14&\",\"&Y$11&\",\"&\"F\",\"\")","v":""},{"$f":"IF(AND(ISNUMBER($B14),$B14>0,L14<>\"\"),INDEX(swimmers_data,$B14,5)&\",\"&INDEX(swimmers_data,$B14,1)&\",\"&INDEX(swimmers_data,$B14,2)&\",\"&INDEX(swimmers_data,$B14,4)&\",\"&TEXT(INDEX(swimmers_data,$B14,3),\"ddmmYy\")&\",\"&LEFT(\"000000\",6-LEN(L14))&L14&\",\"&Z$11&\",\"&\"F\",\"\")","v":""},{"$f":"IF(AND(ISNUMBER($B14),$B14>0,M14<>\"\"),INDEX(swimmers_data,$B14,5)&\",\"&INDEX(swimmers_data,$B14,1)&\",\"&INDEX(swimmers_data,$B14,2)&\",\"&INDEX(swimmers_data,$B14,4)&\",\"&TEXT(INDEX(swimmers_data,$B14,3),\"ddmmYy\")&\",\"&LEFT(\"000000\",6-LEN(M14))&M14&\",\"&AA$11&\",\"&\"F\",\"\")","v":""},{"$f":"IF(AND(ISNUMBER($B14),$B14>0,N14<>\"\"),INDEX(swimmers_data,$B14,5)&\",\"&INDEX(swimmers_data,$B14,1)&\",\"&INDEX(swimmers_data,$B14,2)&\",\"&INDEX(swimmers_data,$B14,4)&\",\"&TEXT(INDEX(swimmers_data,$B14,3),\"ddmmYy\")&\",\"&LEFT(\"000000\",6-LEN(N14))&N14&\",\"&AB$11&\",\"&\"F\",\"\")","v":"M,Chips,Fishn,RTW Monson,040111,105510,16,F"},null,null,{"$f":"IF(AND(ISNUMBER($B14),$B14>0),A14,\"\")","v":"Fishn Chips"},{"$f":"C14","v":10},{"$f":"D14","v":"M"},{"$f":"IF(AND(ISNUMBER($B14),$B14>0,E14<>\"\"),formatMMSSHHtime(E14),\"\")","v":"55.01"},{"$f":"IF(AND(ISNUMBER($B14),$B14>0,F14<>\"\"),formatMMSSHHtime(F14),\"\")","v":""},{"$f":"IF(AND(ISNUMBER($B14),$B14>0,G14<>\"\"),formatMMSSHHtime(G14),\"\")","v":"55.03"},{"$f":"IF(AND(ISNUMBER($B14),$B14>0,H14<>\"\"),formatMMSSHHtime(H14),\"\")","v":"55.04"},{"$f":"IF(AND(ISNUMBER($B14),$B14>0,I14<>\"\"),formatMMSSHHtime(I14),\"\")","v":""},{"$f":"IF(AND(ISNUMBER($B14),$B14>0,J14<>\"\"),formatMMSSHHtime(J14),\"\")","v":""},{"$f":"IF(AND(ISNUMBER($B14),$B14>0,K14<>\"\"),formatMMSSHHtime(K14),\"\")","v":""},{"$f":"IF(AND(ISNUMBER($B14),$B14>0,L14<>\"\"),formatMMSSHHtime(L14),\"\")","v":""},{"$f":"IF(AND(ISNUMBER($B14),$B14>0,M14<>\"\"),formatMMSSHHtime(M14),\"\")","v":""},{"$f":"IF(AND(ISNUMBER($B14),$B14>0,N14<>\"\"),formatMMSSHHtime(N14),\"\")","v":"10:55.10"}]
["Miranda Mermaid",2,{"$f":"IF(AND(ISNUMBER(B15),B15>0),DATEDIF(INDEX(swimmers_data,B15,3),$C$8,\"Y\"),\"\")","v":14},{"$f":"IF(AND(ISNUMBER(B15),B15>0),INDEX(swimmers_data,B15,5),\"\")","v":"F"},3301,3302,null,3304,13305,13306,13307,13308,13309,null,null,null,null,null,{"$f":"IF(AND(ISNUMBER($B15),$B15>0,E15<>\"\"),INDEX(swimmers_data,$B15,5)&\",\"&INDEX(swimmers_data,$B15,1)&\",\"&INDEX(swimmers_data,$B15,2)&\",\"&INDEX(swimmers_data,$B15,4)&\",\"&TEXT(INDEX(swimmers_data,$B15,3),\"ddmmYy\")&\",\"&LEFT(\"000000\",6-LEN(E15))&E15&\",\"&S$11&\",\"&\"F\",\"\")","v":"F,Mermaid,Miranda,RTW Monson,070307,003301,10,F"},{"$f":"IF(AND(ISNUMBER($B15),$B15>0,F15<>\"\"),INDEX(swimmers_data,$B15,5)&\",\"&INDEX(swimmers_data,$B15,1)&\",\"&INDEX(swimmers_data,$B15,2)&\",\"&INDEX(swimmers_data,$B15,4)&\",\"&TEXT(INDEX(swimmers_data,$B15,3),\"ddmmYy\")&\",\"&LEFT(\"000000\",6-LEN(F15))&F15&\",\"&T$11&\",\"&\"F\",\"\")","v":"F,Mermaid,Miranda,RTW Monson,070307,003302,13,F"},{"$f":"IF(AND(ISNUMBER($B15),$B15>0,G15<>\"\"),INDEX(swimmers_data,$B15,5)&\",\"&INDEX(swimmers_data,$B15,1)&\",\"&INDEX(swimmers_data,$B15,2)&\",\"&INDEX(swimmers_data,$B15,4)&\",\"&TEXT(INDEX(swimmers_data,$B15,3),\"ddmmYy\")&\",\"&LEFT(\"000000\",6-LEN(G15))&G15&\",\"&U$11&\",\"&\"F\",\"\")","v":""},{"$f":"IF(AND(ISNUMBER($B15),$B15>0,H15<>\"\"),INDEX(swimmers_data,$B15,5)&\",\"&INDEX(swimmers_data,$B15,1)&\",\"&INDEX(swimmers_data,$B15,2)&\",\"&INDEX(swimmers_data,$B15,4)&\",\"&TEXT(INDEX(swimmers_data,$B15,3),\"ddmmYy\")&\",\"&LEFT(\"000000\",6-LEN(H15))&H15&\",\"&V$11&\",\"&\"F\",\"\")","v":"F,Mermaid,Miranda,RTW Monson,070307,003304,01,F"},{"$f":"IF(AND(ISNUMBER($B15),$B15>0,I15<>\"\"),INDEX(swimmers_data,$B15,5)&\",\"&INDEX(swimmers_data,$B15,1)&\",\"&INDEX(swimmers_data,$B15,2)&\",\"&INDEX(swimmers_data,$B15,4)&\",\"&TEXT(INDEX(swimmers_data,$B15,3),\"ddmmYy\")&\",\"&LEFT(\"000000\",6-LEN(I15))&I15&\",\"&W$11&\",\"&\"F\",\"\")","v":"F,Mermaid,Miranda,RTW Monson,070307,013305,02,F"},{"$f":"IF(AND(ISNUMBER($B15),$B15>0,J15<>\"\"),INDEX(swimmers_data,$B15,5)&\",\"&INDEX(swimmers_data,$B15,1)&\",\"&INDEX(swimmers_data,$B15,2)&\",\"&INDEX(swimmers_data,$B15,4)&\",\"&TEXT(INDEX(swimmers_data,$B15,3),\"ddmmYy\")&\",\"&LEFT(\"000000\",6-LEN(J15))&J15&\",\"&X$11&\",\"&\"F\",\"\")","v":"F,Mermaid,Miranda,RTW Monson,070307,013306,08,F"},{"$f":"IF(AND(ISNUMBER($B15),$B15>0,K15<>\"\"),INDEX(swimmers_data,$B15,5)&\",\"&INDEX(swimmers_data,$B15,1)&\",\"&INDEX(swimmers_data,$B15,2)&\",\"&INDEX(swimmers_data,$B15,4)&\",\"&TEXT(INDEX(swimmers_data,$B15,3),\"ddmmYy\")&\",\"&LEFT(\"000000\",6-LEN(K15))&K15&\",\"&Y$11&\",\"&\"F\",\"\")","v":"F,Mermaid,Miranda,RTW Monson,070307,013307,12,F"},{"$f":"IF(AND(ISNUMBER($B15),$B15>0,L15<>\"\"),INDEX(swimmers_data,$B15,5)&\",\"&INDEX(swimmers_data,$B15,1)&\",\"&INDEX(swimmers_data,$B15,2)&\",\"&INDEX(swimmers_data,$B15,4)&\",\"&TEXT(INDEX(swimmers_data,$B15,3),\"ddmmYy\")&\",\"&LEFT(\"000000\",6-LEN(L15))&L15&\",\"&Z$11&\",\"&\"F\",\"\")","v":"F,Mermaid,Miranda,RTW Monson,070307,013308,14,F"},{"$f":"IF(AND(ISNUMBER($B15),$B15>0,M15<>\"\"),INDEX(swimmers_data,$B15,5)&\",\"&INDEX(swimmers_data,$B15,1)&\",\"&INDEX(swimmers_data,$B15,2)&\",\"&INDEX(swimmers_data,$B15,4)&\",\"&TEXT(INDEX(swimmers_data,$B15,3),\"ddmmYy\")&\",\"&LEFT(\"000000\",6-LEN(M15))&M15&\",\"&AA$11&\",\"&\"F\",\"\")","v":"F,Mermaid,Miranda,RTW Monson,070307,013309,29,F"},{"$f":"IF(AND(ISNUMBER($B15),$B15>0,N15<>\"\"),INDEX(swimmers_data,$B15,5)&\",\"&INDEX(swimmers_data,$B15,1)&\",\"&INDEX(swimmers_data,$B15,2)&\",\"&INDEX(swimmers_data,$B15,4)&\",\"&TEXT(INDEX(swimmers_data,$B15,3),\"ddmmYy\")&\",\"&LEFT(\"000000\",6-LEN(N15))&N15&\",\"&AB$11&\",\"&\"F\",\"\")","v":""},null,null,"Miranda Mermaid",14,"F",{"$f":"IF(AND(ISNUMBER($B15),$B15>0,E15<>\"\"),formatMMSSHHtime(E15),\"\")","v":"33.01"},{"$f":"IF(AND(ISNUMBER($B15),$B15>0,F15<>\"\"),formatMMSSHHtime(F15),\"\")","v":"33.02"},{"$f":"IF(AND(ISNUMBER($B15),$B15>0,G15<>\"\"),formatMMSSHHtime(G15),\"\")","v":""},{"$f":"IF(AND(ISNUMBER($B15),$B15>0,H15<>\"\"),formatMMSSHHtime(H15),\"\")","v":"33.04"},{"$f":"IF(AND(ISNUMBER($B15),$B15>0,I15<>\"\"),formatMMSSHHtime(I15),\"\")","v":"1:33.05"},{"$f":"IF(AND(ISNUMBER($B15),$B15>0,J15<>\"\"),formatMMSSHHtime(J15),\"\")","v":"1:33.06"},{"$f":"IF(AND(ISNUMBER($B15),$B15>0,K15<>\"\"),formatMMSSHHtime(K15),\"\")","v":"1:33.07"},{"$f":"IF(AND(ISNUMBER($B15),$B15>0,L15<>\"\"),formatMMSSHHtime(L15),\"\")","v":"1:33.08"},{"$f":"IF(AND(ISNUMBER($B15),$B15>0,M15<>\"\"),formatMMSSHHtime(M15),\"\")","v":"1:33.09"},{"$f":"IF(AND(ISNUMBER($B15),$B15>0,N15<>\"\"),formatMMSSHHtime(N15),\"\")","v":""}]
["Bob Sponge",7,{"$f":"IF(AND(ISNUMBER(B16),B16>0),DATEDIF(INDEX(swimmers_data,B16,3),$C$8,\"Y\"),\"\")","v":18},{"$f":"IF(AND(ISNUMBER(B16),B16>0),INDEX(swimmers_data,B16,5),\"\")","v":"M"},2901,null,2903,2904,12904,12906,12907,12908,22909,null,null,null,null,null,{"$f":"IF(AND(ISNUMBER($B16),$B16>0,E16<>\"\"),INDEX(swimmers_data,$B16,5)&\",\"&INDEX(swimmers_data,$B16,1)&\",\"&INDEX(swimmers_data,$B16,2)&\",\"&INDEX(swimmers_data,$B16,4)&\",\"&TEXT(INDEX(swimmers_data,$B16,3),\"ddmmYy\")&\",\"&LEFT(\"000000\",6-LEN(E16))&E16&\",\"&S$11&\",\"&\"F\",\"\")","v":"M,Sponge,Bob,RTW Monson,220403,002901,10,F"},{"$f":"IF(AND(ISNUMBER($B16),$B16>0,F16<>\"\"),INDEX(swimmers_data,$B16,5)&\",\"&INDEX(swimmers_data,$B16,1)&\",\"&INDEX(swimmers_data,$B16,2)&\",\"&INDEX(swimmers_data,$B16,4)&\",\"&TEXT(INDEX(swimmers_data,$B16,3),\"ddmmYy\")&\",\"&LEFT(\"000000\",6-LEN(F16))&F16&\",\"&T$11&\",\"&\"F\",\"\")","v":""},{"$f":"IF(AND(ISNUMBER($B16),$B16>0,G16<>\"\"),INDEX(swimmers_data,$B16,5)&\",\"&INDEX(swimmers_data,$B16,1)&\",\"&INDEX(swimmers_data,$B16,2)&\",\"&INDEX(swimmers_data,$B16,4)&\",\"&TEXT(INDEX(swimmers_data,$B16,3),\"ddmmYy\")&\",\"&LEFT(\"000000\",6-LEN(G16))&G16&\",\"&U$11&\",\"&\"F\",\"\")","v":"M,Sponge,Bob,RTW Monson,220403,002903,07,F"},{"$f":"IF(AND(ISNUMBER($B16),$B16>0,H16<>\"\"),INDEX(swimmers_data,$B16,5)&\",\"&INDEX(swimmers_data,$B16,1)&\",\"&INDEX(swimmers_data,$B16,2)&\",\"&INDEX(swimmers_data,$B16,4)&\",\"&TEXT(INDEX(swimmers_data,$B16,3),\"ddmmYy\")&\",\"&LEFT(\"000000\",6-LEN(H16))&H16&\",\"&V$11&\",\"&\"F\",\"\")","v":"M,Sponge,Bob,RTW Monson,220403,002904,01,F"},{"$f":"IF(AND(ISNUMBER($B16),$B16>0,I16<>\"\"),INDEX(swimmers_data,$B16,5)&\",\"&INDEX(swimmers_data,$B16,1)&\",\"&INDEX(swimmers_data,$B16,2)&\",\"&INDEX(swimmers_data,$B16,4)&\",\"&TEXT(INDEX(swimmers_data,$B16,3),\"ddmmYy\")&\",\"&LEFT(\"000000\",6-LEN(I16))&I16&\",\"&W$11&\",\"&\"F\",\"\")","v":"M,Sponge,Bob,RTW Monson,220403,012904,02,F"},{"$f":"IF(AND(ISNUMBER($B16),$B16>0,J16<>\"\"),INDEX(swimmers_data,$B16,5)&\",\"&INDEX(swimmers_data,$B16,1)&\",\"&INDEX(swimmers_data,$B16,2)&\",\"&INDEX(swimmers_data,$B16,4)&\",\"&TEXT(INDEX(swimmers_data,$B16,3),\"ddmmYy\")&\",\"&LEFT(\"000000\",6-LEN(J16))&J16&\",\"&X$11&\",\"&\"F\",\"\")","v":"M,Sponge,Bob,RTW Monson,220403,012906,08,F"},{"$f":"IF(AND(ISNUMBER($B16),$B16>0,K16<>\"\"),INDEX(swimmers_data,$B16,5)&\",\"&INDEX(swimmers_data,$B16,1)&\",\"&INDEX(swimmers_data,$B16,2)&\",\"&INDEX(swimmers_data,$B16,4)&\",\"&TEXT(INDEX(swimmers_data,$B16,3),\"ddmmYy\")&\",\"&LEFT(\"000000\",6-LEN(K16))&K16&\",\"&Y$11&\",\"&\"F\",\"\")","v":"M,Sponge,Bob,RTW Monson,220403,012907,12,F"},{"$f":"IF(AND(ISNUMBER($B16),$B16>0,L16<>\"\"),INDEX(swimmers_data,$B16,5)&\",\"&INDEX(swimmers_data,$B16,1)&\",\"&INDEX(swimmers_data,$B16,2)&\",\"&INDEX(swimmers_data,$B16,4)&\",\"&TEXT(INDEX(swimmers_data,$B16,3),\"ddmmYy\")&\",\"&LEFT(\"000000\",6-LEN(L16))&L16&\",\"&Z$11&\",\"&\"F\",\"\")","v":"M,Sponge,Bob,RTW Monson,220403,012908,14,F"},{"$f":"IF(AND(ISNUMBER($B16),$B16>0,M16<>\"\"),INDEX(swimmers_data,$B16,5)&\",\"&INDEX(swimmers_data,$B16,1)&\",\"&INDEX(swimmers_data,$B16,2)&\",\"&INDEX(swimmers_data,$B16,4)&\",\"&TEXT(INDEX(swimmers_data,$B16,3),\"ddmmYy\")&\",\"&LEFT(\"000000\",6-LEN(M16))&M16&\",\"&AA$11&\",\"&\"F\",\"\")","v":"M,Sponge,Bob,RTW Monson,220403,022909,29,F"},{"$f":"IF(AND(ISNUMBER($B16),$B16>0,N16<>\"\"),INDEX(swimmers_data,$B16,5)&\",\"&INDEX(swimmers_data,$B16,1)&\",\"&INDEX(swimmers_data,$B16,2)&\",\"&INDEX(swimmers_data,$B16,4)&\",\"&TEXT(INDEX(swimmers_data,$B16,3),\"ddmmYy\")&\",\"&LEFT(\"000000\",6-LEN(N16))&N16&\",\"&AB$11&\",\"&\"F\",\"\")","v":""},null,null,"Bob Sponge",18,"M",{"$f":"IF(AND(ISNUMBER($B16),$B16>0,E16<>\"\"),formatMMSSHHtime(E16),\"\")","v":"29.01"},{"$f":"IF(AND(ISNUMBER($B16),$B16>0,F16<>\"\"),formatMMSSHHtime(F16),\"\")","v":""},{"$f":"IF(AND(ISNUMBER($B16),$B16>0,G16<>\"\"),formatMMSSHHtime(G16),\"\")","v":"29.03"},{"$f":"IF(AND(ISNUMBER($B16),$B16>0,H16<>\"\"),formatMMSSHHtime(H16),\"\")","v":"29.04"},{"$f":"IF(AND(ISNUMBER($B16),$B16>0,I16<>\"\"),formatMMSSHHtime(I16),\"\")","v":"1:29.04"},{"$f":"IF(AND(ISNUMBER($B16),$B16>0,J16<>\"\"),formatMMSSHHtime(J16),\"\")","v":"1:29.06"},{"$f":"IF(AND(ISNUMBER($B16),$B16>0,K16<>\"\"),formatMMSSHHtime(K16),\"\")","v":"1:29.07"},{"$f":"IF(AND(ISNUMBER($B16),$B16>0,L16<>\"\"),formatMMSSHHtime(L16),\"\")","v":"1:29.08"},{"$f":"IF(AND(ISNUMBER($B16),$B16>0,M16<>\"\"),formatMMSSHHtime(M16),\"\")","v":"2:29.09"},{"$f":"IF(AND(ISNUMBER($B16),$B16>0,N16<>\"\"),formatMMSSHHtime(N16),\"\")","v":""}]
["Unknown swimmer",0,{"$f":"IF(AND(ISNUMBER(B17),B17>0),DATEDIF(INDEX(swimmers_data,B17,3),$C$8,\"Y\"),\"\")","v":""},{"$f":"IF(AND(ISNUMBER(B17),B17>0),INDEX(swimmers_data,B17,5),\"\")","v":""},3310,3320,null,3340,13350,13360,13370,13380,13390,null,null,null,null,null,{"$f":"IF(AND(ISNUMBER($B17),$B17>0,E17<>\"\"),INDEX(swimmers_data,$B17,5)&\",\"&INDEX(swimmers_data,$B17,1)&\",\"&INDEX(swimmers_data,$B17,2)&\",\"&INDEX(swimmers_data,$B17,4)&\",\"&TEXT(INDEX(swimmers_data,$B17,3),\"ddmmYy\")&\",\"&LEFT(\"000000\",6-LEN(E17))&E17&\",\"&S$11&\",\"&\"F\",\"\")","v":""},{"$f":"IF(AND(ISNUMBER($B17),$B17>0,F17<>\"\"),INDEX(swimmers_data,$B17,5)&\",\"&INDEX(swimmers_data,$B17,1)&\",\"&INDEX(swimmers_data,$B17,2)&\",\"&INDEX(swimmers_data,$B17,4)&\",\"&TEXT(INDEX(swimmers_data,$B17,3),\"ddmmYy\")&\",\"&LEFT(\"000000\",6-LEN(F17))&F17&\",\"&T$11&\",\"&\"F\",\"\")","v":""},{"$f":"IF(AND(ISNUMBER($B17),$B17>0,G17<>\"\"),INDEX(swimmers_data,$B17,5)&\",\"&INDEX(swimmers_data,$B17,1)&\",\"&INDEX(swimmers_data,$B17,2)&\",\"&INDEX(swimmers_data,$B17,4)&\",\"&TEXT(INDEX(swimmers_data,$B17,3),\"ddmmYy\")&\",\"&LEFT(\"000000\",6-LEN(G17))&G17&\",\"&U$11&\",\"&\"F\",\"\")","v":""},{"$f":"IF(AND(ISNUMBER($B17),$B17>0,H17<>\"\"),INDEX(swimmers_data,$B17,5)&\",\"&INDEX(swimmers_data,$B17,1)&\",\"&INDEX(swimmers_data,$B17,2)&\",\"&INDEX(swimmers_data,$B17,4)&\",\"&TEXT(INDEX(swimmers_data,$B17,3),\"ddmmYy\")&\",\"&LEFT(\"000000\",6-LEN(H17))&H17&\",\"&V$11&\",\"&\"F\",\"\")","v":""},{"$f":"IF(AND(ISNUMBER($B17),$B17>0,I17<>\"\"),INDEX(swimmers_data,$B17,5)&\",\"&INDEX(swimmers_data,$B17,1)&\",\"&INDEX(swimmers_data,$B17,2)&\",\"&INDEX(swimmers_data,$B17,4)&\",\"&TEXT(INDEX(swimmers_data,$B17,3),\"ddmmYy\")&\",\"&LEFT(\"000000\",6-LEN(I17))&I17&\",\"&W$11&\",\"&\"F\",\"\")","v":""},{"$f":"IF(AND(ISNUMBER($B17),$B17>0,J17<>\"\"),INDEX(swimmers_data,$B17,5)&\",\"&INDEX(swimmers_data,$B17,1)&\",\"&INDEX(swimmers_data,$B17,2)&\",\"&INDEX(swimmers_data,$B17,4)&\",\"&TEXT(INDEX(swimmers_data,$B17,3),\"ddmmYy\")&\",\"&LEFT(\"000000\",6-LEN(J17))&J17&\",\"&X$11&\",\"&\"F\",\"\")","v":""},{"$f":"IF(AND(ISNUMBER($B17),$B17>0,K17<>\"\"),INDEX(swimmers_data,$B17,5)&\",\"&INDEX(swimmers_data,$B17,1)&\",\"&INDEX(swimmers_data,$B17,2)&\",\"&INDEX(swimmers_data,$B17,4)&\",\"&TEXT(INDEX(swimmers_data,$B17,3),\"ddmmYy\")&\",\"&LEFT(\"000000\",6-LEN(K17))&K17&\",\"&Y$11&\",\"&\"F\",\"\")","v":""},{"$f":"IF(AND(ISNUMBER($B17),$B17>0,L17<>\"\"),INDEX(swimmers_data,$B17,5)&\",\"&INDEX(swimmers_data,$B17,1)&\",\"&INDEX(swimmers_data,$B17,2)&\",\"&INDEX(swimmers_data,$B17,4)&\",\"&TEXT(INDEX(swimmers_data,$B17,3),\"ddmmYy\")&\",\"&LEFT(\"000000\",6-LEN(L17))&L17&\",\"&Z$11&\",\"&\"F\",\"\")","v":""},{"$f":"IF(AND(ISNUMBER($B17),$B17>0,M17<>\"\"),INDEX(swimmers_data,$B17,5)&\",\"&INDEX(swimmers_data,$B17,1)&\",\"&INDEX(swimmers_data,$B17,2)&\",\"&INDEX(swimmers_data,$B17,4)&\",\"&TEXT(INDEX(swimmers_data,$B17,3),\"ddmmYy\")&\",\"&LEFT(\"000000\",6-LEN(M17))&M17&\",\"&AA$11&\",\"&\"F\",\"\")","v":""},{"$f":"IF(AND(ISNUMBER($B17),$B17>0,N17<>\"\"),INDEX(swimmers_data,$B17,5)&\",\"&INDEX(swimmers_data,$B17,1)&\",\"&INDEX(swimmers_data,$B17,2)&\",\"&INDEX(swimmers_data,$B17,4)&\",\"&TEXT(INDEX(swimmers_data,$B17,3),\"ddmmYy\")&\",\"&LEFT(\"000000\",6-LEN(N17))&N17&\",\"&AB$11&\",\"&\"F\",\"\")","v":""},null,null,"","","",{"$f":"IF(AND(ISNUMBER($B17),$B17>0,E17<>\"\"),formatMMSSHHtime(E17),\"\")","v":""},{"$f":"IF(AND(ISNUMBER($B17),$B17>0,F17<>\"\"),formatMMSSHHtime(F17),\"\")","v":""},{"$f":"IF(AND(ISNUMBER($B17),$B17>0,G17<>\"\"),formatMMSSHHtime(G17),\"\")","v":""},{"$f":"IF(AND(ISNUMBER($B17),$B17>0,H17<>\"\"),formatMMSSHHtime(H17),\"\")","v":""},{"$f":"IF(AND(ISNUMBER($B17),$B17>0,I17<>\"\"),formatMMSSHHtime(I17),\"\")","v":""},{"$f":"IF(AND(ISNUMBER($B17),$B17>0,J17<>\"\"),formatMMSSHHtime(J17),\"\")","v":""},{"$f":"IF(AND(ISNUMBER($B17),$B17>0,K17<>\"\"),formatMMSSHHtime(K17),\"\")","v":""},{"$f":"IF(AND(ISNUMBER($B17),$B17>0,L17<>\"\"),formatMMSSHHtime(L17),\"\")","v":""},{"$f":"IF(AND(ISNUMBER($B17),$B17>0,M17<>\"\"),formatMMSSHHtime(M17),\"\")","v":""},{"$f":"IF(AND(ISNUMBER($B17),$B17>0,N17<>\"\"),formatMMSSHHtime(N17),\"\")","v":""}]
["","",{"$f":"IF(AND(ISNUMBER(B18),B18>0),DATEDIF(INDEX(swimmers_data,B18,3),$C$8,\"Y\"),\"\")","v":""},{"$f":"IF(AND(ISNUMBER(B18),B18>0),INDEX(swimmers_data,B18,5),\"\")","v":""},null,null,null,null,null,null,null,null,null,null,null,null,null,null,{"$f":"IF(AND(ISNUMBER($B18),$B18>0,E18<>\"\"),INDEX(swimmers_data,$B18,5)&\",\"&INDEX(swimmers_data,$B18,1)&\",\"&INDEX(swimmers_data,$B18,2)&\",\"&INDEX(swimmers_data,$B18,4)&\",\"&TEXT(INDEX(swimmers_data,$B18,3),\"ddmmYy\")&\",\"&LEFT(\"000000\",6-LEN(E18))&E18&\",\"&S$11&\",\"&\"F\",\"\")","v":""},{"$f":"IF(AND(ISNUMBER($B18),$B18>0,F18<>\"\"),INDEX(swimmers_data,$B18,5)&\",\"&INDEX(swimmers_data,$B18,1)&\",\"&INDEX(swimmers_data,$B18,2)&\",\"&INDEX(swimmers_data,$B18,4)&\",\"&TEXT(INDEX(swimmers_data,$B18,3),\"ddmmYy\")&\",\"&LEFT(\"000000\",6-LEN(F18))&F18&\",\"&T$11&\",\"&\"F\",\"\")","v":""},{"$f":"IF(AND(ISNUMBER($B18),$B18>0,G18<>\"\"),INDEX(swimmers_data,$B18,5)&\",\"&INDEX(swimmers_data,$B18,1)&\",\"&INDEX(swimmers_data,$B18,2)&\",\"&INDEX(swimmers_data,$B18,4)&\",\"&TEXT(INDEX(swimmers_data,$B18,3),\"ddmmYy\")&\",\"&LEFT(\"000000\",6-LEN(G18))&G18&\",\"&U$11&\",\"&\"F\",\"\")","v":""},{"$f":"IF(AND(ISNUMBER($B18),$B18>0,H18<>\"\"),INDEX(swimmers_data,$B18,5)&\",\"&INDEX(swimmers_data,$B18,1)&\",\"&INDEX(swimmers_data,$B18,2)&\",\"&INDEX(swimmers_data,$B18,4)&\",\"&TEXT(INDEX(swimmers_data,$B18,3),\"ddmmYy\")&\",\"&LEFT(\"000000\",6-LEN(H18))&H18&\",\"&V$11&\",\"&\"F\",\"\")","v":""},{"$f":"IF(AND(ISNUMBER($B18),$B18>0,I18<>\"\"),INDEX(swimmers_data,$B18,5)&\",\"&INDEX(swimmers_data,$B18,1)&\",\"&INDEX(swimmers_data,$B18,2)&\",\"&INDEX(swimmers_data,$B18,4)&\",\"&TEXT(INDEX(swimmers_data,$B18,3),\"ddmmYy\")&\",\"&LEFT(\"000000\",6-LEN(I18))&I18&\",\"&W$11&\",\"&\"F\",\"\")","v":""},{"$f":"IF(AND(ISNUMBER($B18),$B18>0,J18<>\"\"),INDEX(swimmers_data,$B18,5)&\",\"&INDEX(swimmers_data,$B18,1)&\",\"&INDEX(swimmers_data,$B18,2)&\",\"&INDEX(swimmers_data,$B18,4)&\",\"&TEXT(INDEX(swimmers_data,$B18,3),\"ddmmYy\")&\",\"&LEFT(\"000000\",6-LEN(J18))&J18&\",\"&X$11&\",\"&\"F\",\"\")","v":""},{"$f":"IF(AND(ISNUMBER($B18),$B18>0,K18<>\"\"),INDEX(swimmers_data,$B18,5)&\",\"&INDEX(swimmers_data,$B18,1)&\",\"&INDEX(swimmers_data,$B18,2)&\",\"&INDEX(swimmers_data,$B18,4)&\",\"&TEXT(INDEX(swimmers_data,$B18,3),\"ddmmYy\")&\",\"&LEFT(\"000000\",6-LEN(K18))&K18&\",\"&Y$11&\",\"&\"F\",\"\")","v":""},{"$f":"IF(AND(ISNUMBER($B18),$B18>0,L18<>\"\"),INDEX(swimmers_data,$B18,5)&\",\"&INDEX(swimmers_data,$B18,1)&\",\"&INDEX(swimmers_data,$B18,2)&\",\"&INDEX(swimmers_data,$B18,4)&\",\"&TEXT(INDEX(swimmers_data,$B18,3),\"ddmmYy\")&\",\"&LEFT(\"000000\",6-LEN(L18))&L18&\",\"&Z$11&\",\"&\"F\",\"\")","v":""},{"$f":"IF(AND(ISNUMBER($B18),$B18>0,M18<>\"\"),INDEX(swimmers_data,$B18,5)&\",\"&INDEX(swimmers_data,$B18,1)&\",\"&INDEX(swimmers_data,$B18,2)&\",\"&INDEX(swimmers_data,$B18,4)&\",\"&TEXT(INDEX(swimmers_data,$B18,3),\"ddmmYy\")&\",\"&LEFT(\"000000\",6-LEN(M18))&M18&\",\"&AA$11&\",\"&\"F\",\"\")","v":""},{"$f":"IF(AND(ISNUMBER($B18),$B18>0,N18<>\"\"),INDEX(swimmers_data,$B18,5)&\",\"&INDEX(swimmers_data,$B18,1)&\",\"&INDEX(swimmers_data,$B18,2)&\",\"&INDEX(swimmers_data,$B18,4)&\",\"&TEXT(INDEX(swimmers_data,$B18,3),\"ddmmYy\")&\",\"&LEFT(\"000000\",6-LEN(N18))&N18&\",\"&AB$11&\",\"&\"F\",\"\")","v":""},null,null,"","","",{"$f":"IF(AND(ISNUMBER($B18),$B18>0,E18<>\"\"),formatMMSSHHtime(E18),\"\")","v":""},{"$f":"IF(AND(ISNUMBER($B18),$B18>0,F18<>\"\"),formatMMSSHHtime(F18),\"\")","v":""},{"$f":"IF(AND(ISNUMBER($B18),$B18>0,G18<>\"\"),formatMMSSHHtime(G18),\"\")","v":""},{"$f":"IF(AND(ISNUMBER($B18),$B18>0,H18<>\"\"),formatMMSSHHtime(H18),\"\")","v":""},{"$f":"IF(AND(ISNUMBER($B18),$B18>0,I18<>\"\"),formatMMSSHHtime(I18),\"\")","v":""},{"$f":"IF(AND(ISNUMBER($B18),$B18>0,J18<>\"\"),formatMMSSHHtime(J18),\"\")","v":""},{"$f":"IF(AND(ISNUMBER($B18),$B18>0,K18<>\"\"),formatMMSSHHtime(K18),\"\")","v":""},{"$f":"IF(AND(ISNUMBER($B18),$B18>0,L18<>\"\"),formatMMSSHHtime(L18),\"\")","v":""},{"$f":"IF(AND(ISNUMBER($B18),$B18>0,M18<>\"\"),formatMMSSHHtime(M18),\"\")","v":""},{"$f":"IF(AND(ISNUMBER($B18),$B18>0,N18<>\"\"),formatMMSSHHtime(N18),\"\")","v":""}]
["","",{"$f":"IF(AND(ISNUMBER(B19),B19>0),DATEDIF(INDEX(swimmers_data,B19,3),$C$8,\"Y\"),\"\")","v":""},{"$f":"IF(AND(ISNUMBER(B19),B19>0),INDEX(swimmers_data,B19,5),\"\")","v":""},null,null,null,null,null,null,null,null,null,null,null,null,null,null,{"$f":"IF(AND(ISNUMBER($B19),$B19>0,E19<>\"\"),INDEX(swimmers_data,$B19,5)&\",\"&INDEX(swimmers_data,$B19,1)&\",\"&INDEX(swimmers_data,$B19,2)&\",\"&INDEX(swimmers_data,$B19,4)&\",\"&TEXT(INDEX(swimmers_data,$B19,3),\"ddmmYy\")&\",\"&LEFT(\"000000\",6-LEN(E19))&E19&\",\"&S$11&\",\"&\"F\",\"\")","v":""},{"$f":"IF(AND(ISNUMBER($B19),$B19>0,F19<>\"\"),INDEX(swimmers_data,$B19,5)&\",\"&INDEX(swimmers_data,$B19,1)&\",\"&INDEX(swimmers_data,$B19,2)&\",\"&INDEX(swimmers_data,$B19,4)&\",\"&TEXT(INDEX(swimmers_data,$B19,3),\"ddmmYy\")&\",\"&LEFT(\"000000\",6-LEN(F19))&F19&\",\"&T$11&\",\"&\"F\",\"\")","v":""},{"$f":"IF(AND(ISNUMBER($B19),$B19>0,G19<>\"\"),INDEX(swimmers_data,$B19,5)&\",\"&INDEX(swimmers_data,$B19,1)&\",\"&INDEX(swimmers_data,$B19,2)&\",\"&INDEX(swimmers_data,$B19,4)&\",\"&TEXT(INDEX(swimmers_data,$B19,3),\"ddmmYy\")&\",\"&LEFT(\"000000\",6-LEN(G19))&G19&\",\"&U$11&\",\"&\"F\",\"\")","v":""},{"$f":"IF(AND(ISNUMBER($B19),$B19>0,H19<>\"\"),INDEX(swimmers_data,$B19,5)&\",\"&INDEX(swimmers_data,$B19,1)&\",\"&INDEX(swimmers_data,$B19,2)&\",\"&INDEX(swimmers_data,$B19,4)&\",\"&TEXT(INDEX(swimmers_data,$B19,3),\"ddmmYy\")&\",\"&LEFT(\"000000\",6-LEN(H19))&H19&\",\"&V$11&\",\"&\"F\",\"\")","v":""},{"$f":"IF(AND(ISNUMBER($B19),$B19>0,I19<>\"\"),INDEX(swimmers_data,$B19,5)&\",\"&INDEX(swimmers_data,$B19,1)&\",\"&INDEX(swimmers_data,$B19,2)&\",\"&INDEX(swimmers_data,$B19,4)&\",\"&TEXT(INDEX(swimmers_data,$B19,3),\"ddmmYy\")&\",\"&LEFT(\"000000\",6-LEN(I19))&I19&\",\"&W$11&\",\"&\"F\",\"\")","v":""},{"$f":"IF(AND(ISNUMBER($B19),$B19>0,J19<>\"\"),INDEX(swimmers_data,$B19,5)&\",\"&INDEX(swimmers_data,$B19,1)&\",\"&INDEX(swimmers_data,$B19,2)&\",\"&INDEX(swimmers_data,$B19,4)&\",\"&TEXT(INDEX(swimmers_data,$B19,3),\"ddmmYy\")&\",\"&LEFT(\"000000\",6-LEN(J19))&J19&\",\"&X$11&\",\"&\"F\",\"\")","v":""},{"$f":"IF(AND(ISNUMBER($B19),$B19>0,K19<>\"\"),INDEX(swimmers_data,$B19,5)&\",\"&INDEX(swimmers_data,$B19,1)&\",\"&INDEX(swimmers_data,$B19,2)&\",\"&INDEX(swimmers_data,$B19,4)&\",\"&TEXT(INDEX(swimmers_data,$B19,3),\"ddmmYy\")&\",\"&LEFT(\"000000\",6-LEN(K19))&K19&\",\"&Y$11&\",\"&\"F\",\"\")","v":""},{"$f":"IF(AND(ISNUMBER($B19),$B19>0,L19<>\"\"),INDEX(swimmers_data,$B19,5)&\",\"&INDEX(swimmers_data,$B19,1)&\",\"&INDEX(swimmers_data,$B19,2)&\",\"&INDEX(swimmers_data,$B19,4)&\",\"&TEXT(INDEX(swimmers_data,$B19,3),\"ddmmYy\")&\",\"&LEFT(\"000000\",6-LEN(L19))&L19&\",\"&Z$11&\",\"&\"F\",\"\")","v":""},{"$f":"IF(AND(ISNUMBER($B19),$B19>0,M19<>\"\"),INDEX(swimmers_data,$B19,5)&\",\"&INDEX(swimmers_data,$B19,1)&\",\"&INDEX(swimmers_data,$B19,2)&\",\"&INDEX(swimmers_data,$B19,4)&\",\"&TEXT(INDEX(swimmers_data,$B19,3),\"ddmmYy\")&\",\"&LEFT(\"000000\",6-LEN(M19))&M19&\",\"&AA$11&\",\"&\"F\",\"\")","v":""},{"$f":"IF(AND(ISNUMBER($B19),$B19>0,N19<>\"\"),INDEX(swimmers_data,$B19,5)&\",\"&INDEX(swimmers_data,$B19,1)&\",\"&INDEX(swimmers_data,$B19,2)&\",\"&INDEX(swimmers_data,$B19,4)&\",\"&TEXT(INDEX(swimmers_data,$B19,3),\"ddmmYy\")&\",\"&LEFT(\"000000\",6-LEN(N19))&N19&\",\"&AB$11&\",\"&\"F\",\"\")","v":""},null,null,"","","",{"$f":"IF(AND(ISNUMBER($B19),$B19>0,E19<>\"\"),formatMMSSHHtime(E19),\"\")","v":""},{"$f":"IF(AND(ISNUMBER($B19),$B19>0,F19<>\"\"),formatMMSSHHtime(F19),\"\")","v":""},{"$f":"IF(AND(ISNUMBER($B19),$B19>0,G19<>\"\"),formatMMSSHHtime(G19),\"\")","v":""},{"$f":"IF(AND(ISNUMBER($B19),$B19>0,H19<>\"\"),formatMMSSHHtime(H19),\"\")","v":""},{"$f":"IF(AND(ISNUMBER($B19),$B19>0,I19<>\"\"),formatMMSSHHtime(I19),\"\")","v":""},{"$f":"IF(AND(ISNUMBER($B19),$B19>0,J19<>\"\"),formatMMSSHHtime(J19),\"\")","v":""},{"$f":"IF(AND(ISNUMBER($B19),$B19>0,K19<>\"\"),formatMMSSHHtime(K19),\"\")","v":""},{"$f":"IF(AND(ISNUMBER($B19),$B19>0,L19<>\"\"),formatMMSSHHtime(L19),\"\")","v":""},{"$f":"IF(AND(ISNUMBER($B19),$B19>0,M19<>\"\"),formatMMSSHHtime(M19),\"\")","v":""},{"$f":"IF(AND(ISNUMBER($B19),$B19>0,N19<>\"\"),formatMMSSHHtime(N19),\"\")","v":""}]
["","",{"$f":"IF(AND(ISNUMBER(B20),B20>0),DATEDIF(INDEX(swimmers_data,B20,3),$C$8,\"Y\"),\"\")","v":""},{"$f":"IF(AND(ISNUMBER(B20),B20>0),INDEX(swimmers_data,B20,5),\"\")","v":""},null,null,null,null,null,null,null,null,null,null,null,null,null,null,{"$f":"IF(AND(ISNUMBER($B20),$B20>0,E20<>\"\"),INDEX(swimmers_data,$B20,5)&\",\"&INDEX(swimmers_data,$B20,1)&\",\"&INDEX(swimmers_data,$B20,2)&\",\"&INDEX(swimmers_data,$B20,4)&\",\"&TEXT(INDEX(swimmers_data,$B20,3),\"ddmmYy\")&\",\"&LEFT(\"000000\",6-LEN(E20))&E20&\",\"&S$11&\",\"&\"F\",\"\")","v":""},{"$f":"IF(AND(ISNUMBER($B20),$B20>0,F20<>\"\"),INDEX(swimmers_data,$B20,5)&\",\"&INDEX(swimmers_data,$B20,1)&\",\"&INDEX(swimmers_data,$B20,2)&\",\"&INDEX(swimmers_data,$B20,4)&\",\"&TEXT(INDEX(swimmers_data,$B20,3),\"ddmmYy\")&\",\"&LEFT(\"000000\",6-LEN(F20))&F20&\",\"&T$11&\",\"&\"F\",\"\")","v":""},{"$f":"IF(AND(ISNUMBER($B20),$B20>0,G20<>\"\"),INDEX(swimmers_data,$B20,5)&\",\"&INDEX(swimmers_data,$B20,1)&\",\"&INDEX(swimmers_data,$B20,2)&\",\"&INDEX(swimmers_data,$B20,4)&\",\"&TEXT(INDEX(swimmers_data,$B20,3),\"ddmmYy\")&\",\"&LEFT(\"000000\",6-LEN(G20))&G20&\",\"&U$11&\",\"&\"F\",\"\")","v":""},{"$f":"IF(AND(ISNUMBER($B20),$B20>0,H20<>\"\"),INDEX(swimmers_data,$B20,5)&\",\"&INDEX(swimmers_data,$B20,1)&\",\"&INDEX(swimmers_data,$B20,2)&\",\"&INDEX(swimmers_data,$B20,4)&\",\"&TEXT(INDEX(swimmers_data,$B20,3),\"ddmmYy\")&\",\"&LEFT(\"000000\",6-LEN(H20))&H20&\",\"&V$11&\",\"&\"F\",\"\")","v":""},{"$f":"IF(AND(ISNUMBER($B20),$B20>0,I20<>\"\"),INDEX(swimmers_data,$B20,5)&\",\"&INDEX(swimmers_data,$B20,1)&\",\"&INDEX(swimmers_data,$B20,2)&\",\"&INDEX(swimmers_data,$B20,4)&\",\"&TEXT(INDEX(swimmers_data,$B20,3),\"ddmmYy\")&\",\"&LEFT(\"000000\",6-LEN(I20))&I20&\",\"&W$11&\",\"&\"F\",\"\")","v":""},{"$f":"IF(AND(ISNUMBER($B20),$B20>0,J20<>\"\"),INDEX(swimmers_data,$B20,5)&\",\"&INDEX(swimmers_data,$B20,1)&\",\"&INDEX(swimmers_data,$B20,2)&\",\"&INDEX(swimmers_data,$B20,4)&\",\"&TEXT(INDEX(swimmers_data,$B20,3),\"ddmmYy\")&\",\"&LEFT(\"000000\",6-LEN(J20))&J20&\",\"&X$11&\",\"&\"F\",\"\")","v":""},{"$f":"IF(AND(ISNUMBER($B20),$B20>0,K20<>\"\"),INDEX(swimmers_data,$B20,5)&\",\"&INDEX(swimmers_data,$B20,1)&\",\"&INDEX(swimmers_data,$B20,2)&\",\"&INDEX(swimmers_data,$B20,4)&\",\"&TEXT(INDEX(swimmers_data,$B20,3),\"ddmmYy\")&\",\"&LEFT(\"000000\",6-LEN(K20))&K20&\",\"&Y$11&\",\"&\"F\",\"\")","v":""},{"$f":"IF(AND(ISNUMBER($B20),$B20>0,L20<>\"\"),INDEX(swimmers_data,$B20,5)&\",\"&INDEX(swimmers_data,$B20,1)&\",\"&INDEX(swimmers_data,$B20,2)&\",\"&INDEX(swimmers_data,$B20,4)&\",\"&TEXT(INDEX(swimmers_data,$B20,3),\"ddmmYy\")&\",\"&LEFT(\"000000\",6-LEN(L20))&L20&\",\"&Z$11&\",\"&\"F\",\"\")","v":""},{"$f":"IF(AND(ISNUMBER($B20),$B20>0,M20<>\"\"),INDEX(swimmers_data,$B20,5)&\",\"&INDEX(swimmers_data,$B20,1)&\",\"&INDEX(swimmers_data,$B20,2)&\",\"&INDEX(swimmers_data,$B20,4)&\",\"&TEXT(INDEX(swimmers_data,$B20,3),\"ddmmYy\")&\",\"&LEFT(\"000000\",6-LEN(M20))&M20&\",\"&AA$11&\",\"&\"F\",\"\")","v":""},{"$f":"IF(AND(ISNUMBER($B20),$B20>0,N20<>\"\"),INDEX(swimmers_data,$B20,5)&\",\"&INDEX(swimmers_data,$B20,1)&\",\"&INDEX(swimmers_data,$B20,2)&\",\"&INDEX(swimmers_data,$B20,4)&\",\"&TEXT(INDEX(swimmers_data,$B20,3),\"ddmmYy\")&\",\"&LEFT(\"000000\",6-LEN(N20))&N20&\",\"&AB$11&\",\"&\"F\",\"\")","v":""},null,null,"","","",{"$f":"IF(AND(ISNUMBER($B20),$B20>0,E20<>\"\"),formatMMSSHHtime(E20),\"\")","v":""},{"$f":"IF(AND(ISNUMBER($B20),$B20>0,F20<>\"\"),formatMMSSHHtime(F20),\"\")","v":""},{"$f":"IF(AND(ISNUMBER($B20),$B20>0,G20<>\"\"),formatMMSSHHtime(G20),\"\")","v":""},{"$f":"IF(AND(ISNUMBER($B20),$B20>0,H20<>\"\"),formatMMSSHHtime(H20),\"\")","v":""},{"$f":"IF(AND(ISNUMBER($B20),$B20>0,I20<>\"\"),formatMMSSHHtime(I20),\"\")","v":""},{"$f":"IF(AND(ISNUMBER($B20),$B20>0,J20<>\"\"),formatMMSSHHtime(J20),\"\")","v":""},{"$f":"IF(AND(ISNUMBER($B20),$B20>0,K20<>\"\"),formatMMSSHHtime(K20),\"\")","v":""},{"$f":"IF(AND(ISNUMBER($B20),$B20>0,L20<>\"\"),formatMMSSHHtime(L20),\"\")","v":""},{"$f":"IF(AND(ISNUMBER($B20),$B20>0,M20<>\"\"),formatMMSSHHtime(M20),\"\")","v":""},{"$f":"IF(AND(ISNUMBER($B20),$B20>0,N20<>\"\"),formatMMSSHHtime(N20),\"\")","v":""}]
["","",{"$f":"IF(AND(ISNUMBER(B21),B21>0),DATEDIF(INDEX(swimmers_data,B21,3),$C$8,\"Y\"),\"\")","v":""},{"$f":"IF(AND(ISNUMBER(B21),B21>0),INDEX(swimmers_data,B21,5),\"\")","v":""},null,null,null,null,null,null,null,null,null,null,null,null,null,null,{"$f":"IF(AND(ISNUMBER($B21),$B21>0,E21<>\"\"),INDEX(swimmers_data,$B21,5)&\",\"&INDEX(swimmers_data,$B21,1)&\",\"&INDEX(swimmers_data,$B21,2)&\",\"&INDEX(swimmers_data,$B21,4)&\",\"&TEXT(INDEX(swimmers_data,$B21,3),\"ddmmYy\")&\",\"&LEFT(\"000000\",6-LEN(E21))&E21&\",\"&S$11&\",\"&\"F\",\"\")","v":""},{"$f":"IF(AND(ISNUMBER($B21),$B21>0,F21<>\"\"),INDEX(swimmers_data,$B21,5)&\",\"&INDEX(swimmers_data,$B21,1)&\",\"&INDEX(swimmers_data,$B21,2)&\",\"&INDEX(swimmers_data,$B21,4)&\",\"&TEXT(INDEX(swimmers_data,$B21,3),\"ddmmYy\")&\",\"&LEFT(\"000000\",6-LEN(F21))&F21&\",\"&T$11&\",\"&\"F\",\"\")","v":""},{"$f":"IF(AND(ISNUMBER($B21),$B21>0,G21<>\"\"),INDEX(swimmers_data,$B21,5)&\",\"&INDEX(swimmers_data,$B21,1)&\",\"&INDEX(swimmers_data,$B21,2)&\",\"&INDEX(swimmers_data,$B21,4)&\",\"&TEXT(INDEX(swimmers_data,$B21,3),\"ddmmYy\")&\",\"&LEFT(\"000000\",6-LEN(G21))&G21&\",\"&U$11&\",\"&\"F\",\"\")","v":""},{"$f":"IF(AND(ISNUMBER($B21),$B21>0,H21<>\"\"),INDEX(swimmers_data,$B21,5)&\",\"&INDEX(swimmers_data,$B21,1)&\",\"&INDEX(swimmers_data,$B21,2)&\",\"&INDEX(swimmers_data,$B21,4)&\",\"&TEXT(INDEX(swimmers_data,$B21,3),\"ddmmYy\")&\",\"&LEFT(\"000000\",6-LEN(H21))&H21&\",\"&V$11&\",\"&\"F\",\"\")","v":""},{"$f":"IF(AND(ISNUMBER($B21),$B21>0,I21<>\"\"),INDEX(swimmers_data,$B21,5)&\",\"&INDEX(swimmers_data,$B21,1)&\",\"&INDEX(swimmers_data,$B21,2)&\",\"&INDEX(swimmers_data,$B21,4)&\",\"&TEXT(INDEX(swimmers_data,$B21,3),\"ddmmYy\")&\",\"&LEFT(\"000000\",6-LEN(I21))&I21&\",\"&W$11&\",\"&\"F\",\"\")","v":""},{"$f":"IF(AND(ISNUMBER($B21),$B21>0,J21<>\"\"),INDEX(swimmers_data,$B21,5)&\",\"&INDEX(swimmers_data,$B21,1)&\",\"&INDEX(swimmers_data,$B21,2)&\",\"&INDEX(swimmers_data,$B21,4)&\",\"&TEXT(INDEX(swimmers_data,$B21,3),\"ddmmYy\")&\",\"&LEFT(\"000000\",6-LEN(J21))&J21&\",\"&X$11&\",\"&\"F\",\"\")","v":""},{"$f":"IF(AND(ISNUMBER($B21),$B21>0,K21<>\"\"),INDEX(swimmers_data,$B21,5)&\",\"&INDEX(swimmers_data,$B21,1)&\",\"&INDEX(swimmers_data,$B21,2)&\",\"&INDEX(swimmers_data,$B21,4)&\",\"&TEXT(INDEX(swimmers_data,$B21,3),\"ddmmYy\")&\",\"&LEFT(\"000000\",6-LEN(K21))&K21&\",\"&Y$11&\",\"&\"F\",\"\")","v":""},{"$f":"IF(AND(ISNUMBER($B21),$B21>0,L21<>\"\"),INDEX(swimmers_data,$B21,5)&\",\"&INDEX(swimmers_data,$B21,1)&\",\"&INDEX(swimmers_data,$B21,2)&\",\"&INDEX(swimmers_data,$B21,4)&\",\"&TEXT(INDEX(swimmers_data,$B21,3),\"ddmmYy\")&\",\"&LEFT(\"000000\",6-LEN(L21))&L21&\",\"&Z$11&\",\"&\"F\",\"\")","v":""},{"$f":"IF(AND(ISNUMBER($B21),$B21>0,M21<>\"\"),INDEX(swimmers_data,$B21,5)&\",\"&INDEX(swimmers_data,$B21,1)&\",\"&INDEX(swimmers_data,$B21,2)&\",\"&INDEX(swimmers_data,$B21,4)&\",\"&TEXT(INDEX(swimmers_data,$B21,3),\"ddmmYy\")&\",\"&LEFT(\"000000\",6-LEN(M21))&M21&\",\"&AA$11&\",\"&\"F\",\"\")","v":""},{"$f":"IF(AND(ISNUMBER($B21),$B21>0,N21<>\"\"),INDEX(swimmers_data,$B21,5)&\",\"&INDEX(swimmers_data,$B21,1)&\",\"&INDEX(swimmers_data,$B21,2)&\",\"&INDEX(swimmers_data,$B21,4)&\",\"&TEXT(INDEX(swimmers_data,$B21,3),\"ddmmYy\")&\",\"&LEFT(\"000000\",6-LEN(N21))&N21&\",\"&AB$11&\",\"&\"F\",\"\")","v":""},null,null,"","","",{"$f":"IF(AND(ISNUMBER($B21),$B21>0,E21<>\"\"),formatMMSSHHtime(E21),\"\")","v":""},{"$f":"IF(AND(ISNUMBER($B21),$B21>0,F21<>\"\"),formatMMSSHHtime(F21),\"\")","v":""},{"$f":"IF(AND(ISNUMBER($B21),$B21>0,G21<>\"\"),formatMMSSHHtime(G21),\"\")","v":""},{"$f":"IF(AND(ISNUMBER($B21),$B21>0,H21<>\"\"),formatMMSSHHtime(H21),\"\")","v":""},{"$f":"IF(AND(ISNUMBER($B21),$B21>0,I21<>\"\"),formatMMSSHHtime(I21),\"\")","v":""},{"$f":"IF(AND(ISNUMBER($B21),$B21>0,J21<>\"\"),formatMMSSHHtime(J21),\"\")","v":""},{"$f":"IF(AND(ISNUMBER($B21),$B21>0,K21<>\"\"),formatMMSSHHtime(K21),\"\")","v":""},{"$f":"IF(AND(ISNUMBER($B21),$B21>0,L21<>\"\"),formatMMSSHHtime(L21),\"\")","v":""},{"$f":"IF(AND(ISNUMBER($B21),$B21>0,M21<>\"\"),formatMMSSHHtime(M21),\"\")","v":""},{"$f":"IF(AND(ISNUMBER($B21),$B21>0,N21<>\"\"),formatMMSSHHtime(N21),\"\")","v":""}]
["","",{"$f":"IF(AND(ISNUMBER(B22),B22>0),DATEDIF(INDEX(swimmers_data,B22,3),$C$8,\"Y\"),\"\")","v":""},{"$f":"IF(AND(ISNUMBER(B22),B22>0),INDEX(swimmers_data,B22,5),\"\")","v":""},null,null,null,null,null,null,null,null,null,null,null,null,null,null,{"$f":"IF(AND(ISNUMBER($B22),$B22>0,E22<>\"\"),INDEX(swimmers_data,$B22,5)&\",\"&INDEX(swimmers_data,$B22,1)&\",\"&INDEX(swimmers_data,$B22,2)&\",\"&INDEX(swimmers_data,$B22,4)&\",\"&TEXT(INDEX(swimmers_data,$B22,3),\"ddmmYy\")&\",\"&LEFT(\"000000\",6-LEN(E22))&E22&\",\"&S$11&\",\"&\"F\",\"\")","v":""},{"$f":"IF(AND(ISNUMBER($B22),$B22>0,F22<>\"\"),INDEX(swimmers_data,$B22,5)&\",\"&INDEX(swimmers_data,$B22,1)&\",\"&INDEX(swimmers_data,$B22,2)&\",\"&INDEX(swimmers_data,$B22,4)&\",\"&TEXT(INDEX(swimmers_data,$B22,3),\"ddmmYy\")&\",\"&LEFT(\"000000\",6-LEN(F22))&F22&\",\"&T$11&\",\"&\"F\",\"\")","v":""},{"$f":"IF(AND(ISNUMBER($B22),$B22>0,G22<>\"\"),INDEX(swimmers_data,$B22,5)&\",\"&INDEX(swimmers_data,$B22,1)&\",\"&INDEX(swimmers_data,$B22,2)&\",\"&INDEX(swimmers_data,$B22,4)&\",\"&TEXT(INDEX(swimmers_data,$B22,3),\"ddmmYy\")&\",\"&LEFT(\"000000\",6-LEN(G22))&G22&\",\"&U$11&\",\"&\"F\",\"\")","v":""},{"$f":"IF(AND(ISNUMBER($B22),$B22>0,H22<>\"\"),INDEX(swimmers_data,$B22,5)&\",\"&INDEX(swimmers_data,$B22,1)&\",\"&INDEX(swimmers_data,$B22,2)&\",\"&INDEX(swimmers_data,$B22,4)&\",\"&TEXT(INDEX(swimmers_data,$B22,3),\"ddmmYy\")&\",\"&LEFT(\"000000\",6-LEN(H22))&H22&\",\"&V$11&\",\"&\"F\",\"\")","v":""},{"$f":"IF(AND(ISNUMBER($B22),$B22>0,I22<>\"\"),INDEX(swimmers_data,$B22,5)&\",\"&INDEX(swimmers_data,$B22,1)&\",\"&INDEX(swimmers_data,$B22,2)&\",\"&INDEX(swimmers_data,$B22,4)&\",\"&TEXT(INDEX(swimmers_data,$B22,3),\"ddmmYy\")&\",\"&LEFT(\"000000\",6-LEN(I22))&I22&\",\"&W$11&\",\"&\"F\",\"\")","v":""},{"$f":"IF(AND(ISNUMBER($B22),$B22>0,J22<>\"\"),INDEX(swimmers_data,$B22,5)&\",\"&INDEX(swimmers_data,$B22,1)&\",\"&INDEX(swimmers_data,$B22,2)&\",\"&INDEX(swimmers_data,$B22,4)&\",\"&TEXT(INDEX(swimmers_data,$B22,3),\"ddmmYy\")&\",\"&LEFT(\"000000\",6-LEN(J22))&J22&\",\"&X$11&\",\"&\"F\",\"\")","v":""},{"$f":"IF(AND(ISNUMBER($B22),$B22>0,K22<>\"\"),INDEX(swimmers_data,$B22,5)&\",\"&INDEX(swimmers_data,$B22,1)&\",\"&INDEX(swimmers_data,$B22,2)&\",\"&INDEX(swimmers_data,$B22,4)&\",\"&TEXT(INDEX(swimmers_data,$B22,3),\"ddmmYy\")&\",\"&LEFT(\"000000\",6-LEN(K22))&K22&\",\"&Y$11&\",\"&\"F\",\"\")","v":""},{"$f":"IF(AND(ISNUMBER($B22),$B22>0,L22<>\"\"),INDEX(swimmers_data,$B22,5)&\",\"&INDEX(swimmers_data,$B22,1)&\",\"&INDEX(swimmers_data,$B22,2)&\",\"&INDEX(swimmers_data,$B22,4)&\",\"&TEXT(INDEX(swimmers_data,$B22,3),\"ddmmYy\")&\",\"&LEFT(\"000000\",6-LEN(L22))&L22&\",\"&Z$11&\",\"&\"F\",\"\")","v":""},{"$f":"IF(AND(ISNUMBER($B22),$B22>0,M22<>\"\"),INDEX(swimmers_data,$B22,5)&\",\"&INDEX(swimmers_data,$B22,1)&\",\"&INDEX(swimmers_data,$B22,2)&\",\"&INDEX(swimmers_data,$B22,4)&\",\"&TEXT(INDEX(swimmers_data,$B22,3),\"ddmmYy\")&\",\"&LEFT(\"000000\",6-LEN(M22))&M22&\",\"&AA$11&\",\"&\"F\",\"\")","v":""},{"$f":"IF(AND(ISNUMBER($B22),$B22>0,N22<>\"\"),INDEX(swimmers_data,$B22,5)&\",\"&INDEX(swimmers_data,$B22,1)&\",\"&INDEX(swimmers_data,$B22,2)&\",\"&INDEX(swimmers_data,$B22,4)&\",\"&TEXT(INDEX(swimmers_data,$B22,3),\"ddmmYy\")&\",\"&LEFT(\"000000\",6-LEN(N22))&N22&\",\"&AB$11&\",\"&\"F\",\"\")","v":""},null,null,"","","",{"$f":"IF(AND(ISNUMBER($B22),$B22>0,E22<>\"\"),formatMMSSHHtime(E22),\"\")","v":""},{"$f":"IF(AND(ISNUMBER($B22),$B22>0,F22<>\"\"),formatMMSSHHtime(F22),\"\")","v":""},{"$f":"IF(AND(ISNUMBER($B22),$B22>0,G22<>\"\"),formatMMSSHHtime(G22),\"\")","v":""},{"$f":"IF(AND(ISNUMBER($B22),$B22>0,H22<>\"\"),formatMMSSHHtime(H22),\"\")","v":""},{"$f":"IF(AND(ISNUMBER($B22),$B22>0,I22<>\"\"),formatMMSSHHtime(I22),\"\")","v":""},{"$f":"IF(AND(ISNUMBER($B22),$B22>0,J22<>\"\"),formatMMSSHHtime(J22),\"\")","v":""},{"$f":"IF(AND(ISNUMBER($B22),$B22>0,K22<>\"\"),formatMMSSHHtime(K22),\"\")","v":""},{"$f":"IF(AND(ISNUMBER($B22),$B22>0,L22<>\"\"),formatMMSSHHtime(L22),\"\")","v":""},{"$f":"IF(AND(ISNUMBER($B22),$B22>0,M22<>\"\"),formatMMSSHHtime(M22),\"\")","v":""},{"$f":"IF(AND(ISNUMBER($B22),$B22>0,N22<>\"\"),formatMMSSHHtime(N22),\"\")","v":""}]
["","",{"$f":"IF(AND(ISNUMBER(B23),B23>0),DATEDIF(INDEX(swimmers_data,B23,3),$C$8,\"Y\"),\"\")","v":""},{"$f":"IF(AND(ISNUMBER(B23),B23>0),INDEX(swimmers_data,B23,5),\"\")","v":""},null,null,null,null,null,null,null,null,null,null,null,null,null,null,{"$f":"IF(AND(ISNUMBER($B23),$B23>0,E23<>\"\"),INDEX(swimmers_data,$B23,5)&\",\"&INDEX(swimmers_data,$B23,1)&\",\"&INDEX(swimmers_data,$B23,2)&\",\"&INDEX(swimmers_data,$B23,4)&\",\"&TEXT(INDEX(swimmers_data,$B23,3),\"ddmmYy\")&\",\"&LEFT(\"000000\",6-LEN(E23))&E23&\",\"&S$11&\",\"&\"F\",\"\")","v":""},{"$f":"IF(AND(ISNUMBER($B23),$B23>0,F23<>\"\"),INDEX(swimmers_data,$B23,5)&\",\"&INDEX(swimmers_data,$B23,1)&\",\"&INDEX(swimmers_data,$B23,2)&\",\"&INDEX(swimmers_data,$B23,4)&\",\"&TEXT(INDEX(swimmers_data,$B23,3),\"ddmmYy\")&\",\"&LEFT(\"000000\",6-LEN(F23))&F23&\",\"&T$11&\",\"&\"F\",\"\")","v":""},{"$f":"IF(AND(ISNUMBER($B23),$B23>0,G23<>\"\"),INDEX(swimmers_data,$B23,5)&\",\"&INDEX(swimmers_data,$B23,1)&\",\"&INDEX(swimmers_data,$B23,2)&\",\"&INDEX(swimmers_data,$B23,4)&\",\"&TEXT(INDEX(swimmers_data,$B23,3),\"ddmmYy\")&\",\"&LEFT(\"000000\",6-LEN(G23))&G23&\",\"&U$11&\",\"&\"F\",\"\")","v":""},{"$f":"IF(AND(ISNUMBER($B23),$B23>0,H23<>\"\"),INDEX(swimmers_data,$B23,5)&\",\"&INDEX(swimmers_data,$B23,1)&\",\"&INDEX(swimmers_data,$B23,2)&\",\"&INDEX(swimmers_data,$B23,4)&\",\"&TEXT(INDEX(swimmers_data,$B23,3),\"ddmmYy\")&\",\"&LEFT(\"000000\",6-LEN(H23))&H23&\",\"&V$11&\",\"&\"F\",\"\")","v":""},{"$f":"IF(AND(ISNUMBER($B23),$B23>0,I23<>\"\"),INDEX(swimmers_data,$B23,5)&\",\"&INDEX(swimmers_data,$B23,1)&\",\"&INDEX(swimmers_data,$B23,2)&\",\"&INDEX(swimmers_data,$B23,4)&\",\"&TEXT(INDEX(swimmers_data,$B23,3),\"ddmmYy\")&\",\"&LEFT(\"000000\",6-LEN(I23))&I23&\",\"&W$11&\",\"&\"F\",\"\")","v":""},{"$f":"IF(AND(ISNUMBER($B23),$B23>0,J23<>\"\"),INDEX(swimmers_data,$B23,5)&\",\"&INDEX(swimmers_data,$B23,1)&\",\"&INDEX(swimmers_data,$B23,2)&\",\"&INDEX(swimmers_data,$B23,4)&\",\"&TEXT(INDEX(swimmers_data,$B23,3),\"ddmmYy\")&\",\"&LEFT(\"000000\",6-LEN(J23))&J23&\",\"&X$11&\",\"&\"F\",\"\")","v":""},{"$f":"IF(AND(ISNUMBER($B23),$B23>0,K23<>\"\"),INDEX(swimmers_data,$B23,5)&\",\"&INDEX(swimmers_data,$B23,1)&\",\"&INDEX(swimmers_data,$B23,2)&\",\"&INDEX(swimmers_data,$B23,4)&\",\"&TEXT(INDEX(swimmers_data,$B23,3),\"ddmmYy\")&\",\"&LEFT(\"000000\",6-LEN(K23))&K23&\",\"&Y$11&\",\"&\"F\",\"\")","v":""},{"$f":"IF(AND(ISNUMBER($B23),$B23>0,L23<>\"\"),INDEX(swimmers_data,$B23,5)&\",\"&INDEX(swimmers_data,$B23,1)&\",\"&INDEX(swimmers_data,$B23,2)&\",\"&INDEX(swimmers_data,$B23,4)&\",\"&TEXT(INDEX(swimmers_data,$B23,3),\"ddmmYy\")&\",\"&LEFT(\"000000\",6-LEN(L23))&L23&\",\"&Z$11&\",\"&\"F\",\"\")","v":""},{"$f":"IF(AND(ISNUMBER($B23),$B23>0,M23<>\"\"),INDEX(swimmers_data,$B23,5)&\",\"&INDEX(swimmers_data,$B23,1)&\",\"&INDEX(swimmers_data,$B23,2)&\",\"&INDEX(swimmers_data,$B23,4)&\",\"&TEXT(INDEX(swimmers_data,$B23,3),\"ddmmYy\")&\",\"&LEFT(\"000000\",6-LEN(M23))&M23&\",\"&AA$11&\",\"&\"F\",\"\")","v":""},{"$f":"IF(AND(ISNUMBER($B23),$B23>0,N23<>\"\"),INDEX(swimmers_data,$B23,5)&\",\"&INDEX(swimmers_data,$B23,1)&\",\"&INDEX(swimmers_data,$B23,2)&\",\"&INDEX(swimmers_data,$B23,4)&\",\"&TEXT(INDEX(swimmers_data,$B23,3),\"ddmmYy\")&\",\"&LEFT(\"000000\",6-LEN(N23))&N23&\",\"&AB$11&\",\"&\"F\",\"\")","v":""},null,null,"","","",{"$f":"IF(AND(ISNUMBER($B23),$B23>0,E23<>\"\"),formatMMSSHHtime(E23),\"\")","v":""},{"$f":"IF(AND(ISNUMBER($B23),$B23>0,F23<>\"\"),formatMMSSHHtime(F23),\"\")","v":""},{"$f":"IF(AND(ISNUMBER($B23),$B23>0,G23<>\"\"),formatMMSSHHtime(G23),\"\")","v":""},{"$f":"IF(AND(ISNUMBER($B23),$B23>0,H23<>\"\"),formatMMSSHHtime(H23),\"\")","v":""},{"$f":"IF(AND(ISNUMBER($B23),$B23>0,I23<>\"\"),formatMMSSHHtime(I23),\"\")","v":""},{"$f":"IF(AND(ISNUMBER($B23),$B23>0,J23<>\"\"),formatMMSSHHtime(J23),\"\")","v":""},{"$f":"IF(AND(ISNUMBER($B23),$B23>0,K23<>\"\"),formatMMSSHHtime(K23),\"\")","v":""},{"$f":"IF(AND(ISNUMBER($B23),$B23>0,L23<>\"\"),formatMMSSHHtime(L23),\"\")","v":""},{"$f":"IF(AND(ISNUMBER($B23),$B23>0,M23<>\"\"),formatMMSSHHtime(M23),\"\")","v":""},{"$f":"IF(AND(ISNUMBER($B23),$B23>0,N23<>\"\"),formatMMSSHHtime(N23),\"\")","v":""}]
["","",{"$f":"IF(AND(ISNUMBER(B24),B24>0),DATEDIF(INDEX(swimmers_data,B24,3),$C$8,\"Y\"),\"\")","v":""},{"$f":"IF(AND(ISNUMBER(B24),B24>0),INDEX(swimmers_data,B24,5),\"\")","v":""},null,null,null,null,null,null,null,null,null,null,null,null,null,null,{"$f":"IF(AND(ISNUMBER($B24),$B24>0,E24<>\"\"),INDEX(swimmers_data,$B24,5)&\",\"&INDEX(swimmers_data,$B24,1)&\",\"&INDEX(swimmers_data,$B24,2)&\",\"&INDEX(swimmers_data,$B24,4)&\",\"&TEXT(INDEX(swimmers_data,$B24,3),\"ddmmYy\")&\",\"&LEFT(\"000000\",6-LEN(E24))&E24&\",\"&S$11&\",\"&\"F\",\"\")","v":""},{"$f":"IF(AND(ISNUMBER($B24),$B24>0,F24<>\"\"),INDEX(swimmers_data,$B24,5)&\",\"&INDEX(swimmers_data,$B24,1)&\",\"&INDEX(swimmers_data,$B24,2)&\",\"&INDEX(swimmers_data,$B24,4)&\",\"&TEXT(INDEX(swimmers_data,$B24,3),\"ddmmYy\")&\",\"&LEFT(\"000000\",6-LEN(F24))&F24&\",\"&T$11&\",\"&\"F\",\"\")","v":""},{"$f":"IF(AND(ISNUMBER($B24),$B24>0,G24<>\"\"),INDEX(swimmers_data,$B24,5)&\",\"&INDEX(swimmers_data,$B24,1)&\",\"&INDEX(swimmers_data,$B24,2)&\",\"&INDEX(swimmers_data,$B24,4)&\",\"&TEXT(INDEX(swimmers_data,$B24,3),\"ddmmYy\")&\",\"&LEFT(\"000000\",6-LEN(G24))&G24&\",\"&U$11&\",\"&\"F\",\"\")","v":""},{"$f":"IF(AND(ISNUMBER($B24),$B24>0,H24<>\"\"),INDEX(swimmers_data,$B24,5)&\",\"&INDEX(swimmers_data,$B24,1)&\",\"&INDEX(swimmers_data,$B24,2)&\",\"&INDEX(swimmers_data,$B24,4)&\",\"&TEXT(INDEX(swimmers_data,$B24,3),\"ddmmYy\")&\",\"&LEFT(\"000000\",6-LEN(H24))&H24&\",\"&V$11&\",\"&\"F\",\"\")","v":""},{"$f":"IF(AND(ISNUMBER($B24),$B24>0,I24<>\"\"),INDEX(swimmers_data,$B24,5)&\",\"&INDEX(swimmers_data,$B24,1)&\",\"&INDEX(swimmers_data,$B24,2)&\",\"&INDEX(swimmers_data,$B24,4)&\",\"&TEXT(INDEX(swimmers_data,$B24,3),\"ddmmYy\")&\",\"&LEFT(\"000000\",6-LEN(I24))&I24&\",\"&W$11&\",\"&\"F\",\"\")","v":""},{"$f":"IF(AND(ISNUMBER($B24),$B24>0,J24<>\"\"),INDEX(swimmers_data,$B24,5)&\",\"&INDEX(swimmers_data,$B24,1)&\",\"&INDEX(swimmers_data,$B24,2)&\",\"&INDEX(swimmers_data,$B24,4)&\",\"&TEXT(INDEX(swimmers_data,$B24,3),\"ddmmYy\")&\",\"&LEFT(\"000000\",6-LEN(J24))&J24&\",\"&X$11&\",\"&\"F\",\"\")","v":""},{"$f":"IF(AND(ISNUMBER($B24),$B24>0,K24<>\"\"),INDEX(swimmers_data,$B24,5)&\",\"&INDEX(swimmers_data,$B24,1)&\",\"&INDEX(swimmers_data,$B24,2)&\",\"&INDEX(swimmers_data,$B24,4)&\",\"&TEXT(INDEX(swimmers_data,$B24,3),\"ddmmYy\")&\",\"&LEFT(\"000000\",6-LEN(K24))&K24&\",\"&Y$11&\",\"&\"F\",\"\")","v":""},{"$f":"IF(AND(ISNUMBER($B24),$B24>0,L24<>\"\"),INDEX(swimmers_data,$B24,5)&\",\"&INDEX(swimmers_data,$B24,1)&\",\"&INDEX(swimmers_data,$B24,2)&\",\"&INDEX(swimmers_data,$B24,4)&\",\"&TEXT(INDEX(swimmers_data,$B24,3),\"ddmmYy\")&\",\"&LEFT(\"000000\",6-LEN(L24))&L24&\",\"&Z$11&\",\"&\"F\",\"\")","v":""},{"$f":"IF(AND(ISNUMBER($B24),$B24>0,M24<>\"\"),INDEX(swimmers_data,$B24,5)&\",\"&INDEX(swimmers_data,$B24,1)&\",\"&INDEX(swimmers_data,$B24,2)&\",\"&INDEX(swimmers_data,$B24,4)&\",\"&TEXT(INDEX(swimmers_data,$B24,3),\"ddmmYy\")&\",\"&LEFT(\"000000\",6-LEN(M24))&M24&\",\"&AA$11&\",\"&\"F\",\"\")","v":""},{"$f":"IF(AND(ISNUMBER($B24),$B24>0,N24<>\"\"),INDEX(swimmers_data,$B24,5)&\",\"&INDEX(swimmers_data,$B24,1)&\",\"&INDEX(swimmers_data,$B24,2)&\",\"&INDEX(swimmers_data,$B24,4)&\",\"&TEXT(INDEX(swimmers_data,$B24,3),\"ddmmYy\")&\",\"&LEFT(\"000000\",6-LEN(N24))&N24&\",\"&AB$11&\",\"&\"F\",\"\")","v":""},null,null,"","","",{"$f":"IF(AND(ISNUMBER($B24),$B24>0,E24<>\"\"),formatMMSSHHtime(E24),\"\")","v":""},{"$f":"IF(AND(ISNUMBER($B24),$B24>0,F24<>\"\"),formatMMSSHHtime(F24),\"\")","v":""},{"$f":"IF(AND(ISNUMBER($B24),$B24>0,G24<>\"\"),formatMMSSHHtime(G24),\"\")","v":""},{"$f":"IF(AND(ISNUMBER($B24),$B24>0,H24<>\"\"),formatMMSSHHtime(H24),\"\")","v":""},{"$f":"IF(AND(ISNUMBER($B24),$B24>0,I24<>\"\"),formatMMSSHHtime(I24),\"\")","v":""},{"$f":"IF(AND(ISNUMBER($B24),$B24>0,J24<>\"\"),formatMMSSHHtime(J24),\"\")","v":""},{"$f":"IF(AND(ISNUMBER($B24),$B24>0,K24<>\"\"),formatMMSSHHtime(K24),\"\")","v":""},{"$f":"IF(AND(ISNUMBER($B24),$B24>0,L24<>\"\"),formatMMSSHHtime(L24),\"\")","v":""},{"$f":"IF(AND(ISNUMBER($B24),$B24>0,M24<>\"\"),formatMMSSHHtime(M24),\"\")","v":""},{"$f":"IF(AND(ISNUMBER($B24),$B24>0,N24<>\"\"),formatMMSSHHtime(N24),\"\")","v":""}]
["","",{"$f":"IF(AND(ISNUMBER(B25),B25>0),DATEDIF(INDEX(swimmers_data,B25,3),$C$8,\"Y\"),\"\")","v":""},{"$f":"IF(AND(ISNUMBER(B25),B25>0),INDEX(swimmers_data,B25,5),\"\")","v":""},null,null,null,null,null,null,null,null,null,null,null,null,null,null,{"$f":"IF(AND(ISNUMBER($B25),$B25>0,E25<>\"\"),INDEX(swimmers_data,$B25,5)&\",\"&INDEX(swimmers_data,$B25,1)&\",\"&INDEX(swimmers_data,$B25,2)&\",\"&INDEX(swimmers_data,$B25,4)&\",\"&TEXT(INDEX(swimmers_data,$B25,3),\"ddmmYy\")&\",\"&LEFT(\"000000\",6-LEN(E25))&E25&\",\"&S$11&\",\"&\"F\",\"\")","v":""},{"$f":"IF(AND(ISNUMBER($B25),$B25>0,F25<>\"\"),INDEX(swimmers_data,$B25,5)&\",\"&INDEX(swimmers_data,$B25,1)&\",\"&INDEX(swimmers_data,$B25,2)&\",\"&INDEX(swimmers_data,$B25,4)&\",\"&TEXT(INDEX(swimmers_data,$B25,3),\"ddmmYy\")&\",\"&LEFT(\"000000\",6-LEN(F25))&F25&\",\"&T$11&\",\"&\"F\",\"\")","v":""},{"$f":"IF(AND(ISNUMBER($B25),$B25>0,G25<>\"\"),INDEX(swimmers_data,$B25,5)&\",\"&INDEX(swimmers_data,$B25,1)&\",\"&INDEX(swimmers_data,$B25,2)&\",\"&INDEX(swimmers_data,$B25,4)&\",\"&TEXT(INDEX(swimmers_data,$B25,3),\"ddmmYy\")&\",\"&LEFT(\"000000\",6-LEN(G25))&G25&\",\"&U$11&\",\"&\"F\",\"\")","v":""},{"$f":"IF(AND(ISNUMBER($B25),$B25>0,H25<>\"\"),INDEX(swimmers_data,$B25,5)&\",\"&INDEX(swimmers_data,$B25,1)&\",\"&INDEX(swimmers_data,$B25,2)&\",\"&INDEX(swimmers_data,$B25,4)&\",\"&TEXT(INDEX(swimmers_data,$B25,3),\"ddmmYy\")&\",\"&LEFT(\"000000\",6-LEN(H25))&H25&\",\"&V$11&\",\"&\"F\",\"\")","v":""},{"$f":"IF(AND(ISNUMBER($B25),$B25>0,I25<>\"\"),INDEX(swimmers_data,$B25,5)&\",\"&INDEX(swimmers_data,$B25,1)&\",\"&INDEX(swimmers_data,$B25,2)&\",\"&INDEX(swimmers_data,$B25,4)&\",\"&TEXT(INDEX(swimmers_data,$B25,3),\"ddmmYy\")&\",\"&LEFT(\"000000\",6-LEN(I25))&I25&\",\"&W$11&\",\"&\"F\",\"\")","v":""},{"$f":"IF(AND(ISNUMBER($B25),$B25>0,J25<>\"\"),INDEX(swimmers_data,$B25,5)&\",\"&INDEX(swimmers_data,$B25,1)&\",\"&INDEX(swimmers_data,$B25,2)&\",\"&INDEX(swimmers_data,$B25,4)&\",\"&TEXT(INDEX(swimmers_data,$B25,3),\"ddmmYy\")&\",\"&LEFT(\"000000\",6-LEN(J25))&J25&\",\"&X$11&\",\"&\"F\",\"\")","v":""},{"$f":"IF(AND(ISNUMBER($B25),$B25>0,K25<>\"\"),INDEX(swimmers_data,$B25,5)&\",\"&INDEX(swimmers_data,$B25,1)&\",\"&INDEX(swimmers_data,$B25,2)&\",\"&INDEX(swimmers_data,$B25,4)&\",\"&TEXT(INDEX(swimmers_data,$B25,3),\"ddmmYy\")&\",\"&LEFT(\"000000\",6-LEN(K25))&K25&\",\"&Y$11&\",\"&\"F\",\"\")","v":""},{"$f":"IF(AND(ISNUMBER($B25),$B25>0,L25<>\"\"),INDEX(swimmers_data,$B25,5)&\",\"&INDEX(swimmers_data,$B25,1)&\",\"&INDEX(swimmers_data,$B25,2)&\",\"&INDEX(swimmers_data,$B25,4)&\",\"&TEXT(INDEX(swimmers_data,$B25,3),\"ddmmYy\")&\",\"&LEFT(\"000000\",6-LEN(L25))&L25&\",\"&Z$11&\",\"&\"F\",\"\")","v":""},{"$f":"IF(AND(ISNUMBER($B25),$B25>0,M25<>\"\"),INDEX(swimmers_data,$B25,5)&\",\"&INDEX(swimmers_data,$B25,1)&\",\"&INDEX(swimmers_data,$B25,2)&\",\"&INDEX(swimmers_data,$B25,4)&\",\"&TEXT(INDEX(swimmers_data,$B25,3),\"ddmmYy\")&\",\"&LEFT(\"000000\",6-LEN(M25))&M25&\",\"&AA$11&\",\"&\"F\",\"\")","v":""},{"$f":"IF(AND(ISNUMBER($B25),$B25>0,N25<>\"\"),INDEX(swimmers_data,$B25,5)&\",\"&INDEX(swimmers_data,$B25,1)&\",\"&INDEX(swimmers_data,$B25,2)&\",\"&INDEX(swimmers_data,$B25,4)&\",\"&TEXT(INDEX(swimmers_data,$B25,3),\"ddmmYy\")&\",\"&LEFT(\"000000\",6-LEN(N25))&N25&\",\"&AB$11&\",\"&\"F\",\"\")","v":""},null,null,"","","",{"$f":"IF(AND(ISNUMBER($B25),$B25>0,E25<>\"\"),formatMMSSHHtime(E25),\"\")","v":""},{"$f":"IF(AND(ISNUMBER($B25),$B25>0,F25<>\"\"),formatMMSSHHtime(F25),\"\")","v":""},{"$f":"IF(AND(ISNUMBER($B25),$B25>0,G25<>\"\"),formatMMSSHHtime(G25),\"\")","v":""},{"$f":"IF(AND(ISNUMBER($B25),$B25>0,H25<>\"\"),formatMMSSHHtime(H25),\"\")","v":""},{"$f":"IF(AND(ISNUMBER($B25),$B25>0,I25<>\"\"),formatMMSSHHtime(I25),\"\")","v":""},{"$f":"IF(AND(ISNUMBER($B25),$B25>0,J25<>\"\"),formatMMSSHHtime(J25),\"\")","v":""},{"$f":"IF(AND(ISNUMBER($B25),$B25>0,K25<>\"\"),formatMMSSHHtime(K25),\"\")","v":""},{"$f":"IF(AND(ISNUMBER($B25),$B25>0,L25<>\"\"),formatMMSSHHtime(L25),\"\")","v":""},{"$f":"IF(AND(ISNUMBER($B25),$B25>0,M25<>\"\"),formatMMSSHHtime(M25),\"\")","v":""},{"$f":"IF(AND(ISNUMBER($B25),$B25>0,N25<>\"\"),formatMMSSHHtime(N25),\"\")","v":""}]
["","",{"$f":"IF(AND(ISNUMBER(B26),B26>0),DATEDIF(INDEX(swimmers_data,B26,3),$C$8,\"Y\"),\"\")","v":""},{"$f":"IF(AND(ISNUMBER(B26),B26>0),INDEX(swimmers_data,B26,5),\"\")","v":""},null,null,null,null,null,null,null,null,null,null,null,null,null,null,{"$f":"IF(AND(ISNUMBER($B26),$B26>0,E26<>\"\"),INDEX(swimmers_data,$B26,5)&\",\"&INDEX(swimmers_data,$B26,1)&\",\"&INDEX(swimmers_data,$B26,2)&\",\"&INDEX(swimmers_data,$B26,4)&\",\"&TEXT(INDEX(swimmers_data,$B26,3),\"ddmmYy\")&\",\"&LEFT(\"000000\",6-LEN(E26))&E26&\",\"&S$11&\",\"&\"F\",\"\")","v":""},{"$f":"IF(AND(ISNUMBER($B26),$B26>0,F26<>\"\"),INDEX(swimmers_data,$B26,5)&\",\"&INDEX(swimmers_data,$B26,1)&\",\"&INDEX(swimmers_data,$B26,2)&\",\"&INDEX(swimmers_data,$B26,4)&\",\"&TEXT(INDEX(swimmers_data,$B26,3),\"ddmmYy\")&\",\"&LEFT(\"000000\",6-LEN(F26))&F26&\",\"&T$11&\",\"&\"F\",\"\")","v":""},{"$f":"IF(AND(ISNUMBER($B26),$B26>0,G26<>\"\"),INDEX(swimmers_data,$B26,5)&\",\"&INDEX(swimmers_data,$B26,1)&\",\"&INDEX(swimmers_data,$B26,2)&\",\"&INDEX(swimmers_data,$B26,4)&\",\"&TEXT(INDEX(swimmers_data,$B26,3),\"ddmmYy\")&\",\"&LEFT(\"000000\",6-LEN(G26))&G26&\",\"&U$11&\",\"&\"F\",\"\")","v":""},{"$f":"IF(AND(ISNUMBER($B26),$B26>0,H26<>\"\"),INDEX(swimmers_data,$B26,5)&\",\"&INDEX(swimmers_data,$B26,1)&\",\"&INDEX(swimmers_data,$B26,2)&\",\"&INDEX(swimmers_data,$B26,4)&\",\"&TEXT(INDEX(swimmers_data,$B26,3),\"ddmmYy\")&\",\"&LEFT(\"000000\",6-LEN(H26))&H26&\",\"&V$11&\",\"&\"F\",\"\")","v":""},{"$f":"IF(AND(ISNUMBER($B26),$B26>0,I26<>\"\"),INDEX(swimmers_data,$B26,5)&\",\"&INDEX(swimmers_data,$B26,1)&\",\"&INDEX(swimmers_data,$B26,2)&\",\"&INDEX(swimmers_data,$B26,4)&\",\"&TEXT(INDEX(swimmers_data,$B26,3),\"ddmmYy\")&\",\"&LEFT(\"000000\",6-LEN(I26))&I26&\",\"&W$11&\",\"&\"F\",\"\")","v":""},{"$f":"IF(AND(ISNUMBER($B26),$B26>0,J26<>\"\"),INDEX(swimmers_data,$B26,5)&\",\"&INDEX(swimmers_data,$B26,1)&\",\"&INDEX(swimmers_data,$B26,2)&\",\"&INDEX(swimmers_data,$B26,4)&\",\"&TEXT(INDEX(swimmers_data,$B26,3),\"ddmmYy\")&\",\"&LEFT(\"000000\",6-LEN(J26))&J26&\",\"&X$11&\",\"&\"F\",\"\")","v":""},{"$f":"IF(AND(ISNUMBER($B26),$B26>0,K26<>\"\"),INDEX(swimmers_data,$B26,5)&\",\"&INDEX(swimmers_data,$B26,1)&\",\"&INDEX(swimmers_data,$B26,2)&\",\"&INDEX(swimmers_data,$B26,4)&\",\"&TEXT(INDEX(swimmers_data,$B26,3),\"ddmmYy\")&\",\"&LEFT(\"000000\",6-LEN(K26))&K26&\",\"&Y$11&\",\"&\"F\",\"\")","v":""},{"$f":"IF(AND(ISNUMBER($B26),$B26>0,L26<>\"\"),INDEX(swimmers_data,$B26,5)&\",\"&INDEX(swimmers_data,$B26,1)&\",\"&INDEX(swimmers_data,$B26,2)&\",\"&INDEX(swimmers_data,$B26,4)&\",\"&TEXT(INDEX(swimmers_data,$B26,3),\"ddmmYy\")&\",\"&LEFT(\"000000\",6-LEN(L26))&L26&\",\"&Z$11&\",\"&\"F\",\"\")","v":""},{"$f":"IF(AND(ISNUMBER($B26),$B26>0,M26<>\"\"),INDEX(swimmers_data,$B26,5)&\",\"&INDEX(swimmers_data,$B26,1)&\",\"&INDEX(swimmers_data,$B26,2)&\",\"&INDEX(swimmers_data,$B26,4)&\",\"&TEXT(INDEX(swimmers_data,$B26,3),\"ddmmYy\")&\",\"&LEFT(\"000000\",6-LEN(M26))&M26&\",\"&AA$11&\",\"&\"F\",\"\")","v":""},{"$f":"IF(AND(ISNUMBER($B26),$B26>0,N26<>\"\"),INDEX(swimmers_data,$B26,5)&\",\"&INDEX(swimmers_data,$B26,1)&\",\"&INDEX(swimmers_data,$B26,2)&\",\"&INDEX(swimmers_data,$B26,4)&\",\"&TEXT(INDEX(swimmers_data,$B26,3),\"ddmmYy\")&\",\"&LEFT(\"000000\",6-LEN(N26))&N26&\",\"&AB$11&\",\"&\"F\",\"\")","v":""},null,null,"","","",{"$f":"IF(AND(ISNUMBER($B26),$B26>0,E26<>\"\"),formatMMSSHHtime(E26),\"\")","v":""},{"$f":"IF(AND(ISNUMBER($B26),$B26>0,F26<>\"\"),formatMMSSHHtime(F26),\"\")","v":""},{"$f":"IF(AND(ISNUMBER($B26),$B26>0,G26<>\"\"),formatMMSSHHtime(G26),\"\")","v":""},{"$f":"IF(AND(ISNUMBER($B26),$B26>0,H26<>\"\"),formatMMSSHHtime(H26),\"\")","v":""},{"$f":"IF(AND(ISNUMBER($B26),$B26>0,I26<>\"\"),formatMMSSHHtime(I26),\"\")","v":""},{"$f":"IF(AND(ISNUMBER($B26),$B26>0,J26<>\"\"),formatMMSSHHtime(J26),\"\")","v":""},{"$f":"IF(AND(ISNUMBER($B26),$B26>0,K26<>\"\"),formatMMSSHHtime(K26),\"\")","v":""},{"$f":"IF(AND(ISNUMBER($B26),$B26>0,L26<>\"\"),formatMMSSHHtime(L26),\"\")","v":""},{"$f":"IF(AND(ISNUMBER($B26),$B26>0,M26<>\"\"),formatMMSSHHtime(M26),\"\")","v":""},{"$f":"IF(AND(ISNUMBER($B26),$B26>0,N26<>\"\"),formatMMSSHHtime(N26),\"\")","v":""}]
["","",{"$f":"IF(AND(ISNUMBER(B27),B27>0),DATEDIF(INDEX(swimmers_data,B27,3),$C$8,\"Y\"),\"\")","v":""},{"$f":"IF(AND(ISNUMBER(B27),B27>0),INDEX(swimmers_data,B27,5),\"\")","v":""},null,null,null,null,null,null,null,null,null,null,null,null,null,null,{"$f":"IF(AND(ISNUMBER($B27),$B27>0,E27<>\"\"),INDEX(swimmers_data,$B27,5)&\",\"&INDEX(swimmers_data,$B27,1)&\",\"&INDEX(swimmers_data,$B27,2)&\",\"&INDEX(swimmers_data,$B27,4)&\",\"&TEXT(INDEX(swimmers_data,$B27,3),\"ddmmYy\")&\",\"&LEFT(\"000000\",6-LEN(E27))&E27&\",\"&S$11&\",\"&\"F\",\"\")","v":""},{"$f":"IF(AND(ISNUMBER($B27),$B27>0,F27<>\"\"),INDEX(swimmers_data,$B27,5)&\",\"&INDEX(swimmers_data,$B27,1)&\",\"&INDEX(swimmers_data,$B27,2)&\",\"&INDEX(swimmers_data,$B27,4)&\",\"&TEXT(INDEX(swimmers_data,$B27,3),\"ddmmYy\")&\",\"&LEFT(\"000000\",6-LEN(F27))&F27&\",\"&T$11&\",\"&\"F\",\"\")","v":""},{"$f":"IF(AND(ISNUMBER($B27),$B27>0,G27<>\"\"),INDEX(swimmers_data,$B27,5)&\",\"&INDEX(swimmers_data,$B27,1)&\",\"&INDEX(swimmers_data,$B27,2)&\",\"&INDEX(swimmers_data,$B27,4)&\",\"&TEXT(INDEX(swimmers_data,$B27,3),\"ddmmYy\")&\",\"&LEFT(\"000000\",6-LEN(G27))&G27&\",\"&U$11&\",\"&\"F\",\"\")","v":""},{"$f":"IF(AND(ISNUMBER($B27),$B27>0,H27<>\"\"),INDEX(swimmers_data,$B27,5)&\",\"&INDEX(swimmers_data,$B27,1)&\",\"&INDEX(swimmers_data,$B27,2)&\",\"&INDEX(swimmers_data,$B27,4)&\",\"&TEXT(INDEX(swimmers_data,$B27,3),\"ddmmYy\")&\",\"&LEFT(\"000000\",6-LEN(H27))&H27&\",\"&V$11&\",\"&\"F\",\"\")","v":""},{"$f":"IF(AND(ISNUMBER($B27),$B27>0,I27<>\"\"),INDEX(swimmers_data,$B27,5)&\",\"&INDEX(swimmers_data,$B27,1)&\",\"&INDEX(swimmers_data,$B27,2)&\",\"&INDEX(swimmers_data,$B27,4)&\",\"&TEXT(INDEX(swimmers_data,$B27,3),\"ddmmYy\")&\",\"&LEFT(\"000000\",6-LEN(I27))&I27&\",\"&W$11&\",\"&\"F\",\"\")","v":""},{"$f":"IF(AND(ISNUMBER($B27),$B27>0,J27<>\"\"),INDEX(swimmers_data,$B27,5)&\",\"&INDEX(swimmers_data,$B27,1)&\",\"&INDEX(swimmers_data,$B27,2)&\",\"&INDEX(swimmers_data,$B27,4)&\",\"&TEXT(INDEX(swimmers_data,$B27,3),\"ddmmYy\")&\",\"&LEFT(\"000000\",6-LEN(J27))&J27&\",\"&X$11&\",\"&\"F\",\"\")","v":""},{"$f":"IF(AND(ISNUMBER($B27),$B27>0,K27<>\"\"),INDEX(swimmers_data,$B27,5)&\",\"&INDEX(swimmers_data,$B27,1)&\",\"&INDEX(swimmers_data,$B27,2)&\",\"&INDEX(swimmers_data,$B27,4)&\",\"&TEXT(INDEX(swimmers_data,$B27,3),\"ddmmYy\")&\",\"&LEFT(\"000000\",6-LEN(K27))&K27&\",\"&Y$11&\",\"&\"F\",\"\")","v":""},{"$f":"IF(AND(ISNUMBER($B27),$B27>0,L27<>\"\"),INDEX(swimmers_data,$B27,5)&\",\"&INDEX(swimmers_data,$B27,1)&\",\"&INDEX(swimmers_data,$B27,2)&\",\"&INDEX(swimmers_data,$B27,4)&\",\"&TEXT(INDEX(swimmers_data,$B27,3),\"ddmmYy\")&\",\"&LEFT(\"000000\",6-LEN(L27))&L27&\",\"&Z$11&\",\"&\"F\",\"\")","v":""},{"$f":"IF(AND(ISNUMBER($B27),$B27>0,M27<>\"\"),INDEX(swimmers_data,$B27,5)&\",\"&INDEX(swimmers_data,$B27,1)&\",\"&INDEX(swimmers_data,$B27,2)&\",\"&INDEX(swimmers_data,$B27,4)&\",\"&TEXT(INDEX(swimmers_data,$B27,3),\"ddmmYy\")&\",\"&LEFT(\"000000\",6-LEN(M27))&M27&\",\"&AA$11&\",\"&\"F\",\"\")","v":""},{"$f":"IF(AND(ISNUMBER($B27),$B27>0,N27<>\"\"),INDEX(swimmers_data,$B27,5)&\",\"&INDEX(swimmers_data,$B27,1)&\",\"&INDEX(swimmers_data,$B27,2)&\",\"&INDEX(swimmers_data,$B27,4)&\",\"&TEXT(INDEX(swimmers_data,$B27,3),\"ddmmYy\")&\",\"&LEFT(\"000000\",6-LEN(N27))&N27&\",\"&AB$11&\",\"&\"F\",\"\")","v":""},null,null,"","","",{"$f":"IF(AND(ISNUMBER($B27),$B27>0,E27<>\"\"),formatMMSSHHtime(E27),\"\")","v":""},{"$f":"IF(AND(ISNUMBER($B27),$B27>0,F27<>\"\"),formatMMSSHHtime(F27),\"\")","v":""},{"$f":"IF(AND(ISNUMBER($B27),$B27>0,G27<>\"\"),formatMMSSHHtime(G27),\"\")","v":""},{"$f":"IF(AND(ISNUMBER($B27),$B27>0,H27<>\"\"),formatMMSSHHtime(H27),\"\")","v":""},{"$f":"IF(AND(ISNUMBER($B27),$B27>0,I27<>\"\"),formatMMSSHHtime(I27),\"\")","v":""},{"$f":"IF(AND(ISNUMBER($B27),$B27>0,J27<>\"\"),formatMMSSHHtime(J27),\"\")","v":""},{"$f":"IF(AND(ISNUMBER($B27),$B27>0,K27<>\"\"),formatMMSSHHtime(K27),\"\")","v":""},{"$f":"IF(AND(ISNUMBER($B27),$B27>0,L27<>\"\"),formatMMSSHHtime(L27),\"\")","v":""},{"$f":"IF(AND(ISNUMBER($B27),$B27>0,M27<>\"\"),formatMMSSHHtime(M27),\"\")","v":""},{"$f":"IF(AND(ISNUMBER($B27),$B27>0,N27<>\"\"),formatMMSSHHtime(N27),\"\")","v":""}]
["","",{"$f":"IF(AND(ISNUMBER(B28),B28>0),DATEDIF(INDEX(swimmers_data,B28,3),$C$8,\"Y\"),\"\")","v":""},{"$f":"IF(AND(ISNUMBER(B28),B28>0),INDEX(swimmers_data,B28,5),\"\")","v":""},null,null,null,null,null,null,null,null,null,null,null,null,null,null,{"$f":"IF(AND(ISNUMBER($B28),$B28>0,E28<>\"\"),INDEX(swimmers_data,$B28,5)&\",\"&INDEX(swimmers_data,$B28,1)&\",\"&INDEX(swimmers_data,$B28,2)&\",\"&INDEX(swimmers_data,$B28,4)&\",\"&TEXT(INDEX(swimmers_data,$B28,3),\"ddmmYy\")&\",\"&LEFT(\"000000\",6-LEN(E28))&E28&\",\"&S$11&\",\"&\"F\",\"\")","v":""},{"$f":"IF(AND(ISNUMBER($B28),$B28>0,F28<>\"\"),INDEX(swimmers_data,$B28,5)&\",\"&INDEX(swimmers_data,$B28,1)&\",\"&INDEX(swimmers_data,$B28,2)&\",\"&INDEX(swimmers_data,$B28,4)&\",\"&TEXT(INDEX(swimmers_data,$B28,3),\"ddmmYy\")&\",\"&LEFT(\"000000\",6-LEN(F28))&F28&\",\"&T$11&\",\"&\"F\",\"\")","v":""},{"$f":"IF(AND(ISNUMBER($B28),$B28>0,G28<>\"\"),INDEX(swimmers_data,$B28,5)&\",\"&INDEX(swimmers_data,$B28,1)&\",\"&INDEX(swimmers_data,$B28,2)&\",\"&INDEX(swimmers_data,$B28,4)&\",\"&TEXT(INDEX(swimmers_data,$B28,3),\"ddmmYy\")&\",\"&LEFT(\"000000\",6-LEN(G28))&G28&\",\"&U$11&\",\"&\"F\",\"\")","v":""},{"$f":"IF(AND(ISNUMBER($B28),$B28>0,H28<>\"\"),INDEX(swimmers_data,$B28,5)&\",\"&INDEX(swimmers_data,$B28,1)&\",\"&INDEX(swimmers_data,$B28,2)&\",\"&INDEX(swimmers_data,$B28,4)&\",\"&TEXT(INDEX(swimmers_data,$B28,3),\"ddmmYy\")&\",\"&LEFT(\"000000\",6-LEN(H28))&H28&\",\"&V$11&\",\"&\"F\",\"\")","v":""},{"$f":"IF(AND(ISNUMBER($B28),$B28>0,I28<>\"\"),INDEX(swimmers_data,$B28,5)&\",\"&INDEX(swimmers_data,$B28,1)&\",\"&INDEX(swimmers_data,$B28,2)&\",\"&INDEX(swimmers_data,$B28,4)&\",\"&TEXT(INDEX(swimmers_data,$B28,3),\"ddmmYy\")&\",\"&LEFT(\"000000\",6-LEN(I28))&I28&\",\"&W$11&\",\"&\"F\",\"\")","v":""},{"$f":"IF(AND(ISNUMBER($B28),$B28>0,J28<>\"\"),INDEX(swimmers_data,$B28,5)&\",\"&INDEX(swimmers_data,$B28,1)&\",\"&INDEX(swimmers_data,$B28,2)&\",\"&INDEX(swimmers_data,$B28,4)&\",\"&TEXT(INDEX(swimmers_data,$B28,3),\"ddmmYy\")&\",\"&LEFT(\"000000\",6-LEN(J28))&J28&\",\"&X$11&\",\"&\"F\",\"\")","v":""},{"$f":"IF(AND(ISNUMBER($B28),$B28>0,K28<>\"\"),INDEX(swimmers_data,$B28,5)&\",\"&INDEX(swimmers_data,$B28,1)&\",\"&INDEX(swimmers_data,$B28,2)&\",\"&INDEX(swimmers_data,$B28,4)&\",\"&TEXT(INDEX(swimmers_data,$B28,3),\"ddmmYy\")&\",\"&LEFT(\"000000\",6-LEN(K28))&K28&\",\"&Y$11&\",\"&\"F\",\"\")","v":""},{"$f":"IF(AND(ISNUMBER($B28),$B28>0,L28<>\"\"),INDEX(swimmers_data,$B28,5)&\",\"&INDEX(swimmers_data,$B28,1)&\",\"&INDEX(swimmers_data,$B28,2)&\",\"&INDEX(swimmers_data,$B28,4)&\",\"&TEXT(INDEX(swimmers_data,$B28,3),\"ddmmYy\")&\",\"&LEFT(\"000000\",6-LEN(L28))&L28&\",\"&Z$11&\",\"&\"F\",\"\")","v":""},{"$f":"IF(AND(ISNUMBER($B28),$B28>0,M28<>\"\"),INDEX(swimmers_data,$B28,5)&\",\"&INDEX(swimmers_data,$B28,1)&\",\"&INDEX(swimmers_data,$B28,2)&\",\"&INDEX(swimmers_data,$B28,4)&\",\"&TEXT(INDEX(swimmers_data,$B28,3),\"ddmmYy\")&\",\"&LEFT(\"000000\",6-LEN(M28))&M28&\",\"&AA$11&\",\"&\"F\",\"\")","v":""},{"$f":"IF(AND(ISNUMBER($B28),$B28>0,N28<>\"\"),INDEX(swimmers_data,$B28,5)&\",\"&INDEX(swimmers_data,$B28,1)&\",\"&INDEX(swimmers_data,$B28,2)&\",\"&INDEX(swimmers_data,$B28,4)&\",\"&TEXT(INDEX(swimmers_data,$B28,3),\"ddmmYy\")&\",\"&LEFT(\"000000\",6-LEN(N28))&N28&\",\"&AB$11&\",\"&\"F\",\"\")","v":""},null,null,"","","",{"$f":"IF(AND(ISNUMBER($B28),$B28>0,E28<>\"\"),formatMMSSHHtime(E28),\"\")","v":""},{"$f":"IF(AND(ISNUMBER($B28),$B28>0,F28<>\"\"),formatMMSSHHtime(F28),\"\")","v":""},{"$f":"IF(AND(ISNUMBER($B28),$B28>0,G28<>\"\"),formatMMSSHHtime(G28),\"\")","v":""},{"$f":"IF(AND(ISNUMBER($B28),$B28>0,H28<>\"\"),formatMMSSHHtime(H28),\"\")","v":""},{"$f":"IF(AND(ISNUMBER($B28),$B28>0,I28<>\"\"),formatMMSSHHtime(I28),\"\")","v":""},{"$f":"IF(AND(ISNUMBER($B28),$B28>0,J28<>\"\"),formatMMSSHHtime(J28),\"\")","v":""},{"$f":"IF(AND(ISNUMBER($B28),$B28>0,K28<>\"\"),formatMMSSHHtime(K28),\"\")","v":""},{"$f":"IF(AND(ISNUMBER($B28),$B28>0,L28<>\"\"),formatMMSSHHtime(L28),\"\")","v":""},{"$f":"IF(AND(ISNUMBER($B28),$B28>0,M28<>\"\"),formatMMSSHHtime(M28),\"\")","v":""},{"$f":"IF(AND(ISNUMBER($B28),$B28>0,N28<>\"\"),formatMMSSHHtime(N28),\"\")","v":""}]
["","",{"$f":"IF(AND(ISNUMBER(B29),B29>0),DATEDIF(INDEX(swimmers_data,B29,3),$C$8,\"Y\"),\"\")","v":""},{"$f":"IF(AND(ISNUMBER(B29),B29>0),INDEX(swimmers_data,B29,5),\"\")","v":""},null,null,null,null,null,null,null,null,null,null,null,null,null,null,{"$f":"IF(AND(ISNUMBER($B29),$B29>0,E29<>\"\"),INDEX(swimmers_data,$B29,5)&\",\"&INDEX(swimmers_data,$B29,1)&\",\"&INDEX(swimmers_data,$B29,2)&\",\"&INDEX(swimmers_data,$B29,4)&\",\"&TEXT(INDEX(swimmers_data,$B29,3),\"ddmmYy\")&\",\"&LEFT(\"000000\",6-LEN(E29))&E29&\",\"&S$11&\",\"&\"F\",\"\")","v":""},{"$f":"IF(AND(ISNUMBER($B29),$B29>0,F29<>\"\"),INDEX(swimmers_data,$B29,5)&\",\"&INDEX(swimmers_data,$B29,1)&\",\"&INDEX(swimmers_data,$B29,2)&\",\"&INDEX(swimmers_data,$B29,4)&\",\"&TEXT(INDEX(swimmers_data,$B29,3),\"ddmmYy\")&\",\"&LEFT(\"000000\",6-LEN(F29))&F29&\",\"&T$11&\",\"&\"F\",\"\")","v":""},{"$f":"IF(AND(ISNUMBER($B29),$B29>0,G29<>\"\"),INDEX(swimmers_data,$B29,5)&\",\"&INDEX(swimmers_data,$B29,1)&\",\"&INDEX(swimmers_data,$B29,2)&\",\"&INDEX(swimmers_data,$B29,4)&\",\"&TEXT(INDEX(swimmers_data,$B29,3),\"ddmmYy\")&\",\"&LEFT(\"000000\",6-LEN(G29))&G29&\",\"&U$11&\",\"&\"F\",\"\")","v":""},{"$f":"IF(AND(ISNUMBER($B29),$B29>0,H29<>\"\"),INDEX(swimmers_data,$B29,5)&\",\"&INDEX(swimmers_data,$B29,1)&\",\"&INDEX(swimmers_data,$B29,2)&\",\"&INDEX(swimmers_data,$B29,4)&\",\"&TEXT(INDEX(swimmers_data,$B29,3),\"ddmmYy\")&\",\"&LEFT(\"000000\",6-LEN(H29))&H29&\",\"&V$11&\",\"&\"F\",\"\")","v":""},{"$f":"IF(AND(ISNUMBER($B29),$B29>0,I29<>\"\"),INDEX(swimmers_data,$B29,5)&\",\"&INDEX(swimmers_data,$B29,1)&\",\"&INDEX(swimmers_data,$B29,2)&\",\"&INDEX(swimmers_data,$B29,4)&\",\"&TEXT(INDEX(swimmers_data,$B29,3),\"ddmmYy\")&\",\"&LEFT(\"000000\",6-LEN(I29))&I29&\",\"&W$11&\",\"&\"F\",\"\")","v":""},{"$f":"IF(AND(ISNUMBER($B29),$B29>0,J29<>\"\"),INDEX(swimmers_data,$B29,5)&\",\"&INDEX(swimmers_data,$B29,1)&\",\"&INDEX(swimmers_data,$B29,2)&\",\"&INDEX(swimmers_data,$B29,4)&\",\"&TEXT(INDEX(swimmers_data,$B29,3),\"ddmmYy\")&\",\"&LEFT(\"000000\",6-LEN(J29))&J29&\",\"&X$11&\",\"&\"F\",\"\")","v":""},{"$f":"IF(AND(ISNUMBER($B29),$B29>0,K29<>\"\"),INDEX(swimmers_data,$B29,5)&\",\"&INDEX(swimmers_data,$B29,1)&\",\"&INDEX(swimmers_data,$B29,2)&\",\"&INDEX(swimmers_data,$B29,4)&\",\"&TEXT(INDEX(swimmers_data,$B29,3),\"ddmmYy\")&\",\"&LEFT(\"000000\",6-LEN(K29))&K29&\",\"&Y$11&\",\"&\"F\",\"\")","v":""},{"$f":"IF(AND(ISNUMBER($B29),$B29>0,L29<>\"\"),INDEX(swimmers_data,$B29,5)&\",\"&INDEX(swimmers_data,$B29,1)&\",\"&INDEX(swimmers_data,$B29,2)&\",\"&INDEX(swimmers_data,$B29,4)&\",\"&TEXT(INDEX(swimmers_data,$B29,3),\"ddmmYy\")&\",\"&LEFT(\"000000\",6-LEN(L29))&L29&\",\"&Z$11&\",\"&\"F\",\"\")","v":""},{"$f":"IF(AND(ISNUMBER($B29),$B29>0,M29<>\"\"),INDEX(swimmers_data,$B29,5)&\",\"&INDEX(swimmers_data,$B29,1)&\",\"&INDEX(swimmers_data,$B29,2)&\",\"&INDEX(swimmers_data,$B29,4)&\",\"&TEXT(INDEX(swimmers_data,$B29,3),\"ddmmYy\")&\",\"&LEFT(\"000000\",6-LEN(M29))&M29&\",\"&AA$11&\",\"&\"F\",\"\")","v":""},{"$f":"IF(AND(ISNUMBER($B29),$B29>0,N29<>\"\"),INDEX(swimmers_data,$B29,5)&\",\"&INDEX(swimmers_data,$B29,1)&\",\"&INDEX(swimmers_data,$B29,2)&\",\"&INDEX(swimmers_data,$B29,4)&\",\"&TEXT(INDEX(swimmers_data,$B29,3),\"ddmmYy\")&\",\"&LEFT(\"000000\",6-LEN(N29))&N29&\",\"&AB$11&\",\"&\"F\",\"\")","v":""},null,null,"","","",{"$f":"IF(AND(ISNUMBER($B29),$B29>0,E29<>\"\"),formatMMSSHHtime(E29),\"\")","v":""},{"$f":"IF(AND(ISNUMBER($B29),$B29>0,F29<>\"\"),formatMMSSHHtime(F29),\"\")","v":""},{"$f":"IF(AND(ISNUMBER($B29),$B29>0,G29<>\"\"),formatMMSSHHtime(G29),\"\")","v":""},{"$f":"IF(AND(ISNUMBER($B29),$B29>0,H29<>\"\"),formatMMSSHHtime(H29),\"\")","v":""},{"$f":"IF(AND(ISNUMBER($B29),$B29>0,I29<>\"\"),formatMMSSHHtime(I29),\"\")","v":""},{"$f":"IF(AND(ISNUMBER($B29),$B29>0,J29<>\"\"),formatMMSSHHtime(J29),\"\")","v":""},{"$f":"IF(AND(ISNUMBER($B29),$B29>0,K29<>\"\"),formatMMSSHHtime(K29),\"\")","v":""},{"$f":"IF(AND(ISNUMBER($B29),$B29>0,L29<>\"\"),formatMMSSHHtime(L29),\"\")","v":""},{"$f":"IF(AND(ISNUMBER($B29),$B29>0,M29<>\"\"),formatMMSSHHtime(M29),\"\")","v":""},{"$f":"IF(AND(ISNUMBER($B29),$B29>0,N29<>\"\"),formatMMSSHHtime(N29),\"\")","v":""}]
["","",{"$f":"IF(AND(ISNUMBER(B30),B30>0),DATEDIF(INDEX(swimmers_data,B30,3),$C$8,\"Y\"),\"\")","v":""},{"$f":"IF(AND(ISNUMBER(B30),B30>0),INDEX(swimmers_data,B30,5),\"\")","v":""},null,null,null,null,null,null,null,null,null,null,null,null,null,null,{"$f":"IF(AND(ISNUMBER($B30),$B30>0,E30<>\"\"),INDEX(swimmers_data,$B30,5)&\",\"&INDEX(swimmers_data,$B30,1)&\",\"&INDEX(swimmers_data,$B30,2)&\",\"&INDEX(swimmers_data,$B30,4)&\",\"&TEXT(INDEX(swimmers_data,$B30,3),\"ddmmYy\")&\",\"&LEFT(\"000000\",6-LEN(E30))&E30&\",\"&S$11&\",\"&\"F\",\"\")","v":""},{"$f":"IF(AND(ISNUMBER($B30),$B30>0,F30<>\"\"),INDEX(swimmers_data,$B30,5)&\",\"&INDEX(swimmers_data,$B30,1)&\",\"&INDEX(swimmers_data,$B30,2)&\",\"&INDEX(swimmers_data,$B30,4)&\",\"&TEXT(INDEX(swimmers_data,$B30,3),\"ddmmYy\")&\",\"&LEFT(\"000000\",6-LEN(F30))&F30&\",\"&T$11&\",\"&\"F\",\"\")","v":""},{"$f":"IF(AND(ISNUMBER($B30),$B30>0,G30<>\"\"),INDEX(swimmers_data,$B30,5)&\",\"&INDEX(swimmers_data,$B30,1)&\",\"&INDEX(swimmers_data,$B30,2)&\",\"&INDEX(swimmers_data,$B30,4)&\",\"&TEXT(INDEX(swimmers_data,$B30,3),\"ddmmYy\")&\",\"&LEFT(\"000000\",6-LEN(G30))&G30&\",\"&U$11&\",\"&\"F\",\"\")","v":""},{"$f":"IF(AND(ISNUMBER($B30),$B30>0,H30<>\"\"),INDEX(swimmers_data,$B30,5)&\",\"&INDEX(swimmers_data,$B30,1)&\",\"&INDEX(swimmers_data,$B30,2)&\",\"&INDEX(swimmers_data,$B30,4)&\",\"&TEXT(INDEX(swimmers_data,$B30,3),\"ddmmYy\")&\",\"&LEFT(\"000000\",6-LEN(H30))&H30&\",\"&V$11&\",\"&\"F\",\"\")","v":""},{"$f":"IF(AND(ISNUMBER($B30),$B30>0,I30<>\"\"),INDEX(swimmers_data,$B30,5)&\",\"&INDEX(swimmers_data,$B30,1)&\",\"&INDEX(swimmers_data,$B30,2)&\",\"&INDEX(swimmers_data,$B30,4)&\",\"&TEXT(INDEX(swimmers_data,$B30,3),\"ddmmYy\")&\",\"&LEFT(\"000000\",6-LEN(I30))&I30&\",\"&W$11&\",\"&\"F\",\"\")","v":""},{"$f":"IF(AND(ISNUMBER($B30),$B30>0,J30<>\"\"),INDEX(swimmers_data,$B30,5)&\",\"&INDEX(swimmers_data,$B30,1)&\",\"&INDEX(swimmers_data,$B30,2)&\",\"&INDEX(swimmers_data,$B30,4)&\",\"&TEXT(INDEX(swimmers_data,$B30,3),\"ddmmYy\")&\",\"&LEFT(\"000000\",6-LEN(J30))&J30&\",\"&X$11&\",\"&\"F\",\"\")","v":""},{"$f":"IF(AND(ISNUMBER($B30),$B30>0,K30<>\"\"),INDEX(swimmers_data,$B30,5)&\",\"&INDEX(swimmers_data,$B30,1)&\",\"&INDEX(swimmers_data,$B30,2)&\",\"&INDEX(swimmers_data,$B30,4)&\",\"&TEXT(INDEX(swimmers_data,$B30,3),\"ddmmYy\")&\",\"&LEFT(\"000000\",6-LEN(K30))&K30&\",\"&Y$11&\",\"&\"F\",\"\")","v":""},{"$f":"IF(AND(ISNUMBER($B30),$B30>0,L30<>\"\"),INDEX(swimmers_data,$B30,5)&\",\"&INDEX(swimmers_data,$B30,1)&\",\"&INDEX(swimmers_data,$B30,2)&\",\"&INDEX(swimmers_data,$B30,4)&\",\"&TEXT(INDEX(swimmers_data,$B30,3),\"ddmmYy\")&\",\"&LEFT(\"000000\",6-LEN(L30))&L30&\",\"&Z$11&\",\"&\"F\",\"\")","v":""},{"$f":"IF(AND(ISNUMBER($B30),$B30>0,M30<>\"\"),INDEX(swimmers_data,$B30,5)&\",\"&INDEX(swimmers_data,$B30,1)&\",\"&INDEX(swimmers_data,$B30,2)&\",\"&INDEX(swimmers_data,$B30,4)&\",\"&TEXT(INDEX(swimmers_data,$B30,3),\"ddmmYy\")&\",\"&LEFT(\"000000\",6-LEN(M30))&M30&\",\"&AA$11&\",\"&\"F\",\"\")","v":""},{"$f":"IF(AND(ISNUMBER($B30),$B30>0,N30<>\"\"),INDEX(swimmers_data,$B30,5)&\",\"&INDEX(swimmers_data,$B30,1)&\",\"&INDEX(swimmers_data,$B30,2)&\",\"&INDEX(swimmers_data,$B30,4)&\",\"&TEXT(INDEX(swimmers_data,$B30,3),\"ddmmYy\")&\",\"&LEFT(\"000000\",6-LEN(N30))&N30&\",\"&AB$11&\",\"&\"F\",\"\")","v":""},null,null,"","","",{"$f":"IF(AND(ISNUMBER($B30),$B30>0,E30<>\"\"),formatMMSSHHtime(E30),\"\")","v":""},{"$f":"IF(AND(ISNUMBER($B30),$B30>0,F30<>\"\"),formatMMSSHHtime(F30),\"\")","v":""},{"$f":"IF(AND(ISNUMBER($B30),$B30>0,G30<>\"\"),formatMMSSHHtime(G30),\"\")","v":""},{"$f":"IF(AND(ISNUMBER($B30),$B30>0,H30<>\"\"),formatMMSSHHtime(H30),\"\")","v":""},{"$f":"IF(AND(ISNUMBER($B30),$B30>0,I30<>\"\"),formatMMSSHHtime(I30),\"\")","v":""},{"$f":"IF(AND(ISNUMBER($B30),$B30>0,J30<>\"\"),formatMMSSHHtime(J30),\"\")","v":""},{"$f":"IF(AND(ISNUMBER($B30),$B30>0,K30<>\"\"),formatMMSSHHtime(K30),\"\")","v":""},{"$f":"IF(AND(ISNUMBER($B30),$B30>0,L30<>\"\"),formatMMSSHHtime(L30),\"\")","v":""},{"$f":"IF(AND(ISNUMBER($B30),$B30>0,M30<>\"\"),formatMMSSHHtime(M30),\"\")","v":""},{"$f":"IF(AND(ISNUMBER($B30),$B30>0,N30<>\"\"),formatMMSSHHtime(N30),\"\")","v":""}]
["","",{"$f":"IF(AND(ISNUMBER(B31),B31>0),DATEDIF(INDEX(swimmers_data,B31,3),$C$8,\"Y\"),\"\")","v":""},{"$f":"IF(AND(ISNUMBER(B31),B31>0),INDEX(swimmers_data,B31,5),\"\")","v":""},null,null,null,null,null,null,null,null,null,null,null,null,null,null,{"$f":"IF(AND(ISNUMBER($B31),$B31>0,E31<>\"\"),INDEX(swimmers_data,$B31,5)&\",\"&INDEX(swimmers_data,$B31,1)&\",\"&INDEX(swimmers_data,$B31,2)&\",\"&INDEX(swimmers_data,$B31,4)&\",\"&TEXT(INDEX(swimmers_data,$B31,3),\"ddmmYy\")&\",\"&LEFT(\"000000\",6-LEN(E31))&E31&\",\"&S$11&\",\"&\"F\",\"\")","v":""},{"$f":"IF(AND(ISNUMBER($B31),$B31>0,F31<>\"\"),INDEX(swimmers_data,$B31,5)&\",\"&INDEX(swimmers_data,$B31,1)&\",\"&INDEX(swimmers_data,$B31,2)&\",\"&INDEX(swimmers_data,$B31,4)&\",\"&TEXT(INDEX(swimmers_data,$B31,3),\"ddmmYy\")&\",\"&LEFT(\"000000\",6-LEN(F31))&F31&\",\"&T$11&\",\"&\"F\",\"\")","v":""},{"$f":"IF(AND(ISNUMBER($B31),$B31>0,G31<>\"\"),INDEX(swimmers_data,$B31,5)&\",\"&INDEX(swimmers_data,$B31,1)&\",\"&INDEX(swimmers_data,$B31,2)&\",\"&INDEX(swimmers_data,$B31,4)&\",\"&TEXT(INDEX(swimmers_data,$B31,3),\"ddmmYy\")&\",\"&LEFT(\"000000\",6-LEN(G31))&G31&\",\"&U$11&\",\"&\"F\",\"\")","v":""},{"$f":"IF(AND(ISNUMBER($B31),$B31>0,H31<>\"\"),INDEX(swimmers_data,$B31,5)&\",\"&INDEX(swimmers_data,$B31,1)&\",\"&INDEX(swimmers_data,$B31,2)&\",\"&INDEX(swimmers_data,$B31,4)&\",\"&TEXT(INDEX(swimmers_data,$B31,3),\"ddmmYy\")&\",\"&LEFT(\"000000\",6-LEN(H31))&H31&\",\"&V$11&\",\"&\"F\",\"\")","v":""},{"$f":"IF(AND(ISNUMBER($B31),$B31>0,I31<>\"\"),INDEX(swimmers_data,$B31,5)&\",\"&INDEX(swimmers_data,$B31,1)&\",\"&INDEX(swimmers_data,$B31,2)&\",\"&INDEX(swimmers_data,$B31,4)&\",\"&TEXT(INDEX(swimmers_data,$B31,3),\"ddmmYy\")&\",\"&LEFT(\"000000\",6-LEN(I31))&I31&\",\"&W$11&\",\"&\"F\",\"\")","v":""},{"$f":"IF(AND(ISNUMBER($B31),$B31>0,J31<>\"\"),INDEX(swimmers_data,$B31,5)&\",\"&INDEX(swimmers_data,$B31,1)&\",\"&INDEX(swimmers_data,$B31,2)&\",\"&INDEX(swimmers_data,$B31,4)&\",\"&TEXT(INDEX(swimmers_data,$B31,3),\"ddmmYy\")&\",\"&LEFT(\"000000\",6-LEN(J31))&J31&\",\"&X$11&\",\"&\"F\",\"\")","v":""},{"$f":"IF(AND(ISNUMBER($B31),$B31>0,K31<>\"\"),INDEX(swimmers_data,$B31,5)&\",\"&INDEX(swimmers_data,$B31,1)&\",\"&INDEX(swimmers_data,$B31,2)&\",\"&INDEX(swimmers_data,$B31,4)&\",\"&TEXT(INDEX(swimmers_data,$B31,3),\"ddmmYy\")&\",\"&LEFT(\"000000\",6-LEN(K31))&K31&\",\"&Y$11&\",\"&\"F\",\"\")","v":""},{"$f":"IF(AND(ISNUMBER($B31),$B31>0,L31<>\"\"),INDEX(swimmers_data,$B31,5)&\",\"&INDEX(swimmers_data,$B31,1)&\",\"&INDEX(swimmers_data,$B31,2)&\",\"&INDEX(swimmers_data,$B31,4)&\",\"&TEXT(INDEX(swimmers_data,$B31,3),\"ddmmYy\")&\",\"&LEFT(\"000000\",6-LEN(L31))&L31&\",\"&Z$11&\",\"&\"F\",\"\")","v":""},{"$f":"IF(AND(ISNUMBER($B31),$B31>0,M31<>\"\"),INDEX(swimmers_data,$B31,5)&\",\"&INDEX(swimmers_data,$B31,1)&\",\"&INDEX(swimmers_data,$B31,2)&\",\"&INDEX(swimmers_data,$B31,4)&\",\"&TEXT(INDEX(swimmers_data,$B31,3),\"ddmmYy\")&\",\"&LEFT(\"000000\",6-LEN(M31))&M31&\",\"&AA$11&\",\"&\"F\",\"\")","v":""},{"$f":"IF(AND(ISNUMBER($B31),$B31>0,N31<>\"\"),INDEX(swimmers_data,$B31,5)&\",\"&INDEX(swimmers_data,$B31,1)&\",\"&INDEX(swimmers_data,$B31,2)&\",\"&INDEX(swimmers_data,$B31,4)&\",\"&TEXT(INDEX(swimmers_data,$B31,3),\"ddmmYy\")&\",\"&LEFT(\"000000\",6-LEN(N31))&N31&\",\"&AB$11&\",\"&\"F\",\"\")","v":""},null,null,"","","",{"$f":"IF(AND(ISNUMBER($B31),$B31>0,E31<>\"\"),formatMMSSHHtime(E31),\"\")","v":""},{"$f":"IF(AND(ISNUMBER($B31),$B31>0,F31<>\"\"),formatMMSSHHtime(F31),\"\")","v":""},{"$f":"IF(AND(ISNUMBER($B31),$B31>0,G31<>\"\"),formatMMSSHHtime(G31),\"\")","v":""},{"$f":"IF(AND(ISNUMBER($B31),$B31>0,H31<>\"\"),formatMMSSHHtime(H31),\"\")","v":""},{"$f":"IF(AND(ISNUMBER($B31),$B31>0,I31<>\"\"),formatMMSSHHtime(I31),\"\")","v":""},{"$f":"IF(AND(ISNUMBER($B31),$B31>0,J31<>\"\"),formatMMSSHHtime(J31),\"\")","v":""},{"$f":"IF(AND(ISNUMBER($B31),$B31>0,K31<>\"\"),formatMMSSHHtime(K31),\"\")","v":""},{"$f":"IF(AND(ISNUMBER($B31),$B31>0,L31<>\"\"),formatMMSSHHtime(L31),\"\")","v":""},{"$f":"IF(AND(ISNUMBER($B31),$B31>0,M31<>\"\"),formatMMSSHHtime(M31),\"\")","v":""},{"$f":"IF(AND(ISNUMBER($B31),$B31>0,N31<>\"\"),formatMMSSHHtime(N31),\"\")","v":""}]
["","",{"$f":"IF(AND(ISNUMBER(B32),B32>0),DATEDIF(INDEX(swimmers_data,B32,3),$C$8,\"Y\"),\"\")","v":""},{"$f":"IF(AND(ISNUMBER(B32),B32>0),INDEX(swimmers_data,B32,5),\"\")","v":""},null,null,null,null,null,null,null,null,null,null,null,null,null,null,{"$f":"IF(AND(ISNUMBER($B32),$B32>0,E32<>\"\"),INDEX(swimmers_data,$B32,5)&\",\"&INDEX(swimmers_data,$B32,1)&\",\"&INDEX(swimmers_data,$B32,2)&\",\"&INDEX(swimmers_data,$B32,4)&\",\"&TEXT(INDEX(swimmers_data,$B32,3),\"ddmmYy\")&\",\"&LEFT(\"000000\",6-LEN(E32))&E32&\",\"&S$11&\",\"&\"F\",\"\")","v":""},{"$f":"IF(AND(ISNUMBER($B32),$B32>0,F32<>\"\"),INDEX(swimmers_data,$B32,5)&\",\"&INDEX(swimmers_data,$B32,1)&\",\"&INDEX(swimmers_data,$B32,2)&\",\"&INDEX(swimmers_data,$B32,4)&\",\"&TEXT(INDEX(swimmers_data,$B32,3),\"ddmmYy\")&\",\"&LEFT(\"000000\",6-LEN(F32))&F32&\",\"&T$11&\",\"&\"F\",\"\")","v":""},{"$f":"IF(AND(ISNUMBER($B32),$B32>0,G32<>\"\"),INDEX(swimmers_data,$B32,5)&\",\"&INDEX(swimmers_data,$B32,1)&\",\"&INDEX(swimmers_data,$B32,2)&\",\"&INDEX(swimmers_data,$B32,4)&\",\"&TEXT(INDEX(swimmers_data,$B32,3),\"ddmmYy\")&\",\"&LEFT(\"000000\",6-LEN(G32))&G32&\",\"&U$11&\",\"&\"F\",\"\")","v":""},{"$f":"IF(AND(ISNUMBER($B32),$B32>0,H32<>\"\"),INDEX(swimmers_data,$B32,5)&\",\"&INDEX(swimmers_data,$B32,1)&\",\"&INDEX(swimmers_data,$B32,2)&\",\"&INDEX(swimmers_data,$B32,4)&\",\"&TEXT(INDEX(swimmers_data,$B32,3),\"ddmmYy\")&\",\"&LEFT(\"000000\",6-LEN(H32))&H32&\",\"&V$11&\",\"&\"F\",\"\")","v":""},{"$f":"IF(AND(ISNUMBER($B32),$B32>0,I32<>\"\"),INDEX(swimmers_data,$B32,5)&\",\"&INDEX(swimmers_data,$B32,1)&\",\"&INDEX(swimmers_data,$B32,2)&\",\"&INDEX(swimmers_data,$B32,4)&\",\"&TEXT(INDEX(swimmers_data,$B32,3),\"ddmmYy\")&\",\"&LEFT(\"000000\",6-LEN(I32))&I32&\",\"&W$11&\",\"&\"F\",\"\")","v":""},{"$f":"IF(AND(ISNUMBER($B32),$B32>0,J32<>\"\"),INDEX(swimmers_data,$B32,5)&\",\"&INDEX(swimmers_data,$B32,1)&\",\"&INDEX(swimmers_data,$B32,2)&\",\"&INDEX(swimmers_data,$B32,4)&\",\"&TEXT(INDEX(swimmers_data,$B32,3),\"ddmmYy\")&\",\"&LEFT(\"000000\",6-LEN(J32))&J32&\",\"&X$11&\",\"&\"F\",\"\")","v":""},{"$f":"IF(AND(ISNUMBER($B32),$B32>0,K32<>\"\"),INDEX(swimmers_data,$B32,5)&\",\"&INDEX(swimmers_data,$B32,1)&\",\"&INDEX(swimmers_data,$B32,2)&\",\"&INDEX(swimmers_data,$B32,4)&\",\"&TEXT(INDEX(swimmers_data,$B32,3),\"ddmmYy\")&\",\"&LEFT(\"000000\",6-LEN(K32))&K32&\",\"&Y$11&\",\"&\"F\",\"\")","v":""},{"$f":"IF(AND(ISNUMBER($B32),$B32>0,L32<>\"\"),INDEX(swimmers_data,$B32,5)&\",\"&INDEX(swimmers_data,$B32,1)&\",\"&INDEX(swimmers_data,$B32,2)&\",\"&INDEX(swimmers_data,$B32,4)&\",\"&TEXT(INDEX(swimmers_data,$B32,3),\"ddmmYy\")&\",\"&LEFT(\"000000\",6-LEN(L32))&L32&\",\"&Z$11&\",\"&\"F\",\"\")","v":""},{"$f":"IF(AND(ISNUMBER($B32),$B32>0,M32<>\"\"),INDEX(swimmers_data,$B32,5)&\",\"&INDEX(swimmers_data,$B32,1)&\",\"&INDEX(swimmers_data,$B32,2)&\",\"&INDEX(swimmers_data,$B32,4)&\",\"&TEXT(INDEX(swimmers_data,$B32,3),\"ddmmYy\")&\",\"&LEFT(\"000000\",6-LEN(M32))&M32&\",\"&AA$11&\",\"&\"F\",\"\")","v":""},{"$f":"IF(AND(ISNUMBER($B32),$B32>0,N32<>\"\"),INDEX(swimmers_data,$B32,5)&\",\"&INDEX(swimmers_data,$B32,1)&\",\"&INDEX(swimmers_data,$B32,2)&\",\"&INDEX(swimmers_data,$B32,4)&\",\"&TEXT(INDEX(swimmers_data,$B32,3),\"ddmmYy\")&\",\"&LEFT(\"000000\",6-LEN(N32))&N32&\",\"&AB$11&\",\"&\"F\",\"\")","v":""},null,null,"","","",{"$f":"IF(AND(ISNUMBER($B32),$B32>0,E32<>\"\"),formatMMSSHHtime(E32),\"\")","v":""},{"$f":"IF(AND(ISNUMBER($B32),$B32>0,F32<>\"\"),formatMMSSHHtime(F32),\"\")","v":""},{"$f":"IF(AND(ISNUMBER($B32),$B32>0,G32<>\"\"),formatMMSSHHtime(G32),\"\")","v":""},{"$f":"IF(AND(ISNUMBER($B32),$B32>0,H32<>\"\"),formatMMSSHHtime(H32),\"\")","v":""},{"$f":"IF(AND(ISNUMBER($B32),$B32>0,I32<>\"\"),formatMMSSHHtime(I32),\"\")","v":""},{"$f":"IF(AND(ISNUMBER($B32),$B32>0,J32<>\"\"),formatMMSSHHtime(J32),\"\")","v":""},{"$f":"IF(AND(ISNUMBER($B32),$B32>0,K32<>\"\"),formatMMSSHHtime(K32),\"\")","v":""},{"$f":"IF(AND(ISNUMBER($B32),$B32>0,L32<>\"\"),formatMMSSHHtime(L32),\"\")","v":""},{"$f":"IF(AND(ISNUMBER($B32),$B32>0,M32<>\"\"),formatMMSSHHtime(M32),\"\")","v":""},{"$f":"IF(AND(ISNUMBER($B32),$B32>0,N32<>\"\"),formatMMSSHHtime(N32),\"\")","v":""}]
["","",{"$f":"IF(AND(ISNUMBER(B33),B33>0),DATEDIF(INDEX(swimmers_data,B33,3),$C$8,\"Y\"),\"\")","v":""},{"$f":"IF(AND(ISNUMBER(B33),B33>0),INDEX(swimmers_data,B33,5),\"\")","v":""},null,null,null,null,null,null,null,null,null,null,null,null,null,null,{"$f":"IF(AND(ISNUMBER($B33),$B33>0,E33<>\"\"),INDEX(swimmers_data,$B33,5)&\",\"&INDEX(swimmers_data,$B33,1)&\",\"&INDEX(swimmers_data,$B33,2)&\",\"&INDEX(swimmers_data,$B33,4)&\",\"&TEXT(INDEX(swimmers_data,$B33,3),\"ddmmYy\")&\",\"&LEFT(\"000000\",6-LEN(E33))&E33&\",\"&S$11&\",\"&\"F\",\"\")","v":""},{"$f":"IF(AND(ISNUMBER($B33),$B33>0,F33<>\"\"),INDEX(swimmers_data,$B33,5)&\",\"&INDEX(swimmers_data,$B33,1)&\",\"&INDEX(swimmers_data,$B33,2)&\",\"&INDEX(swimmers_data,$B33,4)&\",\"&TEXT(INDEX(swimmers_data,$B33,3),\"ddmmYy\")&\",\"&LEFT(\"000000\",6-LEN(F33))&F33&\",\"&T$11&\",\"&\"F\",\"\")","v":""},{"$f":"IF(AND(ISNUMBER($B33),$B33>0,G33<>\"\"),INDEX(swimmers_data,$B33,5)&\",\"&INDEX(swimmers_data,$B33,1)&\",\"&INDEX(swimmers_data,$B33,2)&\",\"&INDEX(swimmers_data,$B33,4)&\",\"&TEXT(INDEX(swimmers_data,$B33,3),\"ddmmYy\")&\",\"&LEFT(\"000000\",6-LEN(G33))&G33&\",\"&U$11&\",\"&\"F\",\"\")","v":""},{"$f":"IF(AND(ISNUMBER($B33),$B33>0,H33<>\"\"),INDEX(swimmers_data,$B33,5)&\",\"&INDEX(swimmers_data,$B33,1)&\",\"&INDEX(swimmers_data,$B33,2)&\",\"&INDEX(swimmers_data,$B33,4)&\",\"&TEXT(INDEX(swimmers_data,$B33,3),\"ddmmYy\")&\",\"&LEFT(\"000000\",6-LEN(H33))&H33&\",\"&V$11&\",\"&\"F\",\"\")","v":""},{"$f":"IF(AND(ISNUMBER($B33),$B33>0,I33<>\"\"),INDEX(swimmers_data,$B33,5)&\",\"&INDEX(swimmers_data,$B33,1)&\",\"&INDEX(swimmers_data,$B33,2)&\",\"&INDEX(swimmers_data,$B33,4)&\",\"&TEXT(INDEX(swimmers_data,$B33,3),\"ddmmYy\")&\",\"&LEFT(\"000000\",6-LEN(I33))&I33&\",\"&W$11&\",\"&\"F\",\"\")","v":""},{"$f":"IF(AND(ISNUMBER($B33),$B33>0,J33<>\"\"),INDEX(swimmers_data,$B33,5)&\",\"&INDEX(swimmers_data,$B33,1)&\",\"&INDEX(swimmers_data,$B33,2)&\",\"&INDEX(swimmers_data,$B33,4)&\",\"&TEXT(INDEX(swimmers_data,$B33,3),\"ddmmYy\")&\",\"&LEFT(\"000000\",6-LEN(J33))&J33&\",\"&X$11&\",\"&\"F\",\"\")","v":""},{"$f":"IF(AND(ISNUMBER($B33),$B33>0,K33<>\"\"),INDEX(swimmers_data,$B33,5)&\",\"&INDEX(swimmers_data,$B33,1)&\",\"&INDEX(swimmers_data,$B33,2)&\",\"&INDEX(swimmers_data,$B33,4)&\",\"&TEXT(INDEX(swimmers_data,$B33,3),\"ddmmYy\")&\",\"&LEFT(\"000000\",6-LEN(K33))&K33&\",\"&Y$11&\",\"&\"F\",\"\")","v":""},{"$f":"IF(AND(ISNUMBER($B33),$B33>0,L33<>\"\"),INDEX(swimmers_data,$B33,5)&\",\"&INDEX(swimmers_data,$B33,1)&\",\"&INDEX(swimmers_data,$B33,2)&\",\"&INDEX(swimmers_data,$B33,4)&\",\"&TEXT(INDEX(swimmers_data,$B33,3),\"ddmmYy\")&\",\"&LEFT(\"000000\",6-LEN(L33))&L33&\",\"&Z$11&\",\"&\"F\",\"\")","v":""},{"$f":"IF(AND(ISNUMBER($B33),$B33>0,M33<>\"\"),INDEX(swimmers_data,$B33,5)&\",\"&INDEX(swimmers_data,$B33,1)&\",\"&INDEX(swimmers_data,$B33,2)&\",\"&INDEX(swimmers_data,$B33,4)&\",\"&TEXT(INDEX(swimmers_data,$B33,3),\"ddmmYy\")&\",\"&LEFT(\"000000\",6-LEN(M33))&M33&\",\"&AA$11&\",\"&\"F\",\"\")","v":""},{"$f":"IF(AND(ISNUMBER($B33),$B33>0,N33<>\"\"),INDEX(swimmers_data,$B33,5)&\",\"&INDEX(swimmers_data,$B33,1)&\",\"&INDEX(swimmers_data,$B33,2)&\",\"&INDEX(swimmers_data,$B33,4)&\",\"&TEXT(INDEX(swimmers_data,$B33,3),\"ddmmYy\")&\",\"&LEFT(\"000000\",6-LEN(N33))&N33&\",\"&AB$11&\",\"&\"F\",\"\")","v":""},null,null,"","","",{"$f":"IF(AND(ISNUMBER($B33),$B33>0,E33<>\"\"),formatMMSSHHtime(E33),\"\")","v":""},{"$f":"IF(AND(ISNUMBER($B33),$B33>0,F33<>\"\"),formatMMSSHHtime(F33),\"\")","v":""},{"$f":"IF(AND(ISNUMBER($B33),$B33>0,G33<>\"\"),formatMMSSHHtime(G33),\"\")","v":""},{"$f":"IF(AND(ISNUMBER($B33),$B33>0,H33<>\"\"),formatMMSSHHtime(H33),\"\")","v":""},{"$f":"IF(AND(ISNUMBER($B33),$B33>0,I33<>\"\"),formatMMSSHHtime(I33),\"\")","v":""},{"$f":"IF(AND(ISNUMBER($B33),$B33>0,J33<>\"\"),formatMMSSHHtime(J33),\"\")","v":""},{"$f":"IF(AND(ISNUMBER($B33),$B33>0,K33<>\"\"),formatMMSSHHtime(K33),\"\")","v":""},{"$f":"IF(AND(ISNUMBER($B33),$B33>0,L33<>\"\"),formatMMSSHHtime(L33),\"\")","v":""},{"$f":"IF(AND(ISNUMBER($B33),$B33>0,M33<>\"\"),formatMMSSHHtime(M33),\"\")","v":""},{"$f":"IF(AND(ISNUMBER($B33),$B33>0,N33<>\"\"),formatMMSSHHtime(N33),\"\")","v":""}]
["","",{"$f":"IF(AND(ISNUMBER(B34),B34>0),DATEDIF(INDEX(swimmers_data,B34,3),$C$8,\"Y\"),\"\")","v":""},{"$f":"IF(AND(ISNUMBER(B34),B34>0),INDEX(swimmers_data,B34,5),\"\")","v":""},null,null,null,null,null,null,null,null,null,null,null,null,null,null,{"$f":"IF(AND(ISNUMBER($B34),$B34>0,E34<>\"\"),INDEX(swimmers_data,$B34,5)&\",\"&INDEX(swimmers_data,$B34,1)&\",\"&INDEX(swimmers_data,$B34,2)&\",\"&INDEX(swimmers_data,$B34,4)&\",\"&TEXT(INDEX(swimmers_data,$B34,3),\"ddmmYy\")&\",\"&LEFT(\"000000\",6-LEN(E34))&E34&\",\"&S$11&\",\"&\"F\",\"\")","v":""},{"$f":"IF(AND(ISNUMBER($B34),$B34>0,F34<>\"\"),INDEX(swimmers_data,$B34,5)&\",\"&INDEX(swimmers_data,$B34,1)&\",\"&INDEX(swimmers_data,$B34,2)&\",\"&INDEX(swimmers_data,$B34,4)&\",\"&TEXT(INDEX(swimmers_data,$B34,3),\"ddmmYy\")&\",\"&LEFT(\"000000\",6-LEN(F34))&F34&\",\"&T$11&\",\"&\"F\",\"\")","v":""},{"$f":"IF(AND(ISNUMBER($B34),$B34>0,G34<>\"\"),INDEX(swimmers_data,$B34,5)&\",\"&INDEX(swimmers_data,$B34,1)&\",\"&INDEX(swimmers_data,$B34,2)&\",\"&INDEX(swimmers_data,$B34,4)&\",\"&TEXT(INDEX(swimmers_data,$B34,3),\"ddmmYy\")&\",\"&LEFT(\"000000\",6-LEN(G34))&G34&\",\"&U$11&\",\"&\"F\",\"\")","v":""},{"$f":"IF(AND(ISNUMBER($B34),$B34>0,H34<>\"\"),INDEX(swimmers_data,$B34,5)&\",\"&INDEX(swimmers_data,$B34,1)&\",\"&INDEX(swimmers_data,$B34,2)&\",\"&INDEX(swimmers_data,$B34,4)&\",\"&TEXT(INDEX(swimmers_data,$B34,3),\"ddmmYy\")&\",\"&LEFT(\"000000\",6-LEN(H34))&H34&\",\"&V$11&\",\"&\"F\",\"\")","v":""},{"$f":"IF(AND(ISNUMBER($B34),$B34>0,I34<>\"\"),INDEX(swimmers_data,$B34,5)&\",\"&INDEX(swimmers_data,$B34,1)&\",\"&INDEX(swimmers_data,$B34,2)&\",\"&INDEX(swimmers_data,$B34,4)&\",\"&TEXT(INDEX(swimmers_data,$B34,3),\"ddmmYy\")&\",\"&LEFT(\"000000\",6-LEN(I34))&I34&\",\"&W$11&\",\"&\"F\",\"\")","v":""},{"$f":"IF(AND(ISNUMBER($B34),$B34>0,J34<>\"\"),INDEX(swimmers_data,$B34,5)&\",\"&INDEX(swimmers_data,$B34,1)&\",\"&INDEX(swimmers_data,$B34,2)&\",\"&INDEX(swimmers_data,$B34,4)&\",\"&TEXT(INDEX(swimmers_data,$B34,3),\"ddmmYy\")&\",\"&LEFT(\"000000\",6-LEN(J34))&J34&\",\"&X$11&\",\"&\"F\",\"\")","v":""},{"$f":"IF(AND(ISNUMBER($B34),$B34>0,K34<>\"\"),INDEX(swimmers_data,$B34,5)&\",\"&INDEX(swimmers_data,$B34,1)&\",\"&INDEX(swimmers_data,$B34,2)&\",\"&INDEX(swimmers_data,$B34,4)&\",\"&TEXT(INDEX(swimmers_data,$B34,3),\"ddmmYy\")&\",\"&LEFT(\"000000\",6-LEN(K34))&K34&\",\"&Y$11&\",\"&\"F\",\"\")","v":""},{"$f":"IF(AND(ISNUMBER($B34),$B34>0,L34<>\"\"),INDEX(swimmers_data,$B34,5)&\",\"&INDEX(swimmers_data,$B34,1)&\",\"&INDEX(swimmers_data,$B34,2)&\",\"&INDEX(swimmers_data,$B34,4)&\",\"&TEXT(INDEX(swimmers_data,$B34,3),\"ddmmYy\")&\",\"&LEFT(\"000000\",6-LEN(L34))&L34&\",\"&Z$11&\",\"&\"F\",\"\")","v":""},{"$f":"IF(AND(ISNUMBER($B34),$B34>0,M34<>\"\"),INDEX(swimmers_data,$B34,5)&\",\"&INDEX(swimmers_data,$B34,1)&\",\"&INDEX(swimmers_data,$B34,2)&\",\"&INDEX(swimmers_data,$B34,4)&\",\"&TEXT(INDEX(swimmers_data,$B34,3),\"ddmmYy\")&\",\"&LEFT(\"000000\",6-LEN(M34))&M34&\",\"&AA$11&\",\"&\"F\",\"\")","v":""},{"$f":"IF(AND(ISNUMBER($B34),$B34>0,N34<>\"\"),INDEX(swimmers_data,$B34,5)&\",\"&INDEX(swimmers_data,$B34,1)&\",\"&INDEX(swimmers_data,$B34,2)&\",\"&INDEX(swimmers_data,$B34,4)&\",\"&TEXT(INDEX(swimmers_data,$B34,3),\"ddmmYy\")&\",\"&LEFT(\"000000\",6-LEN(N34))&N34&\",\"&AB$11&\",\"&\"F\",\"\")","v":""},null,null,"","","",{"$f":"IF(AND(ISNUMBER($B34),$B34>0,E34<>\"\"),formatMMSSHHtime(E34),\"\")","v":""},{"$f":"IF(AND(ISNUMBER($B34),$B34>0,F34<>\"\"),formatMMSSHHtime(F34),\"\")","v":""},{"$f":"IF(AND(ISNUMBER($B34),$B34>0,G34<>\"\"),formatMMSSHHtime(G34),\"\")","v":""},{"$f":"IF(AND(ISNUMBER($B34),$B34>0,H34<>\"\"),formatMMSSHHtime(H34),\"\")","v":""},{"$f":"IF(AND(ISNUMBER($B34),$B34>0,I34<>\"\"),formatMMSSHHtime(I34),\"\")","v":""},{"$f":"IF(AND(ISNUMBER($B34),$B34>0,J34<>\"\"),formatMMSSHHtime(J34),\"\")","v":""},{"$f":"IF(AND(ISNUMBER($B34),$B34>0,K34<>\"\"),formatMMSSHHtime(K34),\"\")","v":""},{"$f":"IF(AND(ISNUMBER($B34),$B34>0,L34<>\"\"),formatMMSSHHtime(L34),\"\")","v":""},{"$f":"IF(AND(ISNUMBER($B34),$B34>0,M34<>\"\"),formatMMSSHHtime(M34),\"\")","v":""},{"$f":"IF(AND(ISNUMBER($B34),$B34>0,N34<>\"\"),formatMMSSHHtime(N34),\"\")","v":""}]
["","",{"$f":"IF(AND(ISNUMBER(B35),B35>0),DATEDIF(INDEX(swimmers_data,B35,3),$C$8,\"Y\"),\"\")","v":""},{"$f":"IF(AND(ISNUMBER(B35),B35>0),INDEX(swimmers_data,B35,5),\"\")","v":""},null,null,null,null,null,null,null,null,null,null,null,null,null,null,{"$f":"IF(AND(ISNUMBER($B35),$B35>0,E35<>\"\"),INDEX(swimmers_data,$B35,5)&\",\"&INDEX(swimmers_data,$B35,1)&\",\"&INDEX(swimmers_data,$B35,2)&\",\"&INDEX(swimmers_data,$B35,4)&\",\"&TEXT(INDEX(swimmers_data,$B35,3),\"ddmmYy\")&\",\"&LEFT(\"000000\",6-LEN(E35))&E35&\",\"&S$11&\",\"&\"F\",\"\")","v":""},{"$f":"IF(AND(ISNUMBER($B35),$B35>0,F35<>\"\"),INDEX(swimmers_data,$B35,5)&\",\"&INDEX(swimmers_data,$B35,1)&\",\"&INDEX(swimmers_data,$B35,2)&\",\"&INDEX(swimmers_data,$B35,4)&\",\"&TEXT(INDEX(swimmers_data,$B35,3),\"ddmmYy\")&\",\"&LEFT(\"000000\",6-LEN(F35))&F35&\",\"&T$11&\",\"&\"F\",\"\")","v":""},{"$f":"IF(AND(ISNUMBER($B35),$B35>0,G35<>\"\"),INDEX(swimmers_data,$B35,5)&\",\"&INDEX(swimmers_data,$B35,1)&\",\"&INDEX(swimmers_data,$B35,2)&\",\"&INDEX(swimmers_data,$B35,4)&\",\"&TEXT(INDEX(swimmers_data,$B35,3),\"ddmmYy\")&\",\"&LEFT(\"000000\",6-LEN(G35))&G35&\",\"&U$11&\",\"&\"F\",\"\")","v":""},{"$f":"IF(AND(ISNUMBER($B35),$B35>0,H35<>\"\"),INDEX(swimmers_data,$B35,5)&\",\"&INDEX(swimmers_data,$B35,1)&\",\"&INDEX(swimmers_data,$B35,2)&\",\"&INDEX(swimmers_data,$B35,4)&\",\"&TEXT(INDEX(swimmers_data,$B35,3),\"ddmmYy\")&\",\"&LEFT(\"000000\",6-LEN(H35))&H35&\",\"&V$11&\",\"&\"F\",\"\")","v":""},{"$f":"IF(AND(ISNUMBER($B35),$B35>0,I35<>\"\"),INDEX(swimmers_data,$B35,5)&\",\"&INDEX(swimmers_data,$B35,1)&\",\"&INDEX(swimmers_data,$B35,2)&\",\"&INDEX(swimmers_data,$B35,4)&\",\"&TEXT(INDEX(swimmers_data,$B35,3),\"ddmmYy\")&\",\"&LEFT(\"000000\",6-LEN(I35))&I35&\",\"&W$11&\",\"&\"F\",\"\")","v":""},{"$f":"IF(AND(ISNUMBER($B35),$B35>0,J35<>\"\"),INDEX(swimmers_data,$B35,5)&\",\"&INDEX(swimmers_data,$B35,1)&\",\"&INDEX(swimmers_data,$B35,2)&\",\"&INDEX(swimmers_data,$B35,4)&\",\"&TEXT(INDEX(swimmers_data,$B35,3),\"ddmmYy\")&\",\"&LEFT(\"000000\",6-LEN(J35))&J35&\",\"&X$11&\",\"&\"F\",\"\")","v":""},{"$f":"IF(AND(ISNUMBER($B35),$B35>0,K35<>\"\"),INDEX(swimmers_data,$B35,5)&\",\"&INDEX(swimmers_data,$B35,1)&\",\"&INDEX(swimmers_data,$B35,2)&\",\"&INDEX(swimmers_data,$B35,4)&\",\"&TEXT(INDEX(swimmers_data,$B35,3),\"ddmmYy\")&\",\"&LEFT(\"000000\",6-LEN(K35))&K35&\",\"&Y$11&\",\"&\"F\",\"\")","v":""},{"$f":"IF(AND(ISNUMBER($B35),$B35>0,L35<>\"\"),INDEX(swimmers_data,$B35,5)&\",\"&INDEX(swimmers_data,$B35,1)&\",\"&INDEX(swimmers_data,$B35,2)&\",\"&INDEX(swimmers_data,$B35,4)&\",\"&TEXT(INDEX(swimmers_data,$B35,3),\"ddmmYy\")&\",\"&LEFT(\"000000\",6-LEN(L35))&L35&\",\"&Z$11&\",\"&\"F\",\"\")","v":""},{"$f":"IF(AND(ISNUMBER($B35),$B35>0,M35<>\"\"),INDEX(swimmers_data,$B35,5)&\",\"&INDEX(swimmers_data,$B35,1)&\",\"&INDEX(swimmers_data,$B35,2)&\",\"&INDEX(swimmers_data,$B35,4)&\",\"&TEXT(INDEX(swimmers_data,$B35,3),\"ddmmYy\")&\",\"&LEFT(\"000000\",6-LEN(M35))&M35&\",\"&AA$11&\",\"&\"F\",\"\")","v":""},{"$f":"IF(AND(ISNUMBER($B35),$B35>0,N35<>\"\"),INDEX(swimmers_data,$B35,5)&\",\"&INDEX(swimmers_data,$B35,1)&\",\"&INDEX(swimmers_data,$B35,2)&\",\"&INDEX(swimmers_data,$B35,4)&\",\"&TEXT(INDEX(swimmers_data,$B35,3),\"ddmmYy\")&\",\"&LEFT(\"000000\",6-LEN(N35))&N35&\",\"&AB$11&\",\"&\"F\",\"\")","v":""},null,null,"","","",{"$f":"IF(AND(ISNUMBER($B35),$B35>0,E35<>\"\"),formatMMSSHHtime(E35),\"\")","v":""},{"$f":"IF(AND(ISNUMBER($B35),$B35>0,F35<>\"\"),formatMMSSHHtime(F35),\"\")","v":""},{"$f":"IF(AND(ISNUMBER($B35),$B35>0,G35<>\"\"),formatMMSSHHtime(G35),\"\")","v":""},{"$f":"IF(AND(ISNUMBER($B35),$B35>0,H35<>\"\"),formatMMSSHHtime(H35),\"\")","v":""},{"$f":"IF(AND(ISNUMBER($B35),$B35>0,I35<>\"\"),formatMMSSHHtime(I35),\"\")","v":""},{"$f":"IF(AND(ISNUMBER($B35),$B35>0,J35<>\"\"),formatMMSSHHtime(J35),\"\")","v":""},{"$f":"IF(AND(ISNUMBER($B35),$B35>0,K35<>\"\"),formatMMSSHHtime(K35),\"\")","v":""},{"$f":"IF(AND(ISNUMBER($B35),$B35>0,L35<>\"\"),formatMMSSHHtime(L35),\"\")","v":""},{"$f":"IF(AND(ISNUMBER($B35),$B35>0,M35<>\"\"),formatMMSSHHtime(M35),\"\")","v":""},{"$f":"IF(AND(ISNUMBER($B35),$B35>0,N35<>\"\"),formatMMSSHHtime(N35),\"\")","v":""}]
["","",{"$f":"IF(AND(ISNUMBER(B36),B36>0),DATEDIF(INDEX(swimmers_data,B36,3),$C$8,\"Y\"),\"\")","v":""},{"$f":"IF(AND(ISNUMBER(B36),B36>0),INDEX(swimmers_data,B36,5),\"\")","v":""},null,null,null,null,null,null,null,null,null,null,null,null,null,null,{"$f":"IF(AND(ISNUMBER($B36),$B36>0,E36<>\"\"),INDEX(swimmers_data,$B36,5)&\",\"&INDEX(swimmers_data,$B36,1)&\",\"&INDEX(swimmers_data,$B36,2)&\",\"&INDEX(swimmers_data,$B36,4)&\",\"&TEXT(INDEX(swimmers_data,$B36,3),\"ddmmYy\")&\",\"&LEFT(\"000000\",6-LEN(E36))&E36&\",\"&S$11&\",\"&\"F\",\"\")","v":""},{"$f":"IF(AND(ISNUMBER($B36),$B36>0,F36<>\"\"),INDEX(swimmers_data,$B36,5)&\",\"&INDEX(swimmers_data,$B36,1)&\",\"&INDEX(swimmers_data,$B36,2)&\",\"&INDEX(swimmers_data,$B36,4)&\",\"&TEXT(INDEX(swimmers_data,$B36,3),\"ddmmYy\")&\",\"&LEFT(\"000000\",6-LEN(F36))&F36&\",\"&T$11&\",\"&\"F\",\"\")","v":""},{"$f":"IF(AND(ISNUMBER($B36),$B36>0,G36<>\"\"),INDEX(swimmers_data,$B36,5)&\",\"&INDEX(swimmers_data,$B36,1)&\",\"&INDEX(swimmers_data,$B36,2)&\",\"&INDEX(swimmers_data,$B36,4)&\",\"&TEXT(INDEX(swimmers_data,$B36,3),\"ddmmYy\")&\",\"&LEFT(\"000000\",6-LEN(G36))&G36&\",\"&U$11&\",\"&\"F\",\"\")","v":""},{"$f":"IF(AND(ISNUMBER($B36),$B36>0,H36<>\"\"),INDEX(swimmers_data,$B36,5)&\",\"&INDEX(swimmers_data,$B36,1)&\",\"&INDEX(swimmers_data,$B36,2)&\",\"&INDEX(swimmers_data,$B36,4)&\",\"&TEXT(INDEX(swimmers_data,$B36,3),\"ddmmYy\")&\",\"&LEFT(\"000000\",6-LEN(H36))&H36&\",\"&V$11&\",\"&\"F\",\"\")","v":""},{"$f":"IF(AND(ISNUMBER($B36),$B36>0,I36<>\"\"),INDEX(swimmers_data,$B36,5)&\",\"&INDEX(swimmers_data,$B36,1)&\",\"&INDEX(swimmers_data,$B36,2)&\",\"&INDEX(swimmers_data,$B36,4)&\",\"&TEXT(INDEX(swimmers_data,$B36,3),\"ddmmYy\")&\",\"&LEFT(\"000000\",6-LEN(I36))&I36&\",\"&W$11&\",\"&\"F\",\"\")","v":""},{"$f":"IF(AND(ISNUMBER($B36),$B36>0,J36<>\"\"),INDEX(swimmers_data,$B36,5)&\",\"&INDEX(swimmers_data,$B36,1)&\",\"&INDEX(swimmers_data,$B36,2)&\",\"&INDEX(swimmers_data,$B36,4)&\",\"&TEXT(INDEX(swimmers_data,$B36,3),\"ddmmYy\")&\",\"&LEFT(\"000000\",6-LEN(J36))&J36&\",\"&X$11&\",\"&\"F\",\"\")","v":""},{"$f":"IF(AND(ISNUMBER($B36),$B36>0,K36<>\"\"),INDEX(swimmers_data,$B36,5)&\",\"&INDEX(swimmers_data,$B36,1)&\",\"&INDEX(swimmers_data,$B36,2)&\",\"&INDEX(swimmers_data,$B36,4)&\",\"&TEXT(INDEX(swimmers_data,$B36,3),\"ddmmYy\")&\",\"&LEFT(\"000000\",6-LEN(K36))&K36&\",\"&Y$11&\",\"&\"F\",\"\")","v":""},{"$f":"IF(AND(ISNUMBER($B36),$B36>0,L36<>\"\"),INDEX(swimmers_data,$B36,5)&\",\"&INDEX(swimmers_data,$B36,1)&\",\"&INDEX(swimmers_data,$B36,2)&\",\"&INDEX(swimmers_data,$B36,4)&\",\"&TEXT(INDEX(swimmers_data,$B36,3),\"ddmmYy\")&\",\"&LEFT(\"000000\",6-LEN(L36))&L36&\",\"&Z$11&\",\"&\"F\",\"\")","v":""},{"$f":"IF(AND(ISNUMBER($B36),$B36>0,M36<>\"\"),INDEX(swimmers_data,$B36,5)&\",\"&INDEX(swimmers_data,$B36,1)&\",\"&INDEX(swimmers_data,$B36,2)&\",\"&INDEX(swimmers_data,$B36,4)&\",\"&TEXT(INDEX(swimmers_data,$B36,3),\"ddmmYy\")&\",\"&LEFT(\"000000\",6-LEN(M36))&M36&\",\"&AA$11&\",\"&\"F\",\"\")","v":""},{"$f":"IF(AND(ISNUMBER($B36),$B36>0,N36<>\"\"),INDEX(swimmers_data,$B36,5)&\",\"&INDEX(swimmers_data,$B36,1)&\",\"&INDEX(swimmers_data,$B36,2)&\",\"&INDEX(swimmers_data,$B36,4)&\",\"&TEXT(INDEX(swimmers_data,$B36,3),\"ddmmYy\")&\",\"&LEFT(\"000000\",6-LEN(N36))&N36&\",\"&AB$11&\",\"&\"F\",\"\")","v":""},null,null,"","","",{"$f":"IF(AND(ISNUMBER($B36),$B36>0,E36<>\"\"),formatMMSSHHtime(E36),\"\")","v":""},{"$f":"IF(AND(ISNUMBER($B36),$B36>0,F36<>\"\"),formatMMSSHHtime(F36),\"\")","v":""},{"$f":"IF(AND(ISNUMBER($B36),$B36>0,G36<>\"\"),formatMMSSHHtime(G36),\"\")","v":""},{"$f":"IF(AND(ISNUMBER($B36),$B36>0,H36<>\"\"),formatMMSSHHtime(H36),\"\")","v":""},{"$f":"IF(AND(ISNUMBER($B36),$B36>0,I36<>\"\"),formatMMSSHHtime(I36),\"\")","v":""},{"$f":"IF(AND(ISNUMBER($B36),$B36>0,J36<>\"\"),formatMMSSHHtime(J36),\"\")","v":""},{"$f":"IF(AND(ISNUMBER($B36),$B36>0,K36<>\"\"),formatMMSSHHtime(K36),\"\")","v":""},{"$f":"IF(AND(ISNUMBER($B36),$B36>0,L36<>\"\"),formatMMSSHHtime(L36),\"\")","v":""},{"$f":"IF(AND(ISNUMBER($B36),$B36>0,M36<>\"\"),formatMMSSHHtime(M36),\"\")","v":""},{"$f":"IF(AND(ISNUMBER($B36),$B36>0,N36<>\"\"),formatMMSSHHtime(N36),\"\")","v":""}]
["","",{"$f":"IF(AND(ISNUMBER(B37),B37>0),DATEDIF(INDEX(swimmers_data,B37,3),$C$8,\"Y\"),\"\")","v":""},{"$f":"IF(AND(ISNUMBER(B37),B37>0),INDEX(swimmers_data,B37,5),\"\")","v":""},null,null,null,null,null,null,null,null,null,null,null,null,null,null,{"$f":"IF(AND(ISNUMBER($B37),$B37>0,E37<>\"\"),INDEX(swimmers_data,$B37,5)&\",\"&INDEX(swimmers_data,$B37,1)&\",\"&INDEX(swimmers_data,$B37,2)&\",\"&INDEX(swimmers_data,$B37,4)&\",\"&TEXT(INDEX(swimmers_data,$B37,3),\"ddmmYy\")&\",\"&LEFT(\"000000\",6-LEN(E37))&E37&\",\"&S$11&\",\"&\"F\",\"\")","v":""},{"$f":"IF(AND(ISNUMBER($B37),$B37>0,F37<>\"\"),INDEX(swimmers_data,$B37,5)&\",\"&INDEX(swimmers_data,$B37,1)&\",\"&INDEX(swimmers_data,$B37,2)&\",\"&INDEX(swimmers_data,$B37,4)&\",\"&TEXT(INDEX(swimmers_data,$B37,3),\"ddmmYy\")&\",\"&LEFT(\"000000\",6-LEN(F37))&F37&\",\"&T$11&\",\"&\"F\",\"\")","v":""},{"$f":"IF(AND(ISNUMBER($B37),$B37>0,G37<>\"\"),INDEX(swimmers_data,$B37,5)&\",\"&INDEX(swimmers_data,$B37,1)&\",\"&INDEX(swimmers_data,$B37,2)&\",\"&INDEX(swimmers_data,$B37,4)&\",\"&TEXT(INDEX(swimmers_data,$B37,3),\"ddmmYy\")&\",\"&LEFT(\"000000\",6-LEN(G37))&G37&\",\"&U$11&\",\"&\"F\",\"\")","v":""},{"$f":"IF(AND(ISNUMBER($B37),$B37>0,H37<>\"\"),INDEX(swimmers_data,$B37,5)&\",\"&INDEX(swimmers_data,$B37,1)&\",\"&INDEX(swimmers_data,$B37,2)&\",\"&INDEX(swimmers_data,$B37,4)&\",\"&TEXT(INDEX(swimmers_data,$B37,3),\"ddmmYy\")&\",\"&LEFT(\"000000\",6-LEN(H37))&H37&\",\"&V$11&\",\"&\"F\",\"\")","v":""},{"$f":"IF(AND(ISNUMBER($B37),$B37>0,I37<>\"\"),INDEX(swimmers_data,$B37,5)&\",\"&INDEX(swimmers_data,$B37,1)&\",\"&INDEX(swimmers_data,$B37,2)&\",\"&INDEX(swimmers_data,$B37,4)&\",\"&TEXT(INDEX(swimmers_data,$B37,3),\"ddmmYy\")&\",\"&LEFT(\"000000\",6-LEN(I37))&I37&\",\"&W$11&\",\"&\"F\",\"\")","v":""},{"$f":"IF(AND(ISNUMBER($B37),$B37>0,J37<>\"\"),INDEX(swimmers_data,$B37,5)&\",\"&INDEX(swimmers_data,$B37,1)&\",\"&INDEX(swimmers_data,$B37,2)&\",\"&INDEX(swimmers_data,$B37,4)&\",\"&TEXT(INDEX(swimmers_data,$B37,3),\"ddmmYy\")&\",\"&LEFT(\"000000\",6-LEN(J37))&J37&\",\"&X$11&\",\"&\"F\",\"\")","v":""},{"$f":"IF(AND(ISNUMBER($B37),$B37>0,K37<>\"\"),INDEX(swimmers_data,$B37,5)&\",\"&INDEX(swimmers_data,$B37,1)&\",\"&INDEX(swimmers_data,$B37,2)&\",\"&INDEX(swimmers_data,$B37,4)&\",\"&TEXT(INDEX(swimmers_data,$B37,3),\"ddmmYy\")&\",\"&LEFT(\"000000\",6-LEN(K37))&K37&\",\"&Y$11&\",\"&\"F\",\"\")","v":""},{"$f":"IF(AND(ISNUMBER($B37),$B37>0,L37<>\"\"),INDEX(swimmers_data,$B37,5)&\",\"&INDEX(swimmers_data,$B37,1)&\",\"&INDEX(swimmers_data,$B37,2)&\",\"&INDEX(swimmers_data,$B37,4)&\",\"&TEXT(INDEX(swimmers_data,$B37,3),\"ddmmYy\")&\",\"&LEFT(\"000000\",6-LEN(L37))&L37&\",\"&Z$11&\",\"&\"F\",\"\")","v":""},{"$f":"IF(AND(ISNUMBER($B37),$B37>0,M37<>\"\"),INDEX(swimmers_data,$B37,5)&\",\"&INDEX(swimmers_data,$B37,1)&\",\"&INDEX(swimmers_data,$B37,2)&\",\"&INDEX(swimmers_data,$B37,4)&\",\"&TEXT(INDEX(swimmers_data,$B37,3),\"ddmmYy\")&\",\"&LEFT(\"000000\",6-LEN(M37))&M37&\",\"&AA$11&\",\"&\"F\",\"\")","v":""},{"$f":"IF(AND(ISNUMBER($B37),$B37>0,N37<>\"\"),INDEX(swimmers_data,$B37,5)&\",\"&INDEX(swimmers_data,$B37,1)&\",\"&INDEX(swimmers_data,$B37,2)&\",\"&INDEX(swimmers_data,$B37,4)&\",\"&TEXT(INDEX(swimmers_data,$B37,3),\"ddmmYy\")&\",\"&LEFT(\"000000\",6-LEN(N37))&N37&\",\"&AB$11&\",\"&\"F\",\"\")","v":""},null,null,"","","",{"$f":"IF(AND(ISNUMBER($B37),$B37>0,E37<>\"\"),formatMMSSHHtime(E37),\"\")","v":""},{"$f":"IF(AND(ISNUMBER($B37),$B37>0,F37<>\"\"),formatMMSSHHtime(F37),\"\")","v":""},{"$f":"IF(AND(ISNUMBER($B37),$B37>0,G37<>\"\"),formatMMSSHHtime(G37),\"\")","v":""},{"$f":"IF(AND(ISNUMBER($B37),$B37>0,H37<>\"\"),formatMMSSHHtime(H37),\"\")","v":""},{"$f":"IF(AND(ISNUMBER($B37),$B37>0,I37<>\"\"),formatMMSSHHtime(I37),\"\")","v":""},{"$f":"IF(AND(ISNUMBER($B37),$B37>0,J37<>\"\"),formatMMSSHHtime(J37),\"\")","v":""},{"$f":"IF(AND(ISNUMBER($B37),$B37>0,K37<>\"\"),formatMMSSHHtime(K37),\"\")","v":""},{"$f":"IF(AND(ISNUMBER($B37),$B37>0,L37<>\"\"),formatMMSSHHtime(L37),\"\")","v":""},{"$f":"IF(AND(ISNUMBER($B37),$B37>0,M37<>\"\"),formatMMSSHHtime(M37),\"\")","v":""},{"$f":"IF(AND(ISNUMBER($B37),$B37>0,N37<>\"\"),formatMMSSHHtime(N37),\"\")","v":""}]
["","",{"$f":"IF(AND(ISNUMBER(B38),B38>0),DATEDIF(INDEX(swimmers_data,B38,3),$C$8,\"Y\"),\"\")","v":""},{"$f":"IF(AND(ISNUMBER(B38),B38>0),INDEX(swimmers_data,B38,5),\"\")","v":""},null,null,null,null,null,null,null,null,null,null,null,null,null,null,{"$f":"IF(AND(ISNUMBER($B38),$B38>0,E38<>\"\"),INDEX(swimmers_data,$B38,5)&\",\"&INDEX(swimmers_data,$B38,1)&\",\"&INDEX(swimmers_data,$B38,2)&\",\"&INDEX(swimmers_data,$B38,4)&\",\"&TEXT(INDEX(swimmers_data,$B38,3),\"ddmmYy\")&\",\"&LEFT(\"000000\",6-LEN(E38))&E38&\",\"&S$11&\",\"&\"F\",\"\")","v":""},{"$f":"IF(AND(ISNUMBER($B38),$B38>0,F38<>\"\"),INDEX(swimmers_data,$B38,5)&\",\"&INDEX(swimmers_data,$B38,1)&\",\"&INDEX(swimmers_data,$B38,2)&\",\"&INDEX(swimmers_data,$B38,4)&\",\"&TEXT(INDEX(swimmers_data,$B38,3),\"ddmmYy\")&\",\"&LEFT(\"000000\",6-LEN(F38))&F38&\",\"&T$11&\",\"&\"F\",\"\")","v":""},{"$f":"IF(AND(ISNUMBER($B38),$B38>0,G38<>\"\"),INDEX(swimmers_data,$B38,5)&\",\"&INDEX(swimmers_data,$B38,1)&\",\"&INDEX(swimmers_data,$B38,2)&\",\"&INDEX(swimmers_data,$B38,4)&\",\"&TEXT(INDEX(swimmers_data,$B38,3),\"ddmmYy\")&\",\"&LEFT(\"000000\",6-LEN(G38))&G38&\",\"&U$11&\",\"&\"F\",\"\")","v":""},{"$f":"IF(AND(ISNUMBER($B38),$B38>0,H38<>\"\"),INDEX(swimmers_data,$B38,5)&\",\"&INDEX(swimmers_data,$B38,1)&\",\"&INDEX(swimmers_data,$B38,2)&\",\"&INDEX(swimmers_data,$B38,4)&\",\"&TEXT(INDEX(swimmers_data,$B38,3),\"ddmmYy\")&\",\"&LEFT(\"000000\",6-LEN(H38))&H38&\",\"&V$11&\",\"&\"F\",\"\")","v":""},{"$f":"IF(AND(ISNUMBER($B38),$B38>0,I38<>\"\"),INDEX(swimmers_data,$B38,5)&\",\"&INDEX(swimmers_data,$B38,1)&\",\"&INDEX(swimmers_data,$B38,2)&\",\"&INDEX(swimmers_data,$B38,4)&\",\"&TEXT(INDEX(swimmers_data,$B38,3),\"ddmmYy\")&\",\"&LEFT(\"000000\",6-LEN(I38))&I38&\",\"&W$11&\",\"&\"F\",\"\")","v":""},{"$f":"IF(AND(ISNUMBER($B38),$B38>0,J38<>\"\"),INDEX(swimmers_data,$B38,5)&\",\"&INDEX(swimmers_data,$B38,1)&\",\"&INDEX(swimmers_data,$B38,2)&\",\"&INDEX(swimmers_data,$B38,4)&\",\"&TEXT(INDEX(swimmers_data,$B38,3),\"ddmmYy\")&\",\"&LEFT(\"000000\",6-LEN(J38))&J38&\",\"&X$11&\",\"&\"F\",\"\")","v":""},{"$f":"IF(AND(ISNUMBER($B38),$B38>0,K38<>\"\"),INDEX(swimmers_data,$B38,5)&\",\"&INDEX(swimmers_data,$B38,1)&\",\"&INDEX(swimmers_data,$B38,2)&\",\"&INDEX(swimmers_data,$B38,4)&\",\"&TEXT(INDEX(swimmers_data,$B38,3),\"ddmmYy\")&\",\"&LEFT(\"000000\",6-LEN(K38))&K38&\",\"&Y$11&\",\"&\"F\",\"\")","v":""},{"$f":"IF(AND(ISNUMBER($B38),$B38>0,L38<>\"\"),INDEX(swimmers_data,$B38,5)&\",\"&INDEX(swimmers_data,$B38,1)&\",\"&INDEX(swimmers_data,$B38,2)&\",\"&INDEX(swimmers_data,$B38,4)&\",\"&TEXT(INDEX(swimmers_data,$B38,3),\"ddmmYy\")&\",\"&LEFT(\"000000\",6-LEN(L38))&L38&\",\"&Z$11&\",\"&\"F\",\"\")","v":""},{"$f":"IF(AND(ISNUMBER($B38),$B38>0,M38<>\"\"),INDEX(swimmers_data,$B38,5)&\",\"&INDEX(swimmers_data,$B38,1)&\",\"&INDEX(swimmers_data,$B38,2)&\",\"&INDEX(swimmers_data,$B38,4)&\",\"&TEXT(INDEX(swimmers_data,$B38,3),\"ddmmYy\")&\",\"&LEFT(\"000000\",6-LEN(M38))&M38&\",\"&AA$11&\",\"&\"F\",\"\")","v":""},{"$f":"IF(AND(ISNUMBER($B38),$B38>0,N38<>\"\"),INDEX(swimmers_data,$B38,5)&\",\"&INDEX(swimmers_data,$B38,1)&\",\"&INDEX(swimmers_data,$B38,2)&\",\"&INDEX(swimmers_data,$B38,4)&\",\"&TEXT(INDEX(swimmers_data,$B38,3),\"ddmmYy\")&\",\"&LEFT(\"000000\",6-LEN(N38))&N38&\",\"&AB$11&\",\"&\"F\",\"\")","v":""},null,null,"","","",{"$f":"IF(AND(ISNUMBER($B38),$B38>0,E38<>\"\"),formatMMSSHHtime(E38),\"\")","v":""},{"$f":"IF(AND(ISNUMBER($B38),$B38>0,F38<>\"\"),formatMMSSHHtime(F38),\"\")","v":""},{"$f":"IF(AND(ISNUMBER($B38),$B38>0,G38<>\"\"),formatMMSSHHtime(G38),\"\")","v":""},{"$f":"IF(AND(ISNUMBER($B38),$B38>0,H38<>\"\"),formatMMSSHHtime(H38),\"\")","v":""},{"$f":"IF(AND(ISNUMBER($B38),$B38>0,I38<>\"\"),formatMMSSHHtime(I38),\"\")","v":""},{"$f":"IF(AND(ISNUMBER($B38),$B38>0,J38<>\"\"),formatMMSSHHtime(J38),\"\")","v":""},{"$f":"IF(AND(ISNUMBER($B38),$B38>0,K38<>\"\"),formatMMSSHHtime(K38),\"\")","v":""},{"$f":"IF(AND(ISNUMBER($B38),$B38>0,L38<>\"\"),formatMMSSHHtime(L38),\"\")","v":""},{"$f":"IF(AND(ISNUMBER($B38),$B38>0,M38<>\"\"),formatMMSSHHtime(M38),\"\")","v":""},{"$f":"IF(AND(ISNUMBER($B38),$B38>0,N38<>\"\"),formatMMSSHHtime(N38),\"\")","v":""}]
["","",{"$f":"IF(AND(ISNUMBER(B39),B39>0),DATEDIF(INDEX(swimmers_data,B39,3),$C$8,\"Y\"),\"\")","v":""},{"$f":"IF(AND(ISNUMBER(B39),B39>0),INDEX(swimmers_data,B39,5),\"\")","v":""},null,null,null,null,null,null,null,null,null,null,null,null,null,null,{"$f":"IF(AND(ISNUMBER($B39),$B39>0,E39<>\"\"),INDEX(swimmers_data,$B39,5)&\",\"&INDEX(swimmers_data,$B39,1)&\",\"&INDEX(swimmers_data,$B39,2)&\",\"&INDEX(swimmers_data,$B39,4)&\",\"&TEXT(INDEX(swimmers_data,$B39,3),\"ddmmYy\")&\",\"&LEFT(\"000000\",6-LEN(E39))&E39&\",\"&S$11&\",\"&\"F\",\"\")","v":""},{"$f":"IF(AND(ISNUMBER($B39),$B39>0,F39<>\"\"),INDEX(swimmers_data,$B39,5)&\",\"&INDEX(swimmers_data,$B39,1)&\",\"&INDEX(swimmers_data,$B39,2)&\",\"&INDEX(swimmers_data,$B39,4)&\",\"&TEXT(INDEX(swimmers_data,$B39,3),\"ddmmYy\")&\",\"&LEFT(\"000000\",6-LEN(F39))&F39&\",\"&T$11&\",\"&\"F\",\"\")","v":""},{"$f":"IF(AND(ISNUMBER($B39),$B39>0,G39<>\"\"),INDEX(swimmers_data,$B39,5)&\",\"&INDEX(swimmers_data,$B39,1)&\",\"&INDEX(swimmers_data,$B39,2)&\",\"&INDEX(swimmers_data,$B39,4)&\",\"&TEXT(INDEX(swimmers_data,$B39,3),\"ddmmYy\")&\",\"&LEFT(\"000000\",6-LEN(G39))&G39&\",\"&U$11&\",\"&\"F\",\"\")","v":""},{"$f":"IF(AND(ISNUMBER($B39),$B39>0,H39<>\"\"),INDEX(swimmers_data,$B39,5)&\",\"&INDEX(swimmers_data,$B39,1)&\",\"&INDEX(swimmers_data,$B39,2)&\",\"&INDEX(swimmers_data,$B39,4)&\",\"&TEXT(INDEX(swimmers_data,$B39,3),\"ddmmYy\")&\",\"&LEFT(\"000000\",6-LEN(H39))&H39&\",\"&V$11&\",\"&\"F\",\"\")","v":""},{"$f":"IF(AND(ISNUMBER($B39),$B39>0,I39<>\"\"),INDEX(swimmers_data,$B39,5)&\",\"&INDEX(swimmers_data,$B39,1)&\",\"&INDEX(swimmers_data,$B39,2)&\",\"&INDEX(swimmers_data,$B39,4)&\",\"&TEXT(INDEX(swimmers_data,$B39,3),\"ddmmYy\")&\",\"&LEFT(\"000000\",6-LEN(I39))&I39&\",\"&W$11&\",\"&\"F\",\"\")","v":""},{"$f":"IF(AND(ISNUMBER($B39),$B39>0,J39<>\"\"),INDEX(swimmers_data,$B39,5)&\",\"&INDEX(swimmers_data,$B39,1)&\",\"&INDEX(swimmers_data,$B39,2)&\",\"&INDEX(swimmers_data,$B39,4)&\",\"&TEXT(INDEX(swimmers_data,$B39,3),\"ddmmYy\")&\",\"&LEFT(\"000000\",6-LEN(J39))&J39&\",\"&X$11&\",\"&\"F\",\"\")","v":""},{"$f":"IF(AND(ISNUMBER($B39),$B39>0,K39<>\"\"),INDEX(swimmers_data,$B39,5)&\",\"&INDEX(swimmers_data,$B39,1)&\",\"&INDEX(swimmers_data,$B39,2)&\",\"&INDEX(swimmers_data,$B39,4)&\",\"&TEXT(INDEX(swimmers_data,$B39,3),\"ddmmYy\")&\",\"&LEFT(\"000000\",6-LEN(K39))&K39&\",\"&Y$11&\",\"&\"F\",\"\")","v":""},{"$f":"IF(AND(ISNUMBER($B39),$B39>0,L39<>\"\"),INDEX(swimmers_data,$B39,5)&\",\"&INDEX(swimmers_data,$B39,1)&\",\"&INDEX(swimmers_data,$B39,2)&\",\"&INDEX(swimmers_data,$B39,4)&\",\"&TEXT(INDEX(swimmers_data,$B39,3),\"ddmmYy\")&\",\"&LEFT(\"000000\",6-LEN(L39))&L39&\",\"&Z$11&\",\"&\"F\",\"\")","v":""},{"$f":"IF(AND(ISNUMBER($B39),$B39>0,M39<>\"\"),INDEX(swimmers_data,$B39,5)&\",\"&INDEX(swimmers_data,$B39,1)&\",\"&INDEX(swimmers_data,$B39,2)&\",\"&INDEX(swimmers_data,$B39,4)&\",\"&TEXT(INDEX(swimmers_data,$B39,3),\"ddmmYy\")&\",\"&LEFT(\"000000\",6-LEN(M39))&M39&\",\"&AA$11&\",\"&\"F\",\"\")","v":""},{"$f":"IF(AND(ISNUMBER($B39),$B39>0,N39<>\"\"),INDEX(swimmers_data,$B39,5)&\",\"&INDEX(swimmers_data,$B39,1)&\",\"&INDEX(swimmers_data,$B39,2)&\",\"&INDEX(swimmers_data,$B39,4)&\",\"&TEXT(INDEX(swimmers_data,$B39,3),\"ddmmYy\")&\",\"&LEFT(\"000000\",6-LEN(N39))&N39&\",\"&AB$11&\",\"&\"F\",\"\")","v":""},null,null,"","","",{"$f":"IF(AND(ISNUMBER($B39),$B39>0,E39<>\"\"),formatMMSSHHtime(E39),\"\")","v":""},{"$f":"IF(AND(ISNUMBER($B39),$B39>0,F39<>\"\"),formatMMSSHHtime(F39),\"\")","v":""},{"$f":"IF(AND(ISNUMBER($B39),$B39>0,G39<>\"\"),formatMMSSHHtime(G39),\"\")","v":""},{"$f":"IF(AND(ISNUMBER($B39),$B39>0,H39<>\"\"),formatMMSSHHtime(H39),\"\")","v":""},{"$f":"IF(AND(ISNUMBER($B39),$B39>0,I39<>\"\"),formatMMSSHHtime(I39),\"\")","v":""},{"$f":"IF(AND(ISNUMBER($B39),$B39>0,J39<>\"\"),formatMMSSHHtime(J39),\"\")","v":""},{"$f":"IF(AND(ISNUMBER($B39),$B39>0,K39<>\"\"),formatMMSSHHtime(K39),\"\")","v":""},{"$f":"IF(AND(ISNUMBER($B39),$B39>0,L39<>\"\"),formatMMSSHHtime(L39),\"\")","v":""},{"$f":"IF(AND(ISNUMBER($B39),$B39>0,M39<>\"\"),formatMMSSHHtime(M39),\"\")","v":""},{"$f":"IF(AND(ISNUMBER($B39),$B39>0,N39<>\"\"),formatMMSSHHtime(N39),\"\")","v":""}]
["","",{"$f":"IF(AND(ISNUMBER(B40),B40>0),DATEDIF(INDEX(swimmers_data,B40,3),$C$8,\"Y\"),\"\")","v":""},{"$f":"IF(AND(ISNUMBER(B40),B40>0),INDEX(swimmers_data,B40,5),\"\")","v":""},null,null,null,null,null,null,null,null,null,null,null,null,null,null,{"$f":"IF(AND(ISNUMBER($B40),$B40>0,E40<>\"\"),INDEX(swimmers_data,$B40,5)&\",\"&INDEX(swimmers_data,$B40,1)&\",\"&INDEX(swimmers_data,$B40,2)&\",\"&INDEX(swimmers_data,$B40,4)&\",\"&TEXT(INDEX(swimmers_data,$B40,3),\"ddmmYy\")&\",\"&LEFT(\"000000\",6-LEN(E40))&E40&\",\"&S$11&\",\"&\"F\",\"\")","v":""},{"$f":"IF(AND(ISNUMBER($B40),$B40>0,F40<>\"\"),INDEX(swimmers_data,$B40,5)&\",\"&INDEX(swimmers_data,$B40,1)&\",\"&INDEX(swimmers_data,$B40,2)&\",\"&INDEX(swimmers_data,$B40,4)&\",\"&TEXT(INDEX(swimmers_data,$B40,3),\"ddmmYy\")&\",\"&LEFT(\"000000\",6-LEN(F40))&F40&\",\"&T$11&\",\"&\"F\",\"\")","v":""},{"$f":"IF(AND(ISNUMBER($B40),$B40>0,G40<>\"\"),INDEX(swimmers_data,$B40,5)&\",\"&INDEX(swimmers_data,$B40,1)&\",\"&INDEX(swimmers_data,$B40,2)&\",\"&INDEX(swimmers_data,$B40,4)&\",\"&TEXT(INDEX(swimmers_data,$B40,3),\"ddmmYy\")&\",\"&LEFT(\"000000\",6-LEN(G40))&G40&\",\"&U$11&\",\"&\"F\",\"\")","v":""},{"$f":"IF(AND(ISNUMBER($B40),$B40>0,H40<>\"\"),INDEX(swimmers_data,$B40,5)&\",\"&INDEX(swimmers_data,$B40,1)&\",\"&INDEX(swimmers_data,$B40,2)&\",\"&INDEX(swimmers_data,$B40,4)&\",\"&TEXT(INDEX(swimmers_data,$B40,3),\"ddmmYy\")&\",\"&LEFT(\"000000\",6-LEN(H40))&H40&\",\"&V$11&\",\"&\"F\",\"\")","v":""},{"$f":"IF(AND(ISNUMBER($B40),$B40>0,I40<>\"\"),INDEX(swimmers_data,$B40,5)&\",\"&INDEX(swimmers_data,$B40,1)&\",\"&INDEX(swimmers_data,$B40,2)&\",\"&INDEX(swimmers_data,$B40,4)&\",\"&TEXT(INDEX(swimmers_data,$B40,3),\"ddmmYy\")&\",\"&LEFT(\"000000\",6-LEN(I40))&I40&\",\"&W$11&\",\"&\"F\",\"\")","v":""},{"$f":"IF(AND(ISNUMBER($B40),$B40>0,J40<>\"\"),INDEX(swimmers_data,$B40,5)&\",\"&INDEX(swimmers_data,$B40,1)&\",\"&INDEX(swimmers_data,$B40,2)&\",\"&INDEX(swimmers_data,$B40,4)&\",\"&TEXT(INDEX(swimmers_data,$B40,3),\"ddmmYy\")&\",\"&LEFT(\"000000\",6-LEN(J40))&J40&\",\"&X$11&\",\"&\"F\",\"\")","v":""},{"$f":"IF(AND(ISNUMBER($B40),$B40>0,K40<>\"\"),INDEX(swimmers_data,$B40,5)&\",\"&INDEX(swimmers_data,$B40,1)&\",\"&INDEX(swimmers_data,$B40,2)&\",\"&INDEX(swimmers_data,$B40,4)&\",\"&TEXT(INDEX(swimmers_data,$B40,3),\"ddmmYy\")&\",\"&LEFT(\"000000\",6-LEN(K40))&K40&\",\"&Y$11&\",\"&\"F\",\"\")","v":""},{"$f":"IF(AND(ISNUMBER($B40),$B40>0,L40<>\"\"),INDEX(swimmers_data,$B40,5)&\",\"&INDEX(swimmers_data,$B40,1)&\",\"&INDEX(swimmers_data,$B40,2)&\",\"&INDEX(swimmers_data,$B40,4)&\",\"&TEXT(INDEX(swimmers_data,$B40,3),\"ddmmYy\")&\",\"&LEFT(\"000000\",6-LEN(L40))&L40&\",\"&Z$11&\",\"&\"F\",\"\")","v":""},{"$f":"IF(AND(ISNUMBER($B40),$B40>0,M40<>\"\"),INDEX(swimmers_data,$B40,5)&\",\"&INDEX(swimmers_data,$B40,1)&\",\"&INDEX(swimmers_data,$B40,2)&\",\"&INDEX(swimmers_data,$B40,4)&\",\"&TEXT(INDEX(swimmers_data,$B40,3),\"ddmmYy\")&\",\"&LEFT(\"000000\",6-LEN(M40))&M40&\",\"&AA$11&\",\"&\"F\",\"\")","v":""},{"$f":"IF(AND(ISNUMBER($B40),$B40>0,N40<>\"\"),INDEX(swimmers_data,$B40,5)&\",\"&INDEX(swimmers_data,$B40,1)&\",\"&INDEX(swimmers_data,$B40,2)&\",\"&INDEX(swimmers_data,$B40,4)&\",\"&TEXT(INDEX(swimmers_data,$B40,3),\"ddmmYy\")&\",\"&LEFT(\"000000\",6-LEN(N40))&N40&\",\"&AB$11&\",\"&\"F\",\"\")","v":""},null,null,"","","",{"$f":"IF(AND(ISNUMBER($B40),$B40>0,E40<>\"\"),formatMMSSHHtime(E40),\"\")","v":""},{"$f":"IF(AND(ISNUMBER($B40),$B40>0,F40<>\"\"),formatMMSSHHtime(F40),\"\")","v":""},{"$f":"IF(AND(ISNUMBER($B40),$B40>0,G40<>\"\"),formatMMSSHHtime(G40),\"\")","v":""},{"$f":"IF(AND(ISNUMBER($B40),$B40>0,H40<>\"\"),formatMMSSHHtime(H40),\"\")","v":""},{"$f":"IF(AND(ISNUMBER($B40),$B40>0,I40<>\"\"),formatMMSSHHtime(I40),\"\")","v":""},{"$f":"IF(AND(ISNUMBER($B40),$B40>0,J40<>\"\"),formatMMSSHHtime(J40),\"\")","v":""},{"$f":"IF(AND(ISNUMBER($B40),$B40>0,K40<>\"\"),formatMMSSHHtime(K40),\"\")","v":""},{"$f":"IF(AND(ISNUMBER($B40),$B40>0,L40<>\"\"),formatMMSSHHtime(L40),\"\")","v":""},{"$f":"IF(AND(ISNUMBER($B40),$B40>0,M40<>\"\"),formatMMSSHHtime(M40),\"\")","v":""},{"$f":"IF(AND(ISNUMBER($B40),$B40>0,N40<>\"\"),formatMMSSHHtime(N40),\"\")","v":""}]
["","",{"$f":"IF(AND(ISNUMBER(B41),B41>0),DATEDIF(INDEX(swimmers_data,B41,3),$C$8,\"Y\"),\"\")","v":""},{"$f":"IF(AND(ISNUMBER(B41),B41>0),INDEX(swimmers_data,B41,5),\"\")","v":""},null,null,null,null,null,null,null,null,null,null,null,null,null,null,{"$f":"IF(AND(ISNUMBER($B41),$B41>0,E41<>\"\"),INDEX(swimmers_data,$B41,5)&\",\"&INDEX(swimmers_data,$B41,1)&\",\"&INDEX(swimmers_data,$B41,2)&\",\"&INDEX(swimmers_data,$B41,4)&\",\"&TEXT(INDEX(swimmers_data,$B41,3),\"ddmmYy\")&\",\"&LEFT(\"000000\",6-LEN(E41))&E41&\",\"&S$11&\",\"&\"F\",\"\")","v":""},{"$f":"IF(AND(ISNUMBER($B41),$B41>0,F41<>\"\"),INDEX(swimmers_data,$B41,5)&\",\"&INDEX(swimmers_data,$B41,1)&\",\"&INDEX(swimmers_data,$B41,2)&\",\"&INDEX(swimmers_data,$B41,4)&\",\"&TEXT(INDEX(swimmers_data,$B41,3),\"ddmmYy\")&\",\"&LEFT(\"000000\",6-LEN(F41))&F41&\",\"&T$11&\",\"&\"F\",\"\")","v":""},{"$f":"IF(AND(ISNUMBER($B41),$B41>0,G41<>\"\"),INDEX(swimmers_data,$B41,5)&\",\"&INDEX(swimmers_data,$B41,1)&\",\"&INDEX(swimmers_data,$B41,2)&\",\"&INDEX(swimmers_data,$B41,4)&\",\"&TEXT(INDEX(swimmers_data,$B41,3),\"ddmmYy\")&\",\"&LEFT(\"000000\",6-LEN(G41))&G41&\",\"&U$11&\",\"&\"F\",\"\")","v":""},{"$f":"IF(AND(ISNUMBER($B41),$B41>0,H41<>\"\"),INDEX(swimmers_data,$B41,5)&\",\"&INDEX(swimmers_data,$B41,1)&\",\"&INDEX(swimmers_data,$B41,2)&\",\"&INDEX(swimmers_data,$B41,4)&\",\"&TEXT(INDEX(swimmers_data,$B41,3),\"ddmmYy\")&\",\"&LEFT(\"000000\",6-LEN(H41))&H41&\",\"&V$11&\",\"&\"F\",\"\")","v":""},{"$f":"IF(AND(ISNUMBER($B41),$B41>0,I41<>\"\"),INDEX(swimmers_data,$B41,5)&\",\"&INDEX(swimmers_data,$B41,1)&\",\"&INDEX(swimmers_data,$B41,2)&\",\"&INDEX(swimmers_data,$B41,4)&\",\"&TEXT(INDEX(swimmers_data,$B41,3),\"ddmmYy\")&\",\"&LEFT(\"000000\",6-LEN(I41))&I41&\",\"&W$11&\",\"&\"F\",\"\")","v":""},{"$f":"IF(AND(ISNUMBER($B41),$B41>0,J41<>\"\"),INDEX(swimmers_data,$B41,5)&\",\"&INDEX(swimmers_data,$B41,1)&\",\"&INDEX(swimmers_data,$B41,2)&\",\"&INDEX(swimmers_data,$B41,4)&\",\"&TEXT(INDEX(swimmers_data,$B41,3),\"ddmmYy\")&\",\"&LEFT(\"000000\",6-LEN(J41))&J41&\",\"&X$11&\",\"&\"F\",\"\")","v":""},{"$f":"IF(AND(ISNUMBER($B41),$B41>0,K41<>\"\"),INDEX(swimmers_data,$B41,5)&\",\"&INDEX(swimmers_data,$B41,1)&\",\"&INDEX(swimmers_data,$B41,2)&\",\"&INDEX(swimmers_data,$B41,4)&\",\"&TEXT(INDEX(swimmers_data,$B41,3),\"ddmmYy\")&\",\"&LEFT(\"000000\",6-LEN(K41))&K41&\",\"&Y$11&\",\"&\"F\",\"\")","v":""},{"$f":"IF(AND(ISNUMBER($B41),$B41>0,L41<>\"\"),INDEX(swimmers_data,$B41,5)&\",\"&INDEX(swimmers_data,$B41,1)&\",\"&INDEX(swimmers_data,$B41,2)&\",\"&INDEX(swimmers_data,$B41,4)&\",\"&TEXT(INDEX(swimmers_data,$B41,3),\"ddmmYy\")&\",\"&LEFT(\"000000\",6-LEN(L41))&L41&\",\"&Z$11&\",\"&\"F\",\"\")","v":""},{"$f":"IF(AND(ISNUMBER($B41),$B41>0,M41<>\"\"),INDEX(swimmers_data,$B41,5)&\",\"&INDEX(swimmers_data,$B41,1)&\",\"&INDEX(swimmers_data,$B41,2)&\",\"&INDEX(swimmers_data,$B41,4)&\",\"&TEXT(INDEX(swimmers_data,$B41,3),\"ddmmYy\")&\",\"&LEFT(\"000000\",6-LEN(M41))&M41&\",\"&AA$11&\",\"&\"F\",\"\")","v":""},{"$f":"IF(AND(ISNUMBER($B41),$B41>0,N41<>\"\"),INDEX(swimmers_data,$B41,5)&\",\"&INDEX(swimmers_data,$B41,1)&\",\"&INDEX(swimmers_data,$B41,2)&\",\"&INDEX(swimmers_data,$B41,4)&\",\"&TEXT(INDEX(swimmers_data,$B41,3),\"ddmmYy\")&\",\"&LEFT(\"000000\",6-LEN(N41))&N41&\",\"&AB$11&\",\"&\"F\",\"\")","v":""},null,null,"","","",{"$f":"IF(AND(ISNUMBER($B41),$B41>0,E41<>\"\"),formatMMSSHHtime(E41),\"\")","v":""},{"$f":"IF(AND(ISNUMBER($B41),$B41>0,F41<>\"\"),formatMMSSHHtime(F41),\"\")","v":""},{"$f":"IF(AND(ISNUMBER($B41),$B41>0,G41<>\"\"),formatMMSSHHtime(G41),\"\")","v":""},{"$f":"IF(AND(ISNUMBER($B41),$B41>0,H41<>\"\"),formatMMSSHHtime(H41),\"\")","v":""},{"$f":"IF(AND(ISNUMBER($B41),$B41>0,I41<>\"\"),formatMMSSHHtime(I41),\"\")","v":""},{"$f":"IF(AND(ISNUMBER($B41),$B41>0,J41<>\"\"),formatMMSSHHtime(J41),\"\")","v":""},{"$f":"IF(AND(ISNUMBER($B41),$B41>0,K41<>\"\"),formatMMSSHHtime(K41),\"\")","v":""},{"$f":"IF(AND(ISNUMBER($B41),$B41>0,L41<>\"\"),formatMMSSHHtime(L41),\"\")","v":""},{"$f":"IF(AND(ISNUMBER($B41),$B41>0,M41<>\"\"),formatMMSSHHtime(M41),\"\")","v":""},{"$f":"IF(AND(ISNUMBER($B41),$B41>0,N41<>\"\"),formatMMSSHHtime(N41),\"\")","v":""}]
["","",{"$f":"IF(AND(ISNUMBER(B42),B42>0),DATEDIF(INDEX(swimmers_data,B42,3),$C$8,\"Y\"),\"\")","v":""},{"$f":"IF(AND(ISNUMBER(B42),B42>0),INDEX(swimmers_data,B42,5),\"\")","v":""},null,null,null,null,null,null,null,null,null,null,null,null,null,null,{"$f":"IF(AND(ISNUMBER($B42),$B42>0,E42<>\"\"),INDEX(swimmers_data,$B42,5)&\",\"&INDEX(swimmers_data,$B42,1)&\",\"&INDEX(swimmers_data,$B42,2)&\",\"&INDEX(swimmers_data,$B42,4)&\",\"&TEXT(INDEX(swimmers_data,$B42,3),\"ddmmYy\")&\",\"&LEFT(\"000000\",6-LEN(E42))&E42&\",\"&S$11&\",\"&\"F\",\"\")","v":""},{"$f":"IF(AND(ISNUMBER($B42),$B42>0,F42<>\"\"),INDEX(swimmers_data,$B42,5)&\",\"&INDEX(swimmers_data,$B42,1)&\",\"&INDEX(swimmers_data,$B42,2)&\",\"&INDEX(swimmers_data,$B42,4)&\",\"&TEXT(INDEX(swimmers_data,$B42,3),\"ddmmYy\")&\",\"&LEFT(\"000000\",6-LEN(F42))&F42&\",\"&T$11&\",\"&\"F\",\"\")","v":""},{"$f":"IF(AND(ISNUMBER($B42),$B42>0,G42<>\"\"),INDEX(swimmers_data,$B42,5)&\",\"&INDEX(swimmers_data,$B42,1)&\",\"&INDEX(swimmers_data,$B42,2)&\",\"&INDEX(swimmers_data,$B42,4)&\",\"&TEXT(INDEX(swimmers_data,$B42,3),\"ddmmYy\")&\",\"&LEFT(\"000000\",6-LEN(G42))&G42&\",\"&U$11&\",\"&\"F\",\"\")","v":""},{"$f":"IF(AND(ISNUMBER($B42),$B42>0,H42<>\"\"),INDEX(swimmers_data,$B42,5)&\",\"&INDEX(swimmers_data,$B42,1)&\",\"&INDEX(swimmers_data,$B42,2)&\",\"&INDEX(swimmers_data,$B42,4)&\",\"&TEXT(INDEX(swimmers_data,$B42,3),\"ddmmYy\")&\",\"&LEFT(\"000000\",6-LEN(H42))&H42&\",\"&V$11&\",\"&\"F\",\"\")","v":""},{"$f":"IF(AND(ISNUMBER($B42),$B42>0,I42<>\"\"),INDEX(swimmers_data,$B42,5)&\",\"&INDEX(swimmers_data,$B42,1)&\",\"&INDEX(swimmers_data,$B42,2)&\",\"&INDEX(swimmers_data,$B42,4)&\",\"&TEXT(INDEX(swimmers_data,$B42,3),\"ddmmYy\")&\",\"&LEFT(\"000000\",6-LEN(I42))&I42&\",\"&W$11&\",\"&\"F\",\"\")","v":""},{"$f":"IF(AND(ISNUMBER($B42),$B42>0,J42<>\"\"),INDEX(swimmers_data,$B42,5)&\",\"&INDEX(swimmers_data,$B42,1)&\",\"&INDEX(swimmers_data,$B42,2)&\",\"&INDEX(swimmers_data,$B42,4)&\",\"&TEXT(INDEX(swimmers_data,$B42,3),\"ddmmYy\")&\",\"&LEFT(\"000000\",6-LEN(J42))&J42&\",\"&X$11&\",\"&\"F\",\"\")","v":""},{"$f":"IF(AND(ISNUMBER($B42),$B42>0,K42<>\"\"),INDEX(swimmers_data,$B42,5)&\",\"&INDEX(swimmers_data,$B42,1)&\",\"&INDEX(swimmers_data,$B42,2)&\",\"&INDEX(swimmers_data,$B42,4)&\",\"&TEXT(INDEX(swimmers_data,$B42,3),\"ddmmYy\")&\",\"&LEFT(\"000000\",6-LEN(K42))&K42&\",\"&Y$11&\",\"&\"F\",\"\")","v":""},{"$f":"IF(AND(ISNUMBER($B42),$B42>0,L42<>\"\"),INDEX(swimmers_data,$B42,5)&\",\"&INDEX(swimmers_data,$B42,1)&\",\"&INDEX(swimmers_data,$B42,2)&\",\"&INDEX(swimmers_data,$B42,4)&\",\"&TEXT(INDEX(swimmers_data,$B42,3),\"ddmmYy\")&\",\"&LEFT(\"000000\",6-LEN(L42))&L42&\",\"&Z$11&\",\"&\"F\",\"\")","v":""},{"$f":"IF(AND(ISNUMBER($B42),$B42>0,M42<>\"\"),INDEX(swimmers_data,$B42,5)&\",\"&INDEX(swimmers_data,$B42,1)&\",\"&INDEX(swimmers_data,$B42,2)&\",\"&INDEX(swimmers_data,$B42,4)&\",\"&TEXT(INDEX(swimmers_data,$B42,3),\"ddmmYy\")&\",\"&LEFT(\"000000\",6-LEN(M42))&M42&\",\"&AA$11&\",\"&\"F\",\"\")","v":""},{"$f":"IF(AND(ISNUMBER($B42),$B42>0,N42<>\"\"),INDEX(swimmers_data,$B42,5)&\",\"&INDEX(swimmers_data,$B42,1)&\",\"&INDEX(swimmers_data,$B42,2)&\",\"&INDEX(swimmers_data,$B42,4)&\",\"&TEXT(INDEX(swimmers_data,$B42,3),\"ddmmYy\")&\",\"&LEFT(\"000000\",6-LEN(N42))&N42&\",\"&AB$11&\",\"&\"F\",\"\")","v":""},null,null,"","","",{"$f":"IF(AND(ISNUMBER($B42),$B42>0,E42<>\"\"),formatMMSSHHtime(E42),\"\")","v":""},{"$f":"IF(AND(ISNUMBER($B42),$B42>0,F42<>\"\"),formatMMSSHHtime(F42),\"\")","v":""},{"$f":"IF(AND(ISNUMBER($B42),$B42>0,G42<>\"\"),formatMMSSHHtime(G42),\"\")","v":""},{"$f":"IF(AND(ISNUMBER($B42),$B42>0,H42<>\"\"),formatMMSSHHtime(H42),\"\")","v":""},{"$f":"IF(AND(ISNUMBER($B42),$B42>0,I42<>\"\"),formatMMSSHHtime(I42),\"\")","v":""},{"$f":"IF(AND(ISNUMBER($B42),$B42>0,J42<>\"\"),formatMMSSHHtime(J42),\"\")","v":""},{"$f":"IF(AND(ISNUMBER($B42),$B42>0,K42<>\"\"),formatMMSSHHtime(K42),\"\")","v":""},{"$f":"IF(AND(ISNUMBER($B42),$B42>0,L42<>\"\"),formatMMSSHHtime(L42),\"\")","v":""},{"$f":"IF(AND(ISNUMBER($B42),$B42>0,M42<>\"\"),formatMMSSHHtime(M42),\"\")","v":""},{"$f":"IF(AND(ISNUMBER($B42),$B42>0,N42<>\"\"),formatMMSSHHtime(N42),\"\")","v":""}]
["","",{"$f":"IF(AND(ISNUMBER(B43),B43>0),DATEDIF(INDEX(swimmers_data,B43,3),$C$8,\"Y\"),\"\")","v":""},{"$f":"IF(AND(ISNUMBER(B43),B43>0),INDEX(swimmers_data,B43,5),\"\")","v":""},null,null,null,null,null,null,null,null,null,null,null,null,null,null,{"$f":"IF(AND(ISNUMBER($B43),$B43>0,E43<>\"\"),INDEX(swimmers_data,$B43,5)&\",\"&INDEX(swimmers_data,$B43,1)&\",\"&INDEX(swimmers_data,$B43,2)&\",\"&INDEX(swimmers_data,$B43,4)&\",\"&TEXT(INDEX(swimmers_data,$B43,3),\"ddmmYy\")&\",\"&LEFT(\"000000\",6-LEN(E43))&E43&\",\"&S$11&\",\"&\"F\",\"\")","v":""},{"$f":"IF(AND(ISNUMBER($B43),$B43>0,F43<>\"\"),INDEX(swimmers_data,$B43,5)&\",\"&INDEX(swimmers_data,$B43,1)&\",\"&INDEX(swimmers_data,$B43,2)&\",\"&INDEX(swimmers_data,$B43,4)&\",\"&TEXT(INDEX(swimmers_data,$B43,3),\"ddmmYy\")&\",\"&LEFT(\"000000\",6-LEN(F43))&F43&\",\"&T$11&\",\"&\"F\",\"\")","v":""},{"$f":"IF(AND(ISNUMBER($B43),$B43>0,G43<>\"\"),INDEX(swimmers_data,$B43,5)&\",\"&INDEX(swimmers_data,$B43,1)&\",\"&INDEX(swimmers_data,$B43,2)&\",\"&INDEX(swimmers_data,$B43,4)&\",\"&TEXT(INDEX(swimmers_data,$B43,3),\"ddmmYy\")&\",\"&LEFT(\"000000\",6-LEN(G43))&G43&\",\"&U$11&\",\"&\"F\",\"\")","v":""},{"$f":"IF(AND(ISNUMBER($B43),$B43>0,H43<>\"\"),INDEX(swimmers_data,$B43,5)&\",\"&INDEX(swimmers_data,$B43,1)&\",\"&INDEX(swimmers_data,$B43,2)&\",\"&INDEX(swimmers_data,$B43,4)&\",\"&TEXT(INDEX(swimmers_data,$B43,3),\"ddmmYy\")&\",\"&LEFT(\"000000\",6-LEN(H43))&H43&\",\"&V$11&\",\"&\"F\",\"\")","v":""},{"$f":"IF(AND(ISNUMBER($B43),$B43>0,I43<>\"\"),INDEX(swimmers_data,$B43,5)&\",\"&INDEX(swimmers_data,$B43,1)&\",\"&INDEX(swimmers_data,$B43,2)&\",\"&INDEX(swimmers_data,$B43,4)&\",\"&TEXT(INDEX(swimmers_data,$B43,3),\"ddmmYy\")&\",\"&LEFT(\"000000\",6-LEN(I43))&I43&\",\"&W$11&\",\"&\"F\",\"\")","v":""},{"$f":"IF(AND(ISNUMBER($B43),$B43>0,J43<>\"\"),INDEX(swimmers_data,$B43,5)&\",\"&INDEX(swimmers_data,$B43,1)&\",\"&INDEX(swimmers_data,$B43,2)&\",\"&INDEX(swimmers_data,$B43,4)&\",\"&TEXT(INDEX(swimmers_data,$B43,3),\"ddmmYy\")&\",\"&LEFT(\"000000\",6-LEN(J43))&J43&\",\"&X$11&\",\"&\"F\",\"\")","v":""},{"$f":"IF(AND(ISNUMBER($B43),$B43>0,K43<>\"\"),INDEX(swimmers_data,$B43,5)&\",\"&INDEX(swimmers_data,$B43,1)&\",\"&INDEX(swimmers_data,$B43,2)&\",\"&INDEX(swimmers_data,$B43,4)&\",\"&TEXT(INDEX(swimmers_data,$B43,3),\"ddmmYy\")&\",\"&LEFT(\"000000\",6-LEN(K43))&K43&\",\"&Y$11&\",\"&\"F\",\"\")","v":""},{"$f":"IF(AND(ISNUMBER($B43),$B43>0,L43<>\"\"),INDEX(swimmers_data,$B43,5)&\",\"&INDEX(swimmers_data,$B43,1)&\",\"&INDEX(swimmers_data,$B43,2)&\",\"&INDEX(swimmers_data,$B43,4)&\",\"&TEXT(INDEX(swimmers_data,$B43,3),\"ddmmYy\")&\",\"&LEFT(\"000000\",6-LEN(L43))&L43&\",\"&Z$11&\",\"&\"F\",\"\")","v":""},{"$f":"IF(AND(ISNUMBER($B43),$B43>0,M43<>\"\"),INDEX(swimmers_data,$B43,5)&\",\"&INDEX(swimmers_data,$B43,1)&\",\"&INDEX(swimmers_data,$B43,2)&\",\"&INDEX(swimmers_data,$B43,4)&\",\"&TEXT(INDEX(swimmers_data,$B43,3),\"ddmmYy\")&\",\"&LEFT(\"000000\",6-LEN(M43))&M43&\",\"&AA$11&\",\"&\"F\",\"\")","v":""},{"$f":"IF(AND(ISNUMBER($B43),$B43>0,N43<>\"\"),INDEX(swimmers_data,$B43,5)&\",\"&INDEX(swimmers_data,$B43,1)&\",\"&INDEX(swimmers_data,$B43,2)&\",\"&INDEX(swimmers_data,$B43,4)&\",\"&TEXT(INDEX(swimmers_data,$B43,3),\"ddmmYy\")&\",\"&LEFT(\"000000\",6-LEN(N43))&N43&\",\"&AB$11&\",\"&\"F\",\"\")","v":""},null,null,"","","",{"$f":"IF(AND(ISNUMBER($B43),$B43>0,E43<>\"\"),formatMMSSHHtime(E43),\"\")","v":""},{"$f":"IF(AND(ISNUMBER($B43),$B43>0,F43<>\"\"),formatMMSSHHtime(F43),\"\")","v":""},{"$f":"IF(AND(ISNUMBER($B43),$B43>0,G43<>\"\"),formatMMSSHHtime(G43),\"\")","v":""},{"$f":"IF(AND(ISNUMBER($B43),$B43>0,H43<>\"\"),formatMMSSHHtime(H43),\"\")","v":""},{"$f":"IF(AND(ISNUMBER($B43),$B43>0,I43<>\"\"),formatMMSSHHtime(I43),\"\")","v":""},{"$f":"IF(AND(ISNUMBER($B43),$B43>0,J43<>\"\"),formatMMSSHHtime(J43),\"\")","v":""},{"$f":"IF(AND(ISNUMBER($B43),$B43>0,K43<>\"\"),formatMMSSHHtime(K43),\"\")","v":""},{"$f":"IF(AND(ISNUMBER($B43),$B43>0,L43<>\"\"),formatMMSSHHtime(L43),\"\")","v":""},{"$f":"IF(AND(ISNUMBER($B43),$B43>0,M43<>\"\"),formatMMSSHHtime(M43),\"\")","v":""},{"$f":"IF(AND(ISNUMBER($B43),$B43>0,N43<>\"\"),formatMMSSHHtime(N43),\"\")","v":""}]
["","",{"$f":"IF(AND(ISNUMBER(B44),B44>0),DATEDIF(INDEX(swimmers_data,B44,3),$C$8,\"Y\"),\"\")","v":""},{"$f":"IF(AND(ISNUMBER(B44),B44>0),INDEX(swimmers_data,B44,5),\"\")","v":""},null,null,null,null,null,null,null,null,null,null,null,null,null,null,{"$f":"IF(AND(ISNUMBER($B44),$B44>0,E44<>\"\"),INDEX(swimmers_data,$B44,5)&\",\"&INDEX(swimmers_data,$B44,1)&\",\"&INDEX(swimmers_data,$B44,2)&\",\"&INDEX(swimmers_data,$B44,4)&\",\"&TEXT(INDEX(swimmers_data,$B44,3),\"ddmmYy\")&\",\"&LEFT(\"000000\",6-LEN(E44))&E44&\",\"&S$11&\",\"&\"F\",\"\")","v":""},{"$f":"IF(AND(ISNUMBER($B44),$B44>0,F44<>\"\"),INDEX(swimmers_data,$B44,5)&\",\"&INDEX(swimmers_data,$B44,1)&\",\"&INDEX(swimmers_data,$B44,2)&\",\"&INDEX(swimmers_data,$B44,4)&\",\"&TEXT(INDEX(swimmers_data,$B44,3),\"ddmmYy\")&\",\"&LEFT(\"000000\",6-LEN(F44))&F44&\",\"&T$11&\",\"&\"F\",\"\")","v":""},{"$f":"IF(AND(ISNUMBER($B44),$B44>0,G44<>\"\"),INDEX(swimmers_data,$B44,5)&\",\"&INDEX(swimmers_data,$B44,1)&\",\"&INDEX(swimmers_data,$B44,2)&\",\"&INDEX(swimmers_data,$B44,4)&\",\"&TEXT(INDEX(swimmers_data,$B44,3),\"ddmmYy\")&\",\"&LEFT(\"000000\",6-LEN(G44))&G44&\",\"&U$11&\",\"&\"F\",\"\")","v":""},{"$f":"IF(AND(ISNUMBER($B44),$B44>0,H44<>\"\"),INDEX(swimmers_data,$B44,5)&\",\"&INDEX(swimmers_data,$B44,1)&\",\"&INDEX(swimmers_data,$B44,2)&\",\"&INDEX(swimmers_data,$B44,4)&\",\"&TEXT(INDEX(swimmers_data,$B44,3),\"ddmmYy\")&\",\"&LEFT(\"000000\",6-LEN(H44))&H44&\",\"&V$11&\",\"&\"F\",\"\")","v":""},{"$f":"IF(AND(ISNUMBER($B44),$B44>0,I44<>\"\"),INDEX(swimmers_data,$B44,5)&\",\"&INDEX(swimmers_data,$B44,1)&\",\"&INDEX(swimmers_data,$B44,2)&\",\"&INDEX(swimmers_data,$B44,4)&\",\"&TEXT(INDEX(swimmers_data,$B44,3),\"ddmmYy\")&\",\"&LEFT(\"000000\",6-LEN(I44))&I44&\",\"&W$11&\",\"&\"F\",\"\")","v":""},{"$f":"IF(AND(ISNUMBER($B44),$B44>0,J44<>\"\"),INDEX(swimmers_data,$B44,5)&\",\"&INDEX(swimmers_data,$B44,1)&\",\"&INDEX(swimmers_data,$B44,2)&\",\"&INDEX(swimmers_data,$B44,4)&\",\"&TEXT(INDEX(swimmers_data,$B44,3),\"ddmmYy\")&\",\"&LEFT(\"000000\",6-LEN(J44))&J44&\",\"&X$11&\",\"&\"F\",\"\")","v":""},{"$f":"IF(AND(ISNUMBER($B44),$B44>0,K44<>\"\"),INDEX(swimmers_data,$B44,5)&\",\"&INDEX(swimmers_data,$B44,1)&\",\"&INDEX(swimmers_data,$B44,2)&\",\"&INDEX(swimmers_data,$B44,4)&\",\"&TEXT(INDEX(swimmers_data,$B44,3),\"ddmmYy\")&\",\"&LEFT(\"000000\",6-LEN(K44))&K44&\",\"&Y$11&\",\"&\"F\",\"\")","v":""},{"$f":"IF(AND(ISNUMBER($B44),$B44>0,L44<>\"\"),INDEX(swimmers_data,$B44,5)&\",\"&INDEX(swimmers_data,$B44,1)&\",\"&INDEX(swimmers_data,$B44,2)&\",\"&INDEX(swimmers_data,$B44,4)&\",\"&TEXT(INDEX(swimmers_data,$B44,3),\"ddmmYy\")&\",\"&LEFT(\"000000\",6-LEN(L44))&L44&\",\"&Z$11&\",\"&\"F\",\"\")","v":""},{"$f":"IF(AND(ISNUMBER($B44),$B44>0,M44<>\"\"),INDEX(swimmers_data,$B44,5)&\",\"&INDEX(swimmers_data,$B44,1)&\",\"&INDEX(swimmers_data,$B44,2)&\",\"&INDEX(swimmers_data,$B44,4)&\",\"&TEXT(INDEX(swimmers_data,$B44,3),\"ddmmYy\")&\",\"&LEFT(\"000000\",6-LEN(M44))&M44&\",\"&AA$11&\",\"&\"F\",\"\")","v":""},{"$f":"IF(AND(ISNUMBER($B44),$B44>0,N44<>\"\"),INDEX(swimmers_data,$B44,5)&\",\"&INDEX(swimmers_data,$B44,1)&\",\"&INDEX(swimmers_data,$B44,2)&\",\"&INDEX(swimmers_data,$B44,4)&\",\"&TEXT(INDEX(swimmers_data,$B44,3),\"ddmmYy\")&\",\"&LEFT(\"000000\",6-LEN(N44))&N44&\",\"&AB$11&\",\"&\"F\",\"\")","v":""},null,null,"","","",{"$f":"IF(AND(ISNUMBER($B44),$B44>0,E44<>\"\"),formatMMSSHHtime(E44),\"\")","v":""},{"$f":"IF(AND(ISNUMBER($B44),$B44>0,F44<>\"\"),formatMMSSHHtime(F44),\"\")","v":""},{"$f":"IF(AND(ISNUMBER($B44),$B44>0,G44<>\"\"),formatMMSSHHtime(G44),\"\")","v":""},{"$f":"IF(AND(ISNUMBER($B44),$B44>0,H44<>\"\"),formatMMSSHHtime(H44),\"\")","v":""},{"$f":"IF(AND(ISNUMBER($B44),$B44>0,I44<>\"\"),formatMMSSHHtime(I44),\"\")","v":""},{"$f":"IF(AND(ISNUMBER($B44),$B44>0,J44<>\"\"),formatMMSSHHtime(J44),\"\")","v":""},{"$f":"IF(AND(ISNUMBER($B44),$B44>0,K44<>\"\"),formatMMSSHHtime(K44),\"\")","v":""},{"$f":"IF(AND(ISNUMBER($B44),$B44>0,L44<>\"\"),formatMMSSHHtime(L44),\"\")","v":""},{"$f":"IF(AND(ISNUMBER($B44),$B44>0,M44<>\"\"),formatMMSSHHtime(M44),\"\")","v":""},{"$f":"IF(AND(ISNUMBER($B44),$B44>0,N44<>\"\"),formatMMSSHHtime(N44),\"\")","v":""}]
["",{"$f":"IF(A45<>\"\",IFERROR(MATCH(A45,swimmers_fullname,0),0),\"\")","v":""},{"$f":"IF(AND(ISNUMBER(B45),B45>0),DATEDIF(INDEX(swimmers_data,B45,3),$C$8,\"Y\"),\"\")","v":""},{"$f":"IF(AND(ISNUMBER(B45),B45>0),INDEX(swimmers_data,B45,5),\"\")","v":""},null,null,null,null,null,null,null,null,null,null,null,null,null,null,{"$f":"IF(AND(ISNUMBER($B45),$B45>0,E45<>\"\"),INDEX(swimmers_data,$B45,5)&\",\"&INDEX(swimmers_data,$B45,1)&\",\"&INDEX(swimmers_data,$B45,2)&\",\"&INDEX(swimmers_data,$B45,4)&\",\"&TEXT(INDEX(swimmers_data,$B45,3),\"ddmmYy\")&\",\"&LEFT(\"000000\",6-LEN(E45))&E45&\",\"&S$11&\",\"&\"F\",\"\")","v":""},{"$f":"IF(AND(ISNUMBER($B45),$B45>0,F45<>\"\"),INDEX(swimmers_data,$B45,5)&\",\"&INDEX(swimmers_data,$B45,1)&\",\"&INDEX(swimmers_data,$B45,2)&\",\"&INDEX(swimmers_data,$B45,4)&\",\"&TEXT(INDEX(swimmers_data,$B45,3),\"ddmmYy\")&\",\"&LEFT(\"000000\",6-LEN(F45))&F45&\",\"&T$11&\",\"&\"F\",\"\")","v":""},{"$f":"IF(AND(ISNUMBER($B45),$B45>0,G45<>\"\"),INDEX(swimmers_data,$B45,5)&\",\"&INDEX(swimmers_data,$B45,1)&\",\"&INDEX(swimmers_data,$B45,2)&\",\"&INDEX(swimmers_data,$B45,4)&\",\"&TEXT(INDEX(swimmers_data,$B45,3),\"ddmmYy\")&\",\"&LEFT(\"000000\",6-LEN(G45))&G45&\",\"&U$11&\",\"&\"F\",\"\")","v":""},{"$f":"IF(AND(ISNUMBER($B45),$B45>0,H45<>\"\"),INDEX(swimmers_data,$B45,5)&\",\"&INDEX(swimmers_data,$B45,1)&\",\"&INDEX(swimmers_data,$B45,2)&\",\"&INDEX(swimmers_data,$B45,4)&\",\"&TEXT(INDEX(swimmers_data,$B45,3),\"ddmmYy\")&\",\"&LEFT(\"000000\",6-LEN(H45))&H45&\",\"&V$11&\",\"&\"F\",\"\")","v":""},{"$f":"IF(AND(ISNUMBER($B45),$B45>0,I45<>\"\"),INDEX(swimmers_data,$B45,5)&\",\"&INDEX(swimmers_data,$B45,1)&\",\"&INDEX(swimmers_data,$B45,2)&\",\"&INDEX(swimmers_data,$B45,4)&\",\"&TEXT(INDEX(swimmers_data,$B45,3),\"ddmmYy\")&\",\"&LEFT(\"000000\",6-LEN(I45))&I45&\",\"&W$11&\",\"&\"F\",\"\")","v":""},{"$f":"IF(AND(ISNUMBER($B45),$B45>0,J45<>\"\"),INDEX(swimmers_data,$B45,5)&\",\"&INDEX(swimmers_data,$B45,1)&\",\"&INDEX(swimmers_data,$B45,2)&\",\"&INDEX(swimmers_data,$B45,4)&\",\"&TEXT(INDEX(swimmers_data,$B45,3),\"ddmmYy\")&\",\"&LEFT(\"000000\",6-LEN(J45))&J45&\",\"&X$11&\",\"&\"F\",\"\")","v":""},{"$f":"IF(AND(ISNUMBER($B45),$B45>0,K45<>\"\"),INDEX(swimmers_data,$B45,5)&\",\"&INDEX(swimmers_data,$B45,1)&\",\"&INDEX(swimmers_data,$B45,2)&\",\"&INDEX(swimmers_data,$B45,4)&\",\"&TEXT(INDEX(swimmers_data,$B45,3),\"ddmmYy\")&\",\"&LEFT(\"000000\",6-LEN(K45))&K45&\",\"&Y$11&\",\"&\"F\",\"\")","v":""},{"$f":"IF(AND(ISNUMBER($B45),$B45>0,L45<>\"\"),INDEX(swimmers_data,$B45,5)&\",\"&INDEX(swimmers_data,$B45,1)&\",\"&INDEX(swimmers_data,$B45,2)&\",\"&INDEX(swimmers_data,$B45,4)&\",\"&TEXT(INDEX(swimmers_data,$B45,3),\"ddmmYy\")&\",\"&LEFT(\"000000\",6-LEN(L45))&L45&\",\"&Z$11&\",\"&\"F\",\"\")","v":""},{"$f":"IF(AND(ISNUMBER($B45),$B45>0,M45<>\"\"),INDEX(swimmers_data,$B45,5)&\",\"&INDEX(swimmers_data,$B45,1)&\",\"&INDEX(swimmers_data,$B45,2)&\",\"&INDEX(swimmers_data,$B45,4)&\",\"&TEXT(INDEX(swimmers_data,$B45,3),\"ddmmYy\")&\",\"&LEFT(\"000000\",6-LEN(M45))&M45&\",\"&AA$11&\",\"&\"F\",\"\")","v":""},{"$f":"IF(AND(ISNUMBER($B45),$B45>0,N45<>\"\"),INDEX(swimmers_data,$B45,5)&\",\"&INDEX(swimmers_data,$B45,1)&\",\"&INDEX(swimmers_data,$B45,2)&\",\"&INDEX(swimmers_data,$B45,4)&\",\"&TEXT(INDEX(swimmers_data,$B45,3),\"ddmmYy\")&\",\"&LEFT(\"000000\",6-LEN(N45))&N45&\",\"&AB$11&\",\"&\"F\",\"\")","v":""},null,null,"","","",{"$f":"IF(AND(ISNUMBER($B45),$B45>0,E45<>\"\"),formatMMSSHHtime(E45),\"\")","v":""},{"$f":"IF(AND(ISNUMBER($B45),$B45>0,F45<>\"\"),formatMMSSHHtime(F45),\"\")","v":""},{"$f":"IF(AND(ISNUMBER($B45),$B45>0,G45<>\"\"),formatMMSSHHtime(G45),\"\")","v":""},{"$f":"IF(AND(ISNUMBER($B45),$B45>0,H45<>\"\"),formatMMSSHHtime(H45),\"\")","v":""},{"$f":"IF(AND(ISNUMBER($B45),$B45>0,I45<>\"\"),formatMMSSHHtime(I45),\"\")","v":""},{"$f":"IF(AND(ISNUMBER($B45),$B45>0,J45<>\"\"),formatMMSSHHtime(J45),\"\")","v":""},{"$f":"IF(AND(ISNUMBER($B45),$B45>0,K45<>\"\"),formatMMSSHHtime(K45),\"\")","v":""},{"$f":"IF(AND(ISNUMBER($B45),$B45>0,L45<>\"\"),formatMMSSHHtime(L45),\"\")","v":""},{"$f":"IF(AND(ISNUMBER($B45),$B45>0,M45<>\"\"),formatMMSSHHtime(M45),\"\")","v":""},{"$f":"IF(AND(ISNUMBER($B45),$B45>0,N45<>\"\"),formatMMSSHHtime(N45),\"\")","v":""}]
["","",{"$f":"IF(AND(ISNUMBER(B46),B46>0),DATEDIF(INDEX(swimmers_data,B46,3),$C$8,\"Y\"),\"\")","v":""},{"$f":"IF(AND(ISNUMBER(B46),B46>0),INDEX(swimmers_data,B46,5),\"\")","v":""},null,null,null,null,null,null,null,null,null,null,null,null,null,null,{"$f":"IF(AND(ISNUMBER($B46),$B46>0,E46<>\"\"),INDEX(swimmers_data,$B46,5)&\",\"&INDEX(swimmers_data,$B46,1)&\",\"&INDEX(swimmers_data,$B46,2)&\",\"&INDEX(swimmers_data,$B46,4)&\",\"&TEXT(INDEX(swimmers_data,$B46,3),\"ddmmYy\")&\",\"&LEFT(\"000000\",6-LEN(E46))&E46&\",\"&S$11&\",\"&\"F\",\"\")","v":""},{"$f":"IF(AND(ISNUMBER($B46),$B46>0,F46<>\"\"),INDEX(swimmers_data,$B46,5)&\",\"&INDEX(swimmers_data,$B46,1)&\",\"&INDEX(swimmers_data,$B46,2)&\",\"&INDEX(swimmers_data,$B46,4)&\",\"&TEXT(INDEX(swimmers_data,$B46,3),\"ddmmYy\")&\",\"&LEFT(\"000000\",6-LEN(F46))&F46&\",\"&T$11&\",\"&\"F\",\"\")","v":""},{"$f":"IF(AND(ISNUMBER($B46),$B46>0,G46<>\"\"),INDEX(swimmers_data,$B46,5)&\",\"&INDEX(swimmers_data,$B46,1)&\",\"&INDEX(swimmers_data,$B46,2)&\",\"&INDEX(swimmers_data,$B46,4)&\",\"&TEXT(INDEX(swimmers_data,$B46,3),\"ddmmYy\")&\",\"&LEFT(\"000000\",6-LEN(G46))&G46&\",\"&U$11&\",\"&\"F\",\"\")","v":""},{"$f":"IF(AND(ISNUMBER($B46),$B46>0,H46<>\"\"),INDEX(swimmers_data,$B46,5)&\",\"&INDEX(swimmers_data,$B46,1)&\",\"&INDEX(swimmers_data,$B46,2)&\",\"&INDEX(swimmers_data,$B46,4)&\",\"&TEXT(INDEX(swimmers_data,$B46,3),\"ddmmYy\")&\",\"&LEFT(\"000000\",6-LEN(H46))&H46&\",\"&V$11&\",\"&\"F\",\"\")","v":""},{"$f":"IF(AND(ISNUMBER($B46),$B46>0,I46<>\"\"),INDEX(swimmers_data,$B46,5)&\",\"&INDEX(swimmers_data,$B46,1)&\",\"&INDEX(swimmers_data,$B46,2)&\",\"&INDEX(swimmers_data,$B46,4)&\",\"&TEXT(INDEX(swimmers_data,$B46,3),\"ddmmYy\")&\",\"&LEFT(\"000000\",6-LEN(I46))&I46&\",\"&W$11&\",\"&\"F\",\"\")","v":""},{"$f":"IF(AND(ISNUMBER($B46),$B46>0,J46<>\"\"),INDEX(swimmers_data,$B46,5)&\",\"&INDEX(swimmers_data,$B46,1)&\",\"&INDEX(swimmers_data,$B46,2)&\",\"&INDEX(swimmers_data,$B46,4)&\",\"&TEXT(INDEX(swimmers_data,$B46,3),\"ddmmYy\")&\",\"&LEFT(\"000000\",6-LEN(J46))&J46&\",\"&X$11&\",\"&\"F\",\"\")","v":""},{"$f":"IF(AND(ISNUMBER($B46),$B46>0,K46<>\"\"),INDEX(swimmers_data,$B46,5)&\",\"&INDEX(swimmers_data,$B46,1)&\",\"&INDEX(swimmers_data,$B46,2)&\",\"&INDEX(swimmers_data,$B46,4)&\",\"&TEXT(INDEX(swimmers_data,$B46,3),\"ddmmYy\")&\",\"&LEFT(\"000000\",6-LEN(K46))&K46&\",\"&Y$11&\",\"&\"F\",\"\")","v":""},{"$f":"IF(AND(ISNUMBER($B46),$B46>0,L46<>\"\"),INDEX(swimmers_data,$B46,5)&\",\"&INDEX(swimmers_data,$B46,1)&\",\"&INDEX(swimmers_data,$B46,2)&\",\"&INDEX(swimmers_data,$B46,4)&\",\"&TEXT(INDEX(swimmers_data,$B46,3),\"ddmmYy\")&\",\"&LEFT(\"000000\",6-LEN(L46))&L46&\",\"&Z$11&\",\"&\"F\",\"\")","v":""},{"$f":"IF(AND(ISNUMBER($B46),$B46>0,M46<>\"\"),INDEX(swimmers_data,$B46,5)&\",\"&INDEX(swimmers_data,$B46,1)&\",\"&INDEX(swimmers_data,$B46,2)&\",\"&INDEX(swimmers_data,$B46,4)&\",\"&TEXT(INDEX(swimmers_data,$B46,3),\"ddmmYy\")&\",\"&LEFT(\"000000\",6-LEN(M46))&M46&\",\"&AA$11&\",\"&\"F\",\"\")","v":""},{"$f":"IF(AND(ISNUMBER($B46),$B46>0,N46<>\"\"),INDEX(swimmers_data,$B46,5)&\",\"&INDEX(swimmers_data,$B46,1)&\",\"&INDEX(swimmers_data,$B46,2)&\",\"&INDEX(swimmers_data,$B46,4)&\",\"&TEXT(INDEX(swimmers_data,$B46,3),\"ddmmYy\")&\",\"&LEFT(\"000000\",6-LEN(N46))&N46&\",\"&AB$11&\",\"&\"F\",\"\")","v":""},null,null,"","","",{"$f":"IF(AND(ISNUMBER($B46),$B46>0,E46<>\"\"),formatMMSSHHtime(E46),\"\")","v":""},{"$f":"IF(AND(ISNUMBER($B46),$B46>0,F46<>\"\"),formatMMSSHHtime(F46),\"\")","v":""},{"$f":"IF(AND(ISNUMBER($B46),$B46>0,G46<>\"\"),formatMMSSHHtime(G46),\"\")","v":""},{"$f":"IF(AND(ISNUMBER($B46),$B46>0,H46<>\"\"),formatMMSSHHtime(H46),\"\")","v":""},{"$f":"IF(AND(ISNUMBER($B46),$B46>0,I46<>\"\"),formatMMSSHHtime(I46),\"\")","v":""},{"$f":"IF(AND(ISNUMBER($B46),$B46>0,J46<>\"\"),formatMMSSHHtime(J46),\"\")","v":""},{"$f":"IF(AND(ISNUMBER($B46),$B46>0,K46<>\"\"),formatMMSSHHtime(K46),\"\")","v":""},{"$f":"IF(AND(ISNUMBER($B46),$B46>0,L46<>\"\"),formatMMSSHHtime(L46),\"\")","v":""},{"$f":"IF(AND(ISNUMBER($B46),$B46>0,M46<>\"\"),formatMMSSHHtime(M46),\"\")","v":""},{"$f":"IF(AND(ISNUMBER($B46),$B46>0,N46<>\"\"),formatMMSSHHtime(N46),\"\")","v":""}]
["","",{"$f":"IF(AND(ISNUMBER(B47),B47>0),DATEDIF(INDEX(swimmers_data,B47,3),$C$8,\"Y\"),\"\")","v":""},{"$f":"IF(AND(ISNUMBER(B47),B47>0),INDEX(swimmers_data,B47,5),\"\")","v":""},null,null,null,null,null,null,null,null,null,null,null,null,null,null,{"$f":"IF(AND(ISNUMBER($B47),$B47>0,E47<>\"\"),INDEX(swimmers_data,$B47,5)&\",\"&INDEX(swimmers_data,$B47,1)&\",\"&INDEX(swimmers_data,$B47,2)&\",\"&INDEX(swimmers_data,$B47,4)&\",\"&TEXT(INDEX(swimmers_data,$B47,3),\"ddmmYy\")&\",\"&LEFT(\"000000\",6-LEN(E47))&E47&\",\"&S$11&\",\"&\"F\",\"\")","v":""},{"$f":"IF(AND(ISNUMBER($B47),$B47>0,F47<>\"\"),INDEX(swimmers_data,$B47,5)&\",\"&INDEX(swimmers_data,$B47,1)&\",\"&INDEX(swimmers_data,$B47,2)&\",\"&INDEX(swimmers_data,$B47,4)&\",\"&TEXT(INDEX(swimmers_data,$B47,3),\"ddmmYy\")&\",\"&LEFT(\"000000\",6-LEN(F47))&F47&\",\"&T$11&\",\"&\"F\",\"\")","v":""},{"$f":"IF(AND(ISNUMBER($B47),$B47>0,G47<>\"\"),INDEX(swimmers_data,$B47,5)&\",\"&INDEX(swimmers_data,$B47,1)&\",\"&INDEX(swimmers_data,$B47,2)&\",\"&INDEX(swimmers_data,$B47,4)&\",\"&TEXT(INDEX(swimmers_data,$B47,3),\"ddmmYy\")&\",\"&LEFT(\"000000\",6-LEN(G47))&G47&\",\"&U$11&\",\"&\"F\",\"\")","v":""},{"$f":"IF(AND(ISNUMBER($B47),$B47>0,H47<>\"\"),INDEX(swimmers_data,$B47,5)&\",\"&INDEX(swimmers_data,$B47,1)&\",\"&INDEX(swimmers_data,$B47,2)&\",\"&INDEX(swimmers_data,$B47,4)&\",\"&TEXT(INDEX(swimmers_data,$B47,3),\"ddmmYy\")&\",\"&LEFT(\"000000\",6-LEN(H47))&H47&\",\"&V$11&\",\"&\"F\",\"\")","v":""},{"$f":"IF(AND(ISNUMBER($B47),$B47>0,I47<>\"\"),INDEX(swimmers_data,$B47,5)&\",\"&INDEX(swimmers_data,$B47,1)&\",\"&INDEX(swimmers_data,$B47,2)&\",\"&INDEX(swimmers_data,$B47,4)&\",\"&TEXT(INDEX(swimmers_data,$B47,3),\"ddmmYy\")&\",\"&LEFT(\"000000\",6-LEN(I47))&I47&\",\"&W$11&\",\"&\"F\",\"\")","v":""},{"$f":"IF(AND(ISNUMBER($B47),$B47>0,J47<>\"\"),INDEX(swimmers_data,$B47,5)&\",\"&INDEX(swimmers_data,$B47,1)&\",\"&INDEX(swimmers_data,$B47,2)&\",\"&INDEX(swimmers_data,$B47,4)&\",\"&TEXT(INDEX(swimmers_data,$B47,3),\"ddmmYy\")&\",\"&LEFT(\"000000\",6-LEN(J47))&J47&\",\"&X$11&\",\"&\"F\",\"\")","v":""},{"$f":"IF(AND(ISNUMBER($B47),$B47>0,K47<>\"\"),INDEX(swimmers_data,$B47,5)&\",\"&INDEX(swimmers_data,$B47,1)&\",\"&INDEX(swimmers_data,$B47,2)&\",\"&INDEX(swimmers_data,$B47,4)&\",\"&TEXT(INDEX(swimmers_data,$B47,3),\"ddmmYy\")&\",\"&LEFT(\"000000\",6-LEN(K47))&K47&\",\"&Y$11&\",\"&\"F\",\"\")","v":""},{"$f":"IF(AND(ISNUMBER($B47),$B47>0,L47<>\"\"),INDEX(swimmers_data,$B47,5)&\",\"&INDEX(swimmers_data,$B47,1)&\",\"&INDEX(swimmers_data,$B47,2)&\",\"&INDEX(swimmers_data,$B47,4)&\",\"&TEXT(INDEX(swimmers_data,$B47,3),\"ddmmYy\")&\",\"&LEFT(\"000000\",6-LEN(L47))&L47&\",\"&Z$11&\",\"&\"F\",\"\")","v":""},{"$f":"IF(AND(ISNUMBER($B47),$B47>0,M47<>\"\"),INDEX(swimmers_data,$B47,5)&\",\"&INDEX(swimmers_data,$B47,1)&\",\"&INDEX(swimmers_data,$B47,2)&\",\"&INDEX(swimmers_data,$B47,4)&\",\"&TEXT(INDEX(swimmers_data,$B47,3),\"ddmmYy\")&\",\"&LEFT(\"000000\",6-LEN(M47))&M47&\",\"&AA$11&\",\"&\"F\",\"\")","v":""},{"$f":"IF(AND(ISNUMBER($B47),$B47>0,N47<>\"\"),INDEX(swimmers_data,$B47,5)&\",\"&INDEX(swimmers_data,$B47,1)&\",\"&INDEX(swimmers_data,$B47,2)&\",\"&INDEX(swimmers_data,$B47,4)&\",\"&TEXT(INDEX(swimmers_data,$B47,3),\"ddmmYy\")&\",\"&LEFT(\"000000\",6-LEN(N47))&N47&\",\"&AB$11&\",\"&\"F\",\"\")","v":""},null,null,"","","",{"$f":"IF(AND(ISNUMBER($B47),$B47>0,E47<>\"\"),formatMMSSHHtime(E47),\"\")","v":""},{"$f":"IF(AND(ISNUMBER($B47),$B47>0,F47<>\"\"),formatMMSSHHtime(F47),\"\")","v":""},{"$f":"IF(AND(ISNUMBER($B47),$B47>0,G47<>\"\"),formatMMSSHHtime(G47),\"\")","v":""},{"$f":"IF(AND(ISNUMBER($B47),$B47>0,H47<>\"\"),formatMMSSHHtime(H47),\"\")","v":""},{"$f":"IF(AND(ISNUMBER($B47),$B47>0,I47<>\"\"),formatMMSSHHtime(I47),\"\")","v":""},{"$f":"IF(AND(ISNUMBER($B47),$B47>0,J47<>\"\"),formatMMSSHHtime(J47),\"\")","v":""},{"$f":"IF(AND(ISNUMBER($B47),$B47>0,K47<>\"\"),formatMMSSHHtime(K47),\"\")","v":""},{"$f":"IF(AND(ISNUMBER($B47),$B47>0,L47<>\"\"),formatMMSSHHtime(L47),\"\")","v":""},{"$f":"IF(AND(ISNUMBER($B47),$B47>0,M47<>\"\"),formatMMSSHHtime(M47),\"\")","v":""},{"$f":"IF(AND(ISNUMBER($B47),$B47>0,N47<>\"\"),formatMMSSHHtime(N47),\"\")","v":""}]
["","",{"$f":"IF(AND(ISNUMBER(B48),B48>0),DATEDIF(INDEX(swimmers_data,B48,3),$C$8,\"Y\"),\"\")","v":""},{"$f":"IF(AND(ISNUMBER(B48),B48>0),INDEX(swimmers_data,B48,5),\"\")","v":""},null,null,null,null,null,null,null,null,null,null,null,null,null,null,{"$f":"IF(AND(ISNUMBER($B48),$B48>0,E48<>\"\"),INDEX(swimmers_data,$B48,5)&\",\"&INDEX(swimmers_data,$B48,1)&\",\"&INDEX(swimmers_data,$B48,2)&\",\"&INDEX(swimmers_data,$B48,4)&\",\"&TEXT(INDEX(swimmers_data,$B48,3),\"ddmmYy\")&\",\"&LEFT(\"000000\",6-LEN(E48))&E48&\",\"&S$11&\",\"&\"F\",\"\")","v":""},{"$f":"IF(AND(ISNUMBER($B48),$B48>0,F48<>\"\"),INDEX(swimmers_data,$B48,5)&\",\"&INDEX(swimmers_data,$B48,1)&\",\"&INDEX(swimmers_data,$B48,2)&\",\"&INDEX(swimmers_data,$B48,4)&\",\"&TEXT(INDEX(swimmers_data,$B48,3),\"ddmmYy\")&\",\"&LEFT(\"000000\",6-LEN(F48))&F48&\",\"&T$11&\",\"&\"F\",\"\")","v":""},{"$f":"IF(AND(ISNUMBER($B48),$B48>0,G48<>\"\"),INDEX(swimmers_data,$B48,5)&\",\"&INDEX(swimmers_data,$B48,1)&\",\"&INDEX(swimmers_data,$B48,2)&\",\"&INDEX(swimmers_data,$B48,4)&\",\"&TEXT(INDEX(swimmers_data,$B48,3),\"ddmmYy\")&\",\"&LEFT(\"000000\",6-LEN(G48))&G48&\",\"&U$11&\",\"&\"F\",\"\")","v":""},{"$f":"IF(AND(ISNUMBER($B48),$B48>0,H48<>\"\"),INDEX(swimmers_data,$B48,5)&\",\"&INDEX(swimmers_data,$B48,1)&\",\"&INDEX(swimmers_data,$B48,2)&\",\"&INDEX(swimmers_data,$B48,4)&\",\"&TEXT(INDEX(swimmers_data,$B48,3),\"ddmmYy\")&\",\"&LEFT(\"000000\",6-LEN(H48))&H48&\",\"&V$11&\",\"&\"F\",\"\")","v":""},{"$f":"IF(AND(ISNUMBER($B48),$B48>0,I48<>\"\"),INDEX(swimmers_data,$B48,5)&\",\"&INDEX(swimmers_data,$B48,1)&\",\"&INDEX(swimmers_data,$B48,2)&\",\"&INDEX(swimmers_data,$B48,4)&\",\"&TEXT(INDEX(swimmers_data,$B48,3),\"ddmmYy\")&\",\"&LEFT(\"000000\",6-LEN(I48))&I48&\",\"&W$11&\",\"&\"F\",\"\")","v":""},{"$f":"IF(AND(ISNUMBER($B48),$B48>0,J48<>\"\"),INDEX(swimmers_data,$B48,5)&\",\"&INDEX(swimmers_data,$B48,1)&\",\"&INDEX(swimmers_data,$B48,2)&\",\"&INDEX(swimmers_data,$B48,4)&\",\"&TEXT(INDEX(swimmers_data,$B48,3),\"ddmmYy\")&\",\"&LEFT(\"000000\",6-LEN(J48))&J48&\",\"&X$11&\",\"&\"F\",\"\")","v":""},{"$f":"IF(AND(ISNUMBER($B48),$B48>0,K48<>\"\"),INDEX(swimmers_data,$B48,5)&\",\"&INDEX(swimmers_data,$B48,1)&\",\"&INDEX(swimmers_data,$B48,2)&\",\"&INDEX(swimmers_data,$B48,4)&\",\"&TEXT(INDEX(swimmers_data,$B48,3),\"ddmmYy\")&\",\"&LEFT(\"000000\",6-LEN(K48))&K48&\",\"&Y$11&\",\"&\"F\",\"\")","v":""},{"$f":"IF(AND(ISNUMBER($B48),$B48>0,L48<>\"\"),INDEX(swimmers_data,$B48,5)&\",\"&INDEX(swimmers_data,$B48,1)&\",\"&INDEX(swimmers_data,$B48,2)&\",\"&INDEX(swimmers_data,$B48,4)&\",\"&TEXT(INDEX(swimmers_data,$B48,3),\"ddmmYy\")&\",\"&LEFT(\"000000\",6-LEN(L48))&L48&\",\"&Z$11&\",\"&\"F\",\"\")","v":""},{"$f":"IF(AND(ISNUMBER($B48),$B48>0,M48<>\"\"),INDEX(swimmers_data,$B48,5)&\",\"&INDEX(swimmers_data,$B48,1)&\",\"&INDEX(swimmers_data,$B48,2)&\",\"&INDEX(swimmers_data,$B48,4)&\",\"&TEXT(INDEX(swimmers_data,$B48,3),\"ddmmYy\")&\",\"&LEFT(\"000000\",6-LEN(M48))&M48&\",\"&AA$11&\",\"&\"F\",\"\")","v":""},{"$f":"IF(AND(ISNUMBER($B48),$B48>0,N48<>\"\"),INDEX(swimmers_data,$B48,5)&\",\"&INDEX(swimmers_data,$B48,1)&\",\"&INDEX(swimmers_data,$B48,2)&\",\"&INDEX(swimmers_data,$B48,4)&\",\"&TEXT(INDEX(swimmers_data,$B48,3),\"ddmmYy\")&\",\"&LEFT(\"000000\",6-LEN(N48))&N48&\",\"&AB$11&\",\"&\"F\",\"\")","v":""},null,null,"","","",{"$f":"IF(AND(ISNUMBER($B48),$B48>0,E48<>\"\"),formatMMSSHHtime(E48),\"\")","v":""},{"$f":"IF(AND(ISNUMBER($B48),$B48>0,F48<>\"\"),formatMMSSHHtime(F48),\"\")","v":""},{"$f":"IF(AND(ISNUMBER($B48),$B48>0,G48<>\"\"),formatMMSSHHtime(G48),\"\")","v":""},{"$f":"IF(AND(ISNUMBER($B48),$B48>0,H48<>\"\"),formatMMSSHHtime(H48),\"\")","v":""},{"$f":"IF(AND(ISNUMBER($B48),$B48>0,I48<>\"\"),formatMMSSHHtime(I48),\"\")","v":""},{"$f":"IF(AND(ISNUMBER($B48),$B48>0,J48<>\"\"),formatMMSSHHtime(J48),\"\")","v":""},{"$f":"IF(AND(ISNUMBER($B48),$B48>0,K48<>\"\"),formatMMSSHHtime(K48),\"\")","v":""},{"$f":"IF(AND(ISNUMBER($B48),$B48>0,L48<>\"\"),formatMMSSHHtime(L48),\"\")","v":""},{"$f":"IF(AND(ISNUMBER($B48),$B48>0,M48<>\"\"),formatMMSSHHtime(M48),\"\")","v":""},{"$f":"IF(AND(ISNUMBER($B48),$B48>0,N48<>\"\"),formatMMSSHHtime(N48),\"\")","v":""}]
["","",{"$f":"IF(AND(ISNUMBER(B49),B49>0),DATEDIF(INDEX(swimmers_data,B49,3),$C$8,\"Y\"),\"\")","v":""},{"$f":"IF(AND(ISNUMBER(B49),B49>0),INDEX(swimmers_data,B49,5),\"\")","v":""},null,null,null,null,null,null,null,null,null,null,null,null,null,null,{"$f":"IF(AND(ISNUMBER($B49),$B49>0,E49<>\"\"),INDEX(swimmers_data,$B49,5)&\",\"&INDEX(swimmers_data,$B49,1)&\",\"&INDEX(swimmers_data,$B49,2)&\",\"&INDEX(swimmers_data,$B49,4)&\",\"&TEXT(INDEX(swimmers_data,$B49,3),\"ddmmYy\")&\",\"&LEFT(\"000000\",6-LEN(E49))&E49&\",\"&S$11&\",\"&\"F\",\"\")","v":""},{"$f":"IF(AND(ISNUMBER($B49),$B49>0,F49<>\"\"),INDEX(swimmers_data,$B49,5)&\",\"&INDEX(swimmers_data,$B49,1)&\",\"&INDEX(swimmers_data,$B49,2)&\",\"&INDEX(swimmers_data,$B49,4)&\",\"&TEXT(INDEX(swimmers_data,$B49,3),\"ddmmYy\")&\",\"&LEFT(\"000000\",6-LEN(F49))&F49&\",\"&T$11&\",\"&\"F\",\"\")","v":""},{"$f":"IF(AND(ISNUMBER($B49),$B49>0,G49<>\"\"),INDEX(swimmers_data,$B49,5)&\",\"&INDEX(swimmers_data,$B49,1)&\",\"&INDEX(swimmers_data,$B49,2)&\",\"&INDEX(swimmers_data,$B49,4)&\",\"&TEXT(INDEX(swimmers_data,$B49,3),\"ddmmYy\")&\",\"&LEFT(\"000000\",6-LEN(G49))&G49&\",\"&U$11&\",\"&\"F\",\"\")","v":""},{"$f":"IF(AND(ISNUMBER($B49),$B49>0,H49<>\"\"),INDEX(swimmers_data,$B49,5)&\",\"&INDEX(swimmers_data,$B49,1)&\",\"&INDEX(swimmers_data,$B49,2)&\",\"&INDEX(swimmers_data,$B49,4)&\",\"&TEXT(INDEX(swimmers_data,$B49,3),\"ddmmYy\")&\",\"&LEFT(\"000000\",6-LEN(H49))&H49&\",\"&V$11&\",\"&\"F\",\"\")","v":""},{"$f":"IF(AND(ISNUMBER($B49),$B49>0,I49<>\"\"),INDEX(swimmers_data,$B49,5)&\",\"&INDEX(swimmers_data,$B49,1)&\",\"&INDEX(swimmers_data,$B49,2)&\",\"&INDEX(swimmers_data,$B49,4)&\",\"&TEXT(INDEX(swimmers_data,$B49,3),\"ddmmYy\")&\",\"&LEFT(\"000000\",6-LEN(I49))&I49&\",\"&W$11&\",\"&\"F\",\"\")","v":""},{"$f":"IF(AND(ISNUMBER($B49),$B49>0,J49<>\"\"),INDEX(swimmers_data,$B49,5)&\",\"&INDEX(swimmers_data,$B49,1)&\",\"&INDEX(swimmers_data,$B49,2)&\",\"&INDEX(swimmers_data,$B49,4)&\",\"&TEXT(INDEX(swimmers_data,$B49,3),\"ddmmYy\")&\",\"&LEFT(\"000000\",6-LEN(J49))&J49&\",\"&X$11&\",\"&\"F\",\"\")","v":""},{"$f":"IF(AND(ISNUMBER($B49),$B49>0,K49<>\"\"),INDEX(swimmers_data,$B49,5)&\",\"&INDEX(swimmers_data,$B49,1)&\",\"&INDEX(swimmers_data,$B49,2)&\",\"&INDEX(swimmers_data,$B49,4)&\",\"&TEXT(INDEX(swimmers_data,$B49,3),\"ddmmYy\")&\",\"&LEFT(\"000000\",6-LEN(K49))&K49&\",\"&Y$11&\",\"&\"F\",\"\")","v":""},{"$f":"IF(AND(ISNUMBER($B49),$B49>0,L49<>\"\"),INDEX(swimmers_data,$B49,5)&\",\"&INDEX(swimmers_data,$B49,1)&\",\"&INDEX(swimmers_data,$B49,2)&\",\"&INDEX(swimmers_data,$B49,4)&\",\"&TEXT(INDEX(swimmers_data,$B49,3),\"ddmmYy\")&\",\"&LEFT(\"000000\",6-LEN(L49))&L49&\",\"&Z$11&\",\"&\"F\",\"\")","v":""},{"$f":"IF(AND(ISNUMBER($B49),$B49>0,M49<>\"\"),INDEX(swimmers_data,$B49,5)&\",\"&INDEX(swimmers_data,$B49,1)&\",\"&INDEX(swimmers_data,$B49,2)&\",\"&INDEX(swimmers_data,$B49,4)&\",\"&TEXT(INDEX(swimmers_data,$B49,3),\"ddmmYy\")&\",\"&LEFT(\"000000\",6-LEN(M49))&M49&\",\"&AA$11&\",\"&\"F\",\"\")","v":""},{"$f":"IF(AND(ISNUMBER($B49),$B49>0,N49<>\"\"),INDEX(swimmers_data,$B49,5)&\",\"&INDEX(swimmers_data,$B49,1)&\",\"&INDEX(swimmers_data,$B49,2)&\",\"&INDEX(swimmers_data,$B49,4)&\",\"&TEXT(INDEX(swimmers_data,$B49,3),\"ddmmYy\")&\",\"&LEFT(\"000000\",6-LEN(N49))&N49&\",\"&AB$11&\",\"&\"F\",\"\")","v":""},null,null,"","","",{"$f":"IF(AND(ISNUMBER($B49),$B49>0,E49<>\"\"),formatMMSSHHtime(E49),\"\")","v":""},{"$f":"IF(AND(ISNUMBER($B49),$B49>0,F49<>\"\"),formatMMSSHHtime(F49),\"\")","v":""},{"$f":"IF(AND(ISNUMBER($B49),$B49>0,G49<>\"\"),formatMMSSHHtime(G49),\"\")","v":""},{"$f":"IF(AND(ISNUMBER($B49),$B49>0,H49<>\"\"),formatMMSSHHtime(H49),\"\")","v":""},{"$f":"IF(AND(ISNUMBER($B49),$B49>0,I49<>\"\"),formatMMSSHHtime(I49),\"\")","v":""},{"$f":"IF(AND(ISNUMBER($B49),$B49>0,J49<>\"\"),formatMMSSHHtime(J49),\"\")","v":""},{"$f":"IF(AND(ISNUMBER($B49),$B49>0,K49<>\"\"),formatMMSSHHtime(K49),\"\")","v":""},{"$f":"IF(AND(ISNUMBER($B49),$B49>0,L49<>\"\"),formatMMSSHHtime(L49),\"\")","v":""},{"$f":"IF(AND(ISNUMBER($B49),$B49>0,M49<>\"\"),formatMMSSHHtime(M49),\"\")","v":""},{"$f":"IF(AND(ISNUMBER($B49),$B49>0,N49<>\"\"),formatMMSSHHtime(N49),\"\")","v":""}]
["","",{"$f":"IF(AND(ISNUMBER(B50),B50>0),DATEDIF(INDEX(swimmers_data,B50,3),$C$8,\"Y\"),\"\")","v":""},{"$f":"IF(AND(ISNUMBER(B50),B50>0),INDEX(swimmers_data,B50,5),\"\")","v":""},null,null,null,null,null,null,null,null,null,null,null,null,null,null,{"$f":"IF(AND(ISNUMBER($B50),$B50>0,E50<>\"\"),INDEX(swimmers_data,$B50,5)&\",\"&INDEX(swimmers_data,$B50,1)&\",\"&INDEX(swimmers_data,$B50,2)&\",\"&INDEX(swimmers_data,$B50,4)&\",\"&TEXT(INDEX(swimmers_data,$B50,3),\"ddmmYy\")&\",\"&LEFT(\"000000\",6-LEN(E50))&E50&\",\"&S$11&\",\"&\"F\",\"\")","v":""},{"$f":"IF(AND(ISNUMBER($B50),$B50>0,F50<>\"\"),INDEX(swimmers_data,$B50,5)&\",\"&INDEX(swimmers_data,$B50,1)&\",\"&INDEX(swimmers_data,$B50,2)&\",\"&INDEX(swimmers_data,$B50,4)&\",\"&TEXT(INDEX(swimmers_data,$B50,3),\"ddmmYy\")&\",\"&LEFT(\"000000\",6-LEN(F50))&F50&\",\"&T$11&\",\"&\"F\",\"\")","v":""},{"$f":"IF(AND(ISNUMBER($B50),$B50>0,G50<>\"\"),INDEX(swimmers_data,$B50,5)&\",\"&INDEX(swimmers_data,$B50,1)&\",\"&INDEX(swimmers_data,$B50,2)&\",\"&INDEX(swimmers_data,$B50,4)&\",\"&TEXT(INDEX(swimmers_data,$B50,3),\"ddmmYy\")&\",\"&LEFT(\"000000\",6-LEN(G50))&G50&\",\"&U$11&\",\"&\"F\",\"\")","v":""},{"$f":"IF(AND(ISNUMBER($B50),$B50>0,H50<>\"\"),INDEX(swimmers_data,$B50,5)&\",\"&INDEX(swimmers_data,$B50,1)&\",\"&INDEX(swimmers_data,$B50,2)&\",\"&INDEX(swimmers_data,$B50,4)&\",\"&TEXT(INDEX(swimmers_data,$B50,3),\"ddmmYy\")&\",\"&LEFT(\"000000\",6-LEN(H50))&H50&\",\"&V$11&\",\"&\"F\",\"\")","v":""},{"$f":"IF(AND(ISNUMBER($B50),$B50>0,I50<>\"\"),INDEX(swimmers_data,$B50,5)&\",\"&INDEX(swimmers_data,$B50,1)&\",\"&INDEX(swimmers_data,$B50,2)&\",\"&INDEX(swimmers_data,$B50,4)&\",\"&TEXT(INDEX(swimmers_data,$B50,3),\"ddmmYy\")&\",\"&LEFT(\"000000\",6-LEN(I50))&I50&\",\"&W$11&\",\"&\"F\",\"\")","v":""},{"$f":"IF(AND(ISNUMBER($B50),$B50>0,J50<>\"\"),INDEX(swimmers_data,$B50,5)&\",\"&INDEX(swimmers_data,$B50,1)&\",\"&INDEX(swimmers_data,$B50,2)&\",\"&INDEX(swimmers_data,$B50,4)&\",\"&TEXT(INDEX(swimmers_data,$B50,3),\"ddmmYy\")&\",\"&LEFT(\"000000\",6-LEN(J50))&J50&\",\"&X$11&\",\"&\"F\",\"\")","v":""},{"$f":"IF(AND(ISNUMBER($B50),$B50>0,K50<>\"\"),INDEX(swimmers_data,$B50,5)&\",\"&INDEX(swimmers_data,$B50,1)&\",\"&INDEX(swimmers_data,$B50,2)&\",\"&INDEX(swimmers_data,$B50,4)&\",\"&TEXT(INDEX(swimmers_data,$B50,3),\"ddmmYy\")&\",\"&LEFT(\"000000\",6-LEN(K50))&K50&\",\"&Y$11&\",\"&\"F\",\"\")","v":""},{"$f":"IF(AND(ISNUMBER($B50),$B50>0,L50<>\"\"),INDEX(swimmers_data,$B50,5)&\",\"&INDEX(swimmers_data,$B50,1)&\",\"&INDEX(swimmers_data,$B50,2)&\",\"&INDEX(swimmers_data,$B50,4)&\",\"&TEXT(INDEX(swimmers_data,$B50,3),\"ddmmYy\")&\",\"&LEFT(\"000000\",6-LEN(L50))&L50&\",\"&Z$11&\",\"&\"F\",\"\")","v":""},{"$f":"IF(AND(ISNUMBER($B50),$B50>0,M50<>\"\"),INDEX(swimmers_data,$B50,5)&\",\"&INDEX(swimmers_data,$B50,1)&\",\"&INDEX(swimmers_data,$B50,2)&\",\"&INDEX(swimmers_data,$B50,4)&\",\"&TEXT(INDEX(swimmers_data,$B50,3),\"ddmmYy\")&\",\"&LEFT(\"000000\",6-LEN(M50))&M50&\",\"&AA$11&\",\"&\"F\",\"\")","v":""},{"$f":"IF(AND(ISNUMBER($B50),$B50>0,N50<>\"\"),INDEX(swimmers_data,$B50,5)&\",\"&INDEX(swimmers_data,$B50,1)&\",\"&INDEX(swimmers_data,$B50,2)&\",\"&INDEX(swimmers_data,$B50,4)&\",\"&TEXT(INDEX(swimmers_data,$B50,3),\"ddmmYy\")&\",\"&LEFT(\"000000\",6-LEN(N50))&N50&\",\"&AB$11&\",\"&\"F\",\"\")","v":""},null,null,"","","",{"$f":"IF(AND(ISNUMBER($B50),$B50>0,E50<>\"\"),formatMMSSHHtime(E50),\"\")","v":""},{"$f":"IF(AND(ISNUMBER($B50),$B50>0,F50<>\"\"),formatMMSSHHtime(F50),\"\")","v":""},{"$f":"IF(AND(ISNUMBER($B50),$B50>0,G50<>\"\"),formatMMSSHHtime(G50),\"\")","v":""},{"$f":"IF(AND(ISNUMBER($B50),$B50>0,H50<>\"\"),formatMMSSHHtime(H50),\"\")","v":""},{"$f":"IF(AND(ISNUMBER($B50),$B50>0,I50<>\"\"),formatMMSSHHtime(I50),\"\")","v":""},{"$f":"IF(AND(ISNUMBER($B50),$B50>0,J50<>\"\"),formatMMSSHHtime(J50),\"\")","v":""},{"$f":"IF(AND(ISNUMBER($B50),$B50>0,K50<>\"\"),formatMMSSHHtime(K50),\"\")","v":""},{"$f":"IF(AND(ISNUMBER($B50),$B50>0,L50<>\"\"),formatMMSSHHtime(L50),\"\")","v":""},{"$f":"IF(AND(ISNUMBER($B50),$B50>0,M50<>\"\"),formatMMSSHHtime(M50),\"\")","v":""},{"$f":"IF(AND(ISNUMBER($B50),$B50>0,N50<>\"\"),formatMMSSHHtime(N50),\"\")","v":""}]
["","",{"$f":"IF(AND(ISNUMBER(B51),B51>0),DATEDIF(INDEX(swimmers_data,B51,3),$C$8,\"Y\"),\"\")","v":""},{"$f":"IF(AND(ISNUMBER(B51),B51>0),INDEX(swimmers_data,B51,5),\"\")","v":""},null,null,null,null,null,null,null,null,null,null,null,null,null,null,{"$f":"IF(AND(ISNUMBER($B51),$B51>0,E51<>\"\"),INDEX(swimmers_data,$B51,5)&\",\"&INDEX(swimmers_data,$B51,1)&\",\"&INDEX(swimmers_data,$B51,2)&\",\"&INDEX(swimmers_data,$B51,4)&\",\"&TEXT(INDEX(swimmers_data,$B51,3),\"ddmmYy\")&\",\"&LEFT(\"000000\",6-LEN(E51))&E51&\",\"&S$11&\",\"&\"F\",\"\")","v":""},{"$f":"IF(AND(ISNUMBER($B51),$B51>0,F51<>\"\"),INDEX(swimmers_data,$B51,5)&\",\"&INDEX(swimmers_data,$B51,1)&\",\"&INDEX(swimmers_data,$B51,2)&\",\"&INDEX(swimmers_data,$B51,4)&\",\"&TEXT(INDEX(swimmers_data,$B51,3),\"ddmmYy\")&\",\"&LEFT(\"000000\",6-LEN(F51))&F51&\",\"&T$11&\",\"&\"F\",\"\")","v":""},{"$f":"IF(AND(ISNUMBER($B51),$B51>0,G51<>\"\"),INDEX(swimmers_data,$B51,5)&\",\"&INDEX(swimmers_data,$B51,1)&\",\"&INDEX(swimmers_data,$B51,2)&\",\"&INDEX(swimmers_data,$B51,4)&\",\"&TEXT(INDEX(swimmers_data,$B51,3),\"ddmmYy\")&\",\"&LEFT(\"000000\",6-LEN(G51))&G51&\",\"&U$11&\",\"&\"F\",\"\")","v":""},{"$f":"IF(AND(ISNUMBER($B51),$B51>0,H51<>\"\"),INDEX(swimmers_data,$B51,5)&\",\"&INDEX(swimmers_data,$B51,1)&\",\"&INDEX(swimmers_data,$B51,2)&\",\"&INDEX(swimmers_data,$B51,4)&\",\"&TEXT(INDEX(swimmers_data,$B51,3),\"ddmmYy\")&\",\"&LEFT(\"000000\",6-LEN(H51))&H51&\",\"&V$11&\",\"&\"F\",\"\")","v":""},{"$f":"IF(AND(ISNUMBER($B51),$B51>0,I51<>\"\"),INDEX(swimmers_data,$B51,5)&\",\"&INDEX(swimmers_data,$B51,1)&\",\"&INDEX(swimmers_data,$B51,2)&\",\"&INDEX(swimmers_data,$B51,4)&\",\"&TEXT(INDEX(swimmers_data,$B51,3),\"ddmmYy\")&\",\"&LEFT(\"000000\",6-LEN(I51))&I51&\",\"&W$11&\",\"&\"F\",\"\")","v":""},{"$f":"IF(AND(ISNUMBER($B51),$B51>0,J51<>\"\"),INDEX(swimmers_data,$B51,5)&\",\"&INDEX(swimmers_data,$B51,1)&\",\"&INDEX(swimmers_data,$B51,2)&\",\"&INDEX(swimmers_data,$B51,4)&\",\"&TEXT(INDEX(swimmers_data,$B51,3),\"ddmmYy\")&\",\"&LEFT(\"000000\",6-LEN(J51))&J51&\",\"&X$11&\",\"&\"F\",\"\")","v":""},{"$f":"IF(AND(ISNUMBER($B51),$B51>0,K51<>\"\"),INDEX(swimmers_data,$B51,5)&\",\"&INDEX(swimmers_data,$B51,1)&\",\"&INDEX(swimmers_data,$B51,2)&\",\"&INDEX(swimmers_data,$B51,4)&\",\"&TEXT(INDEX(swimmers_data,$B51,3),\"ddmmYy\")&\",\"&LEFT(\"000000\",6-LEN(K51))&K51&\",\"&Y$11&\",\"&\"F\",\"\")","v":""},{"$f":"IF(AND(ISNUMBER($B51),$B51>0,L51<>\"\"),INDEX(swimmers_data,$B51,5)&\",\"&INDEX(swimmers_data,$B51,1)&\",\"&INDEX(swimmers_data,$B51,2)&\",\"&INDEX(swimmers_data,$B51,4)&\",\"&TEXT(INDEX(swimmers_data,$B51,3),\"ddmmYy\")&\",\"&LEFT(\"000000\",6-LEN(L51))&L51&\",\"&Z$11&\",\"&\"F\",\"\")","v":""},{"$f":"IF(AND(ISNUMBER($B51),$B51>0,M51<>\"\"),INDEX(swimmers_data,$B51,5)&\",\"&INDEX(swimmers_data,$B51,1)&\",\"&INDEX(swimmers_data,$B51,2)&\",\"&INDEX(swimmers_data,$B51,4)&\",\"&TEXT(INDEX(swimmers_data,$B51,3),\"ddmmYy\")&\",\"&LEFT(\"000000\",6-LEN(M51))&M51&\",\"&AA$11&\",\"&\"F\",\"\")","v":""},{"$f":"IF(AND(ISNUMBER($B51),$B51>0,N51<>\"\"),INDEX(swimmers_data,$B51,5)&\",\"&INDEX(swimmers_data,$B51,1)&\",\"&INDEX(swimmers_data,$B51,2)&\",\"&INDEX(swimmers_data,$B51,4)&\",\"&TEXT(INDEX(swimmers_data,$B51,3),\"ddmmYy\")&\",\"&LEFT(\"000000\",6-LEN(N51))&N51&\",\"&AB$11&\",\"&\"F\",\"\")","v":""},null,null,"","","",{"$f":"IF(AND(ISNUMBER($B51),$B51>0,E51<>\"\"),formatMMSSHHtime(E51),\"\")","v":""},{"$f":"IF(AND(ISNUMBER($B51),$B51>0,F51<>\"\"),formatMMSSHHtime(F51),\"\")","v":""},{"$f":"IF(AND(ISNUMBER($B51),$B51>0,G51<>\"\"),formatMMSSHHtime(G51),\"\")","v":""},{"$f":"IF(AND(ISNUMBER($B51),$B51>0,H51<>\"\"),formatMMSSHHtime(H51),\"\")","v":""},{"$f":"IF(AND(ISNUMBER($B51),$B51>0,I51<>\"\"),formatMMSSHHtime(I51),\"\")","v":""},{"$f":"IF(AND(ISNUMBER($B51),$B51>0,J51<>\"\"),formatMMSSHHtime(J51),\"\")","v":""},{"$f":"IF(AND(ISNUMBER($B51),$B51>0,K51<>\"\"),formatMMSSHHtime(K51),\"\")","v":""},{"$f":"IF(AND(ISNUMBER($B51),$B51>0,L51<>\"\"),formatMMSSHHtime(L51),\"\")","v":""},{"$f":"IF(AND(ISNUMBER($B51),$B51>0,M51<>\"\"),formatMMSSHHtime(M51),\"\")","v":""},{"$f":"IF(AND(ISNUMBER($B51),$B51>0,N51<>\"\"),formatMMSSHHtime(N51),\"\")","v":""}]
["","",{"$f":"IF(AND(ISNUMBER(B52),B52>0),DATEDIF(INDEX(swimmers_data,B52,3),$C$8,\"Y\"),\"\")","v":""},{"$f":"IF(AND(ISNUMBER(B52),B52>0),INDEX(swimmers_data,B52,5),\"\")","v":""},null,null,null,null,null,null,null,null,null,null,null,null,null,null,{"$f":"IF(AND(ISNUMBER($B52),$B52>0,E52<>\"\"),INDEX(swimmers_data,$B52,5)&\",\"&INDEX(swimmers_data,$B52,1)&\",\"&INDEX(swimmers_data,$B52,2)&\",\"&INDEX(swimmers_data,$B52,4)&\",\"&TEXT(INDEX(swimmers_data,$B52,3),\"ddmmYy\")&\",\"&LEFT(\"000000\",6-LEN(E52))&E52&\",\"&S$11&\",\"&\"F\",\"\")","v":""},{"$f":"IF(AND(ISNUMBER($B52),$B52>0,F52<>\"\"),INDEX(swimmers_data,$B52,5)&\",\"&INDEX(swimmers_data,$B52,1)&\",\"&INDEX(swimmers_data,$B52,2)&\",\"&INDEX(swimmers_data,$B52,4)&\",\"&TEXT(INDEX(swimmers_data,$B52,3),\"ddmmYy\")&\",\"&LEFT(\"000000\",6-LEN(F52))&F52&\",\"&T$11&\",\"&\"F\",\"\")","v":""},{"$f":"IF(AND(ISNUMBER($B52),$B52>0,G52<>\"\"),INDEX(swimmers_data,$B52,5)&\",\"&INDEX(swimmers_data,$B52,1)&\",\"&INDEX(swimmers_data,$B52,2)&\",\"&INDEX(swimmers_data,$B52,4)&\",\"&TEXT(INDEX(swimmers_data,$B52,3),\"ddmmYy\")&\",\"&LEFT(\"000000\",6-LEN(G52))&G52&\",\"&U$11&\",\"&\"F\",\"\")","v":""},{"$f":"IF(AND(ISNUMBER($B52),$B52>0,H52<>\"\"),INDEX(swimmers_data,$B52,5)&\",\"&INDEX(swimmers_data,$B52,1)&\",\"&INDEX(swimmers_data,$B52,2)&\",\"&INDEX(swimmers_data,$B52,4)&\",\"&TEXT(INDEX(swimmers_data,$B52,3),\"ddmmYy\")&\",\"&LEFT(\"000000\",6-LEN(H52))&H52&\",\"&V$11&\",\"&\"F\",\"\")","v":""},{"$f":"IF(AND(ISNUMBER($B52),$B52>0,I52<>\"\"),INDEX(swimmers_data,$B52,5)&\",\"&INDEX(swimmers_data,$B52,1)&\",\"&INDEX(swimmers_data,$B52,2)&\",\"&INDEX(swimmers_data,$B52,4)&\",\"&TEXT(INDEX(swimmers_data,$B52,3),\"ddmmYy\")&\",\"&LEFT(\"000000\",6-LEN(I52))&I52&\",\"&W$11&\",\"&\"F\",\"\")","v":""},{"$f":"IF(AND(ISNUMBER($B52),$B52>0,J52<>\"\"),INDEX(swimmers_data,$B52,5)&\",\"&INDEX(swimmers_data,$B52,1)&\",\"&INDEX(swimmers_data,$B52,2)&\",\"&INDEX(swimmers_data,$B52,4)&\",\"&TEXT(INDEX(swimmers_data,$B52,3),\"ddmmYy\")&\",\"&LEFT(\"000000\",6-LEN(J52))&J52&\",\"&X$11&\",\"&\"F\",\"\")","v":""},{"$f":"IF(AND(ISNUMBER($B52),$B52>0,K52<>\"\"),INDEX(swimmers_data,$B52,5)&\",\"&INDEX(swimmers_data,$B52,1)&\",\"&INDEX(swimmers_data,$B52,2)&\",\"&INDEX(swimmers_data,$B52,4)&\",\"&TEXT(INDEX(swimmers_data,$B52,3),\"ddmmYy\")&\",\"&LEFT(\"000000\",6-LEN(K52))&K52&\",\"&Y$11&\",\"&\"F\",\"\")","v":""},{"$f":"IF(AND(ISNUMBER($B52),$B52>0,L52<>\"\"),INDEX(swimmers_data,$B52,5)&\",\"&INDEX(swimmers_data,$B52,1)&\",\"&INDEX(swimmers_data,$B52,2)&\",\"&INDEX(swimmers_data,$B52,4)&\",\"&TEXT(INDEX(swimmers_data,$B52,3),\"ddmmYy\")&\",\"&LEFT(\"000000\",6-LEN(L52))&L52&\",\"&Z$11&\",\"&\"F\",\"\")","v":""},{"$f":"IF(AND(ISNUMBER($B52),$B52>0,M52<>\"\"),INDEX(swimmers_data,$B52,5)&\",\"&INDEX(swimmers_data,$B52,1)&\",\"&INDEX(swimmers_data,$B52,2)&\",\"&INDEX(swimmers_data,$B52,4)&\",\"&TEXT(INDEX(swimmers_data,$B52,3),\"ddmmYy\")&\",\"&LEFT(\"000000\",6-LEN(M52))&M52&\",\"&AA$11&\",\"&\"F\",\"\")","v":""},{"$f":"IF(AND(ISNUMBER($B52),$B52>0,N52<>\"\"),INDEX(swimmers_data,$B52,5)&\",\"&INDEX(swimmers_data,$B52,1)&\",\"&INDEX(swimmers_data,$B52,2)&\",\"&INDEX(swimmers_data,$B52,4)&\",\"&TEXT(INDEX(swimmers_data,$B52,3),\"ddmmYy\")&\",\"&LEFT(\"000000\",6-LEN(N52))&N52&\",\"&AB$11&\",\"&\"F\",\"\")","v":""},null,null,"","","",{"$f":"IF(AND(ISNUMBER($B52),$B52>0,E52<>\"\"),formatMMSSHHtime(E52),\"\")","v":""},{"$f":"IF(AND(ISNUMBER($B52),$B52>0,F52<>\"\"),formatMMSSHHtime(F52),\"\")","v":""},{"$f":"IF(AND(ISNUMBER($B52),$B52>0,G52<>\"\"),formatMMSSHHtime(G52),\"\")","v":""},{"$f":"IF(AND(ISNUMBER($B52),$B52>0,H52<>\"\"),formatMMSSHHtime(H52),\"\")","v":""},{"$f":"IF(AND(ISNUMBER($B52),$B52>0,I52<>\"\"),formatMMSSHHtime(I52),\"\")","v":""},{"$f":"IF(AND(ISNUMBER($B52),$B52>0,J52<>\"\"),formatMMSSHHtime(J52),\"\")","v":""},{"$f":"IF(AND(ISNUMBER($B52),$B52>0,K52<>\"\"),formatMMSSHHtime(K52),\"\")","v":""},{"$f":"IF(AND(ISNUMBER($B52),$B52>0,L52<>\"\"),formatMMSSHHtime(L52),\"\")","v":""},{"$f":"IF(AND(ISNUMBER($B52),$B52>0,M52<>\"\"),formatMMSSHHtime(M52),\"\")","v":""},{"$f":"IF(AND(ISNUMBER($B52),$B52>0,N52<>\"\"),formatMMSSHHtime(N52),\"\")","v":""}]
["","",{"$f":"IF(AND(ISNUMBER(B53),B53>0),DATEDIF(INDEX(swimmers_data,B53,3),$C$8,\"Y\"),\"\")","v":""},{"$f":"IF(AND(ISNUMBER(B53),B53>0),INDEX(swimmers_data,B53,5),\"\")","v":""},null,null,null,null,null,null,null,null,null,null,null,null,null,null,{"$f":"IF(AND(ISNUMBER($B53),$B53>0,E53<>\"\"),INDEX(swimmers_data,$B53,5)&\",\"&INDEX(swimmers_data,$B53,1)&\",\"&INDEX(swimmers_data,$B53,2)&\",\"&INDEX(swimmers_data,$B53,4)&\",\"&TEXT(INDEX(swimmers_data,$B53,3),\"ddmmYy\")&\",\"&LEFT(\"000000\",6-LEN(E53))&E53&\",\"&S$11&\",\"&\"F\",\"\")","v":""},{"$f":"IF(AND(ISNUMBER($B53),$B53>0,F53<>\"\"),INDEX(swimmers_data,$B53,5)&\",\"&INDEX(swimmers_data,$B53,1)&\",\"&INDEX(swimmers_data,$B53,2)&\",\"&INDEX(swimmers_data,$B53,4)&\",\"&TEXT(INDEX(swimmers_data,$B53,3),\"ddmmYy\")&\",\"&LEFT(\"000000\",6-LEN(F53))&F53&\",\"&T$11&\",\"&\"F\",\"\")","v":""},{"$f":"IF(AND(ISNUMBER($B53),$B53>0,G53<>\"\"),INDEX(swimmers_data,$B53,5)&\",\"&INDEX(swimmers_data,$B53,1)&\",\"&INDEX(swimmers_data,$B53,2)&\",\"&INDEX(swimmers_data,$B53,4)&\",\"&TEXT(INDEX(swimmers_data,$B53,3),\"ddmmYy\")&\",\"&LEFT(\"000000\",6-LEN(G53))&G53&\",\"&U$11&\",\"&\"F\",\"\")","v":""},{"$f":"IF(AND(ISNUMBER($B53),$B53>0,H53<>\"\"),INDEX(swimmers_data,$B53,5)&\",\"&INDEX(swimmers_data,$B53,1)&\",\"&INDEX(swimmers_data,$B53,2)&\",\"&INDEX(swimmers_data,$B53,4)&\",\"&TEXT(INDEX(swimmers_data,$B53,3),\"ddmmYy\")&\",\"&LEFT(\"000000\",6-LEN(H53))&H53&\",\"&V$11&\",\"&\"F\",\"\")","v":""},{"$f":"IF(AND(ISNUMBER($B53),$B53>0,I53<>\"\"),INDEX(swimmers_data,$B53,5)&\",\"&INDEX(swimmers_data,$B53,1)&\",\"&INDEX(swimmers_data,$B53,2)&\",\"&INDEX(swimmers_data,$B53,4)&\",\"&TEXT(INDEX(swimmers_data,$B53,3),\"ddmmYy\")&\",\"&LEFT(\"000000\",6-LEN(I53))&I53&\",\"&W$11&\",\"&\"F\",\"\")","v":""},{"$f":"IF(AND(ISNUMBER($B53),$B53>0,J53<>\"\"),INDEX(swimmers_data,$B53,5)&\",\"&INDEX(swimmers_data,$B53,1)&\",\"&INDEX(swimmers_data,$B53,2)&\",\"&INDEX(swimmers_data,$B53,4)&\",\"&TEXT(INDEX(swimmers_data,$B53,3),\"ddmmYy\")&\",\"&LEFT(\"000000\",6-LEN(J53))&J53&\",\"&X$11&\",\"&\"F\",\"\")","v":""},{"$f":"IF(AND(ISNUMBER($B53),$B53>0,K53<>\"\"),INDEX(swimmers_data,$B53,5)&\",\"&INDEX(swimmers_data,$B53,1)&\",\"&INDEX(swimmers_data,$B53,2)&\",\"&INDEX(swimmers_data,$B53,4)&\",\"&TEXT(INDEX(swimmers_data,$B53,3),\"ddmmYy\")&\",\"&LEFT(\"000000\",6-LEN(K53))&K53&\",\"&Y$11&\",\"&\"F\",\"\")","v":""},{"$f":"IF(AND(ISNUMBER($B53),$B53>0,L53<>\"\"),INDEX(swimmers_data,$B53,5)&\",\"&INDEX(swimmers_data,$B53,1)&\",\"&INDEX(swimmers_data,$B53,2)&\",\"&INDEX(swimmers_data,$B53,4)&\",\"&TEXT(INDEX(swimmers_data,$B53,3),\"ddmmYy\")&\",\"&LEFT(\"000000\",6-LEN(L53))&L53&\",\"&Z$11&\",\"&\"F\",\"\")","v":""},{"$f":"IF(AND(ISNUMBER($B53),$B53>0,M53<>\"\"),INDEX(swimmers_data,$B53,5)&\",\"&INDEX(swimmers_data,$B53,1)&\",\"&INDEX(swimmers_data,$B53,2)&\",\"&INDEX(swimmers_data,$B53,4)&\",\"&TEXT(INDEX(swimmers_data,$B53,3),\"ddmmYy\")&\",\"&LEFT(\"000000\",6-LEN(M53))&M53&\",\"&AA$11&\",\"&\"F\",\"\")","v":""},{"$f":"IF(AND(ISNUMBER($B53),$B53>0,N53<>\"\"),INDEX(swimmers_data,$B53,5)&\",\"&INDEX(swimmers_data,$B53,1)&\",\"&INDEX(swimmers_data,$B53,2)&\",\"&INDEX(swimmers_data,$B53,4)&\",\"&TEXT(INDEX(swimmers_data,$B53,3),\"ddmmYy\")&\",\"&LEFT(\"000000\",6-LEN(N53))&N53&\",\"&AB$11&\",\"&\"F\",\"\")","v":""},null,null,"","","",{"$f":"IF(AND(ISNUMBER($B53),$B53>0,E53<>\"\"),formatMMSSHHtime(E53),\"\")","v":""},{"$f":"IF(AND(ISNUMBER($B53),$B53>0,F53<>\"\"),formatMMSSHHtime(F53),\"\")","v":""},{"$f":"IF(AND(ISNUMBER($B53),$B53>0,G53<>\"\"),formatMMSSHHtime(G53),\"\")","v":""},{"$f":"IF(AND(ISNUMBER($B53),$B53>0,H53<>\"\"),formatMMSSHHtime(H53),\"\")","v":""},{"$f":"IF(AND(ISNUMBER($B53),$B53>0,I53<>\"\"),formatMMSSHHtime(I53),\"\")","v":""},{"$f":"IF(AND(ISNUMBER($B53),$B53>0,J53<>\"\"),formatMMSSHHtime(J53),\"\")","v":""},{"$f":"IF(AND(ISNUMBER($B53),$B53>0,K53<>\"\"),formatMMSSHHtime(K53),\"\")","v":""},{"$f":"IF(AND(ISNUMBER($B53),$B53>0,L53<>\"\"),formatMMSSHHtime(L53),\"\")","v":""},{"$f":"IF(AND(ISNUMBER($B53),$B53>0,M53<>\"\"),formatMMSSHHtime(M53),\"\")","v":""},{"$f":"IF(AND(ISNUMBER($B53),$B53>0,N53<>\"\"),formatMMSSHHtime(N53),\"\")","v":""}]
["","",{"$f":"IF(AND(ISNUMBER(B54),B54>0),DATEDIF(INDEX(swimmers_data,B54,3),$C$8,\"Y\"),\"\")","v":""},{"$f":"IF(AND(ISNUMBER(B54),B54>0),INDEX(swimmers_data,B54,5),\"\")","v":""},null,null,null,null,null,null,null,null,null,null,null,null,null,null,{"$f":"IF(AND(ISNUMBER($B54),$B54>0,E54<>\"\"),INDEX(swimmers_data,$B54,5)&\",\"&INDEX(swimmers_data,$B54,1)&\",\"&INDEX(swimmers_data,$B54,2)&\",\"&INDEX(swimmers_data,$B54,4)&\",\"&TEXT(INDEX(swimmers_data,$B54,3),\"ddmmYy\")&\",\"&LEFT(\"000000\",6-LEN(E54))&E54&\",\"&S$11&\",\"&\"F\",\"\")","v":""},{"$f":"IF(AND(ISNUMBER($B54),$B54>0,F54<>\"\"),INDEX(swimmers_data,$B54,5)&\",\"&INDEX(swimmers_data,$B54,1)&\",\"&INDEX(swimmers_data,$B54,2)&\",\"&INDEX(swimmers_data,$B54,4)&\",\"&TEXT(INDEX(swimmers_data,$B54,3),\"ddmmYy\")&\",\"&LEFT(\"000000\",6-LEN(F54))&F54&\",\"&T$11&\",\"&\"F\",\"\")","v":""},{"$f":"IF(AND(ISNUMBER($B54),$B54>0,G54<>\"\"),INDEX(swimmers_data,$B54,5)&\",\"&INDEX(swimmers_data,$B54,1)&\",\"&INDEX(swimmers_data,$B54,2)&\",\"&INDEX(swimmers_data,$B54,4)&\",\"&TEXT(INDEX(swimmers_data,$B54,3),\"ddmmYy\")&\",\"&LEFT(\"000000\",6-LEN(G54))&G54&\",\"&U$11&\",\"&\"F\",\"\")","v":""},{"$f":"IF(AND(ISNUMBER($B54),$B54>0,H54<>\"\"),INDEX(swimmers_data,$B54,5)&\",\"&INDEX(swimmers_data,$B54,1)&\",\"&INDEX(swimmers_data,$B54,2)&\",\"&INDEX(swimmers_data,$B54,4)&\",\"&TEXT(INDEX(swimmers_data,$B54,3),\"ddmmYy\")&\",\"&LEFT(\"000000\",6-LEN(H54))&H54&\",\"&V$11&\",\"&\"F\",\"\")","v":""},{"$f":"IF(AND(ISNUMBER($B54),$B54>0,I54<>\"\"),INDEX(swimmers_data,$B54,5)&\",\"&INDEX(swimmers_data,$B54,1)&\",\"&INDEX(swimmers_data,$B54,2)&\",\"&INDEX(swimmers_data,$B54,4)&\",\"&TEXT(INDEX(swimmers_data,$B54,3),\"ddmmYy\")&\",\"&LEFT(\"000000\",6-LEN(I54))&I54&\",\"&W$11&\",\"&\"F\",\"\")","v":""},{"$f":"IF(AND(ISNUMBER($B54),$B54>0,J54<>\"\"),INDEX(swimmers_data,$B54,5)&\",\"&INDEX(swimmers_data,$B54,1)&\",\"&INDEX(swimmers_data,$B54,2)&\",\"&INDEX(swimmers_data,$B54,4)&\",\"&TEXT(INDEX(swimmers_data,$B54,3),\"ddmmYy\")&\",\"&LEFT(\"000000\",6-LEN(J54))&J54&\",\"&X$11&\",\"&\"F\",\"\")","v":""},{"$f":"IF(AND(ISNUMBER($B54),$B54>0,K54<>\"\"),INDEX(swimmers_data,$B54,5)&\",\"&INDEX(swimmers_data,$B54,1)&\",\"&INDEX(swimmers_data,$B54,2)&\",\"&INDEX(swimmers_data,$B54,4)&\",\"&TEXT(INDEX(swimmers_data,$B54,3),\"ddmmYy\")&\",\"&LEFT(\"000000\",6-LEN(K54))&K54&\",\"&Y$11&\",\"&\"F\",\"\")","v":""},{"$f":"IF(AND(ISNUMBER($B54),$B54>0,L54<>\"\"),INDEX(swimmers_data,$B54,5)&\",\"&INDEX(swimmers_data,$B54,1)&\",\"&INDEX(swimmers_data,$B54,2)&\",\"&INDEX(swimmers_data,$B54,4)&\",\"&TEXT(INDEX(swimmers_data,$B54,3),\"ddmmYy\")&\",\"&LEFT(\"000000\",6-LEN(L54))&L54&\",\"&Z$11&\",\"&\"F\",\"\")","v":""},{"$f":"IF(AND(ISNUMBER($B54),$B54>0,M54<>\"\"),INDEX(swimmers_data,$B54,5)&\",\"&INDEX(swimmers_data,$B54,1)&\",\"&INDEX(swimmers_data,$B54,2)&\",\"&INDEX(swimmers_data,$B54,4)&\",\"&TEXT(INDEX(swimmers_data,$B54,3),\"ddmmYy\")&\",\"&LEFT(\"000000\",6-LEN(M54))&M54&\",\"&AA$11&\",\"&\"F\",\"\")","v":""},{"$f":"IF(AND(ISNUMBER($B54),$B54>0,N54<>\"\"),INDEX(swimmers_data,$B54,5)&\",\"&INDEX(swimmers_data,$B54,1)&\",\"&INDEX(swimmers_data,$B54,2)&\",\"&INDEX(swimmers_data,$B54,4)&\",\"&TEXT(INDEX(swimmers_data,$B54,3),\"ddmmYy\")&\",\"&LEFT(\"000000\",6-LEN(N54))&N54&\",\"&AB$11&\",\"&\"F\",\"\")","v":""},null,null,"","","",{"$f":"IF(AND(ISNUMBER($B54),$B54>0,E54<>\"\"),formatMMSSHHtime(E54),\"\")","v":""},{"$f":"IF(AND(ISNUMBER($B54),$B54>0,F54<>\"\"),formatMMSSHHtime(F54),\"\")","v":""},{"$f":"IF(AND(ISNUMBER($B54),$B54>0,G54<>\"\"),formatMMSSHHtime(G54),\"\")","v":""},{"$f":"IF(AND(ISNUMBER($B54),$B54>0,H54<>\"\"),formatMMSSHHtime(H54),\"\")","v":""},{"$f":"IF(AND(ISNUMBER($B54),$B54>0,I54<>\"\"),formatMMSSHHtime(I54),\"\")","v":""},{"$f":"IF(AND(ISNUMBER($B54),$B54>0,J54<>\"\"),formatMMSSHHtime(J54),\"\")","v":""},{"$f":"IF(AND(ISNUMBER($B54),$B54>0,K54<>\"\"),formatMMSSHHtime(K54),\"\")","v":""},{"$f":"IF(AND(ISNUMBER($B54),$B54>0,L54<>\"\"),formatMMSSHHtime(L54),\"\")","v":""},{"$f":"IF(AND(ISNUMBER($B54),$B54>0,M54<>\"\"),formatMMSSHHtime(M54),\"\")","v":""},{"$f":"IF(AND(ISNUMBER($B54),$B54>0,N54<>\"\"),formatMMSSHHtime(N54),\"\")","v":""}]
["","",{"$f":"IF(AND(ISNUMBER(B55),B55>0),DATEDIF(INDEX(swimmers_data,B55,3),$C$8,\"Y\"),\"\")","v":""},{"$f":"IF(AND(ISNUMBER(B55),B55>0),INDEX(swimmers_data,B55,5),\"\")","v":""},null,null,null,null,null,null,null,null,null,null,null,null,null,null,{"$f":"IF(AND(ISNUMBER($B55),$B55>0,E55<>\"\"),INDEX(swimmers_data,$B55,5)&\",\"&INDEX(swimmers_data,$B55,1)&\",\"&INDEX(swimmers_data,$B55,2)&\",\"&INDEX(swimmers_data,$B55,4)&\",\"&TEXT(INDEX(swimmers_data,$B55,3),\"ddmmYy\")&\",\"&LEFT(\"000000\",6-LEN(E55))&E55&\",\"&S$11&\",\"&\"F\",\"\")","v":""},{"$f":"IF(AND(ISNUMBER($B55),$B55>0,F55<>\"\"),INDEX(swimmers_data,$B55,5)&\",\"&INDEX(swimmers_data,$B55,1)&\",\"&INDEX(swimmers_data,$B55,2)&\",\"&INDEX(swimmers_data,$B55,4)&\",\"&TEXT(INDEX(swimmers_data,$B55,3),\"ddmmYy\")&\",\"&LEFT(\"000000\",6-LEN(F55))&F55&\",\"&T$11&\",\"&\"F\",\"\")","v":""},{"$f":"IF(AND(ISNUMBER($B55),$B55>0,G55<>\"\"),INDEX(swimmers_data,$B55,5)&\",\"&INDEX(swimmers_data,$B55,1)&\",\"&INDEX(swimmers_data,$B55,2)&\",\"&INDEX(swimmers_data,$B55,4)&\",\"&TEXT(INDEX(swimmers_data,$B55,3),\"ddmmYy\")&\",\"&LEFT(\"000000\",6-LEN(G55))&G55&\",\"&U$11&\",\"&\"F\",\"\")","v":""},{"$f":"IF(AND(ISNUMBER($B55),$B55>0,H55<>\"\"),INDEX(swimmers_data,$B55,5)&\",\"&INDEX(swimmers_data,$B55,1)&\",\"&INDEX(swimmers_data,$B55,2)&\",\"&INDEX(swimmers_data,$B55,4)&\",\"&TEXT(INDEX(swimmers_data,$B55,3),\"ddmmYy\")&\",\"&LEFT(\"000000\",6-LEN(H55))&H55&\",\"&V$11&\",\"&\"F\",\"\")","v":""},{"$f":"IF(AND(ISNUMBER($B55),$B55>0,I55<>\"\"),INDEX(swimmers_data,$B55,5)&\",\"&INDEX(swimmers_data,$B55,1)&\",\"&INDEX(swimmers_data,$B55,2)&\",\"&INDEX(swimmers_data,$B55,4)&\",\"&TEXT(INDEX(swimmers_data,$B55,3),\"ddmmYy\")&\",\"&LEFT(\"000000\",6-LEN(I55))&I55&\",\"&W$11&\",\"&\"F\",\"\")","v":""},{"$f":"IF(AND(ISNUMBER($B55),$B55>0,J55<>\"\"),INDEX(swimmers_data,$B55,5)&\",\"&INDEX(swimmers_data,$B55,1)&\",\"&INDEX(swimmers_data,$B55,2)&\",\"&INDEX(swimmers_data,$B55,4)&\",\"&TEXT(INDEX(swimmers_data,$B55,3),\"ddmmYy\")&\",\"&LEFT(\"000000\",6-LEN(J55))&J55&\",\"&X$11&\",\"&\"F\",\"\")","v":""},{"$f":"IF(AND(ISNUMBER($B55),$B55>0,K55<>\"\"),INDEX(swimmers_data,$B55,5)&\",\"&INDEX(swimmers_data,$B55,1)&\",\"&INDEX(swimmers_data,$B55,2)&\",\"&INDEX(swimmers_data,$B55,4)&\",\"&TEXT(INDEX(swimmers_data,$B55,3),\"ddmmYy\")&\",\"&LEFT(\"000000\",6-LEN(K55))&K55&\",\"&Y$11&\",\"&\"F\",\"\")","v":""},{"$f":"IF(AND(ISNUMBER($B55),$B55>0,L55<>\"\"),INDEX(swimmers_data,$B55,5)&\",\"&INDEX(swimmers_data,$B55,1)&\",\"&INDEX(swimmers_data,$B55,2)&\",\"&INDEX(swimmers_data,$B55,4)&\",\"&TEXT(INDEX(swimmers_data,$B55,3),\"ddmmYy\")&\",\"&LEFT(\"000000\",6-LEN(L55))&L55&\",\"&Z$11&\",\"&\"F\",\"\")","v":""},{"$f":"IF(AND(ISNUMBER($B55),$B55>0,M55<>\"\"),INDEX(swimmers_data,$B55,5)&\",\"&INDEX(swimmers_data,$B55,1)&\",\"&INDEX(swimmers_data,$B55,2)&\",\"&INDEX(swimmers_data,$B55,4)&\",\"&TEXT(INDEX(swimmers_data,$B55,3),\"ddmmYy\")&\",\"&LEFT(\"000000\",6-LEN(M55))&M55&\",\"&AA$11&\",\"&\"F\",\"\")","v":""},{"$f":"IF(AND(ISNUMBER($B55),$B55>0,N55<>\"\"),INDEX(swimmers_data,$B55,5)&\",\"&INDEX(swimmers_data,$B55,1)&\",\"&INDEX(swimmers_data,$B55,2)&\",\"&INDEX(swimmers_data,$B55,4)&\",\"&TEXT(INDEX(swimmers_data,$B55,3),\"ddmmYy\")&\",\"&LEFT(\"000000\",6-LEN(N55))&N55&\",\"&AB$11&\",\"&\"F\",\"\")","v":""},null,null,"","","",{"$f":"IF(AND(ISNUMBER($B55),$B55>0,E55<>\"\"),formatMMSSHHtime(E55),\"\")","v":""},{"$f":"IF(AND(ISNUMBER($B55),$B55>0,F55<>\"\"),formatMMSSHHtime(F55),\"\")","v":""},{"$f":"IF(AND(ISNUMBER($B55),$B55>0,G55<>\"\"),formatMMSSHHtime(G55),\"\")","v":""},{"$f":"IF(AND(ISNUMBER($B55),$B55>0,H55<>\"\"),formatMMSSHHtime(H55),\"\")","v":""},{"$f":"IF(AND(ISNUMBER($B55),$B55>0,I55<>\"\"),formatMMSSHHtime(I55),\"\")","v":""},{"$f":"IF(AND(ISNUMBER($B55),$B55>0,J55<>\"\"),formatMMSSHHtime(J55),\"\")","v":""},{"$f":"IF(AND(ISNUMBER($B55),$B55>0,K55<>\"\"),formatMMSSHHtime(K55),\"\")","v":""},{"$f":"IF(AND(ISNUMBER($B55),$B55>0,L55<>\"\"),formatMMSSHHtime(L55),\"\")","v":""},{"$f":"IF(AND(ISNUMBER($B55),$B55>0,M55<>\"\"),formatMMSSHHtime(M55),\"\")","v":""},{"$f":"IF(AND(ISNUMBER($B55),$B55>0,N55<>\"\"),formatMMSSHHtime(N55),\"\")","v":""}]
["","",{"$f":"IF(AND(ISNUMBER(B56),B56>0),DATEDIF(INDEX(swimmers_data,B56,3),$C$8,\"Y\"),\"\")","v":""},{"$f":"IF(AND(ISNUMBER(B56),B56>0),INDEX(swimmers_data,B56,5),\"\")","v":""},null,null,null,null,null,null,null,null,null,null,null,null,null,null,{"$f":"IF(AND(ISNUMBER($B56),$B56>0,E56<>\"\"),INDEX(swimmers_data,$B56,5)&\",\"&INDEX(swimmers_data,$B56,1)&\",\"&INDEX(swimmers_data,$B56,2)&\",\"&INDEX(swimmers_data,$B56,4)&\",\"&TEXT(INDEX(swimmers_data,$B56,3),\"ddmmYy\")&\",\"&LEFT(\"000000\",6-LEN(E56))&E56&\",\"&S$11&\",\"&\"F\",\"\")","v":""},{"$f":"IF(AND(ISNUMBER($B56),$B56>0,F56<>\"\"),INDEX(swimmers_data,$B56,5)&\",\"&INDEX(swimmers_data,$B56,1)&\",\"&INDEX(swimmers_data,$B56,2)&\",\"&INDEX(swimmers_data,$B56,4)&\",\"&TEXT(INDEX(swimmers_data,$B56,3),\"ddmmYy\")&\",\"&LEFT(\"000000\",6-LEN(F56))&F56&\",\"&T$11&\",\"&\"F\",\"\")","v":""},{"$f":"IF(AND(ISNUMBER($B56),$B56>0,G56<>\"\"),INDEX(swimmers_data,$B56,5)&\",\"&INDEX(swimmers_data,$B56,1)&\",\"&INDEX(swimmers_data,$B56,2)&\",\"&INDEX(swimmers_data,$B56,4)&\",\"&TEXT(INDEX(swimmers_data,$B56,3),\"ddmmYy\")&\",\"&LEFT(\"000000\",6-LEN(G56))&G56&\",\"&U$11&\",\"&\"F\",\"\")","v":""},{"$f":"IF(AND(ISNUMBER($B56),$B56>0,H56<>\"\"),INDEX(swimmers_data,$B56,5)&\",\"&INDEX(swimmers_data,$B56,1)&\",\"&INDEX(swimmers_data,$B56,2)&\",\"&INDEX(swimmers_data,$B56,4)&\",\"&TEXT(INDEX(swimmers_data,$B56,3),\"ddmmYy\")&\",\"&LEFT(\"000000\",6-LEN(H56))&H56&\",\"&V$11&\",\"&\"F\",\"\")","v":""},{"$f":"IF(AND(ISNUMBER($B56),$B56>0,I56<>\"\"),INDEX(swimmers_data,$B56,5)&\",\"&INDEX(swimmers_data,$B56,1)&\",\"&INDEX(swimmers_data,$B56,2)&\",\"&INDEX(swimmers_data,$B56,4)&\",\"&TEXT(INDEX(swimmers_data,$B56,3),\"ddmmYy\")&\",\"&LEFT(\"000000\",6-LEN(I56))&I56&\",\"&W$11&\",\"&\"F\",\"\")","v":""},{"$f":"IF(AND(ISNUMBER($B56),$B56>0,J56<>\"\"),INDEX(swimmers_data,$B56,5)&\",\"&INDEX(swimmers_data,$B56,1)&\",\"&INDEX(swimmers_data,$B56,2)&\",\"&INDEX(swimmers_data,$B56,4)&\",\"&TEXT(INDEX(swimmers_data,$B56,3),\"ddmmYy\")&\",\"&LEFT(\"000000\",6-LEN(J56))&J56&\",\"&X$11&\",\"&\"F\",\"\")","v":""},{"$f":"IF(AND(ISNUMBER($B56),$B56>0,K56<>\"\"),INDEX(swimmers_data,$B56,5)&\",\"&INDEX(swimmers_data,$B56,1)&\",\"&INDEX(swimmers_data,$B56,2)&\",\"&INDEX(swimmers_data,$B56,4)&\",\"&TEXT(INDEX(swimmers_data,$B56,3),\"ddmmYy\")&\",\"&LEFT(\"000000\",6-LEN(K56))&K56&\",\"&Y$11&\",\"&\"F\",\"\")","v":""},{"$f":"IF(AND(ISNUMBER($B56),$B56>0,L56<>\"\"),INDEX(swimmers_data,$B56,5)&\",\"&INDEX(swimmers_data,$B56,1)&\",\"&INDEX(swimmers_data,$B56,2)&\",\"&INDEX(swimmers_data,$B56,4)&\",\"&TEXT(INDEX(swimmers_data,$B56,3),\"ddmmYy\")&\",\"&LEFT(\"000000\",6-LEN(L56))&L56&\",\"&Z$11&\",\"&\"F\",\"\")","v":""},{"$f":"IF(AND(ISNUMBER($B56),$B56>0,M56<>\"\"),INDEX(swimmers_data,$B56,5)&\",\"&INDEX(swimmers_data,$B56,1)&\",\"&INDEX(swimmers_data,$B56,2)&\",\"&INDEX(swimmers_data,$B56,4)&\",\"&TEXT(INDEX(swimmers_data,$B56,3),\"ddmmYy\")&\",\"&LEFT(\"000000\",6-LEN(M56))&M56&\",\"&AA$11&\",\"&\"F\",\"\")","v":""},{"$f":"IF(AND(ISNUMBER($B56),$B56>0,N56<>\"\"),INDEX(swimmers_data,$B56,5)&\",\"&INDEX(swimmers_data,$B56,1)&\",\"&INDEX(swimmers_data,$B56,2)&\",\"&INDEX(swimmers_data,$B56,4)&\",\"&TEXT(INDEX(swimmers_data,$B56,3),\"ddmmYy\")&\",\"&LEFT(\"000000\",6-LEN(N56))&N56&\",\"&AB$11&\",\"&\"F\",\"\")","v":""},null,null,"","","",{"$f":"IF(AND(ISNUMBER($B56),$B56>0,E56<>\"\"),formatMMSSHHtime(E56),\"\")","v":""},{"$f":"IF(AND(ISNUMBER($B56),$B56>0,F56<>\"\"),formatMMSSHHtime(F56),\"\")","v":""},{"$f":"IF(AND(ISNUMBER($B56),$B56>0,G56<>\"\"),formatMMSSHHtime(G56),\"\")","v":""},{"$f":"IF(AND(ISNUMBER($B56),$B56>0,H56<>\"\"),formatMMSSHHtime(H56),\"\")","v":""},{"$f":"IF(AND(ISNUMBER($B56),$B56>0,I56<>\"\"),formatMMSSHHtime(I56),\"\")","v":""},{"$f":"IF(AND(ISNUMBER($B56),$B56>0,J56<>\"\"),formatMMSSHHtime(J56),\"\")","v":""},{"$f":"IF(AND(ISNUMBER($B56),$B56>0,K56<>\"\"),formatMMSSHHtime(K56),\"\")","v":""},{"$f":"IF(AND(ISNUMBER($B56),$B56>0,L56<>\"\"),formatMMSSHHtime(L56),\"\")","v":""},{"$f":"IF(AND(ISNUMBER($B56),$B56>0,M56<>\"\"),formatMMSSHHtime(M56),\"\")","v":""},{"$f":"IF(AND(ISNUMBER($B56),$B56>0,N56<>\"\"),formatMMSSHHtime(N56),\"\")","v":""}]
["","",{"$f":"IF(AND(ISNUMBER(B57),B57>0),DATEDIF(INDEX(swimmers_data,B57,3),$C$8,\"Y\"),\"\")","v":""},{"$f":"IF(AND(ISNUMBER(B57),B57>0),INDEX(swimmers_data,B57,5),\"\")","v":""},null,null,null,null,null,null,null,null,null,null,null,null,null,null,{"$f":"IF(AND(ISNUMBER($B57),$B57>0,E57<>\"\"),INDEX(swimmers_data,$B57,5)&\",\"&INDEX(swimmers_data,$B57,1)&\",\"&INDEX(swimmers_data,$B57,2)&\",\"&INDEX(swimmers_data,$B57,4)&\",\"&TEXT(INDEX(swimmers_data,$B57,3),\"ddmmYy\")&\",\"&LEFT(\"000000\",6-LEN(E57))&E57&\",\"&S$11&\",\"&\"F\",\"\")","v":""},{"$f":"IF(AND(ISNUMBER($B57),$B57>0,F57<>\"\"),INDEX(swimmers_data,$B57,5)&\",\"&INDEX(swimmers_data,$B57,1)&\",\"&INDEX(swimmers_data,$B57,2)&\",\"&INDEX(swimmers_data,$B57,4)&\",\"&TEXT(INDEX(swimmers_data,$B57,3),\"ddmmYy\")&\",\"&LEFT(\"000000\",6-LEN(F57))&F57&\",\"&T$11&\",\"&\"F\",\"\")","v":""},{"$f":"IF(AND(ISNUMBER($B57),$B57>0,G57<>\"\"),INDEX(swimmers_data,$B57,5)&\",\"&INDEX(swimmers_data,$B57,1)&\",\"&INDEX(swimmers_data,$B57,2)&\",\"&INDEX(swimmers_data,$B57,4)&\",\"&TEXT(INDEX(swimmers_data,$B57,3),\"ddmmYy\")&\",\"&LEFT(\"000000\",6-LEN(G57))&G57&\",\"&U$11&\",\"&\"F\",\"\")","v":""},{"$f":"IF(AND(ISNUMBER($B57),$B57>0,H57<>\"\"),INDEX(swimmers_data,$B57,5)&\",\"&INDEX(swimmers_data,$B57,1)&\",\"&INDEX(swimmers_data,$B57,2)&\",\"&INDEX(swimmers_data,$B57,4)&\",\"&TEXT(INDEX(swimmers_data,$B57,3),\"ddmmYy\")&\",\"&LEFT(\"000000\",6-LEN(H57))&H57&\",\"&V$11&\",\"&\"F\",\"\")","v":""},{"$f":"IF(AND(ISNUMBER($B57),$B57>0,I57<>\"\"),INDEX(swimmers_data,$B57,5)&\",\"&INDEX(swimmers_data,$B57,1)&\",\"&INDEX(swimmers_data,$B57,2)&\",\"&INDEX(swimmers_data,$B57,4)&\",\"&TEXT(INDEX(swimmers_data,$B57,3),\"ddmmYy\")&\",\"&LEFT(\"000000\",6-LEN(I57))&I57&\",\"&W$11&\",\"&\"F\",\"\")","v":""},{"$f":"IF(AND(ISNUMBER($B57),$B57>0,J57<>\"\"),INDEX(swimmers_data,$B57,5)&\",\"&INDEX(swimmers_data,$B57,1)&\",\"&INDEX(swimmers_data,$B57,2)&\",\"&INDEX(swimmers_data,$B57,4)&\",\"&TEXT(INDEX(swimmers_data,$B57,3),\"ddmmYy\")&\",\"&LEFT(\"000000\",6-LEN(J57))&J57&\",\"&X$11&\",\"&\"F\",\"\")","v":""},{"$f":"IF(AND(ISNUMBER($B57),$B57>0,K57<>\"\"),INDEX(swimmers_data,$B57,5)&\",\"&INDEX(swimmers_data,$B57,1)&\",\"&INDEX(swimmers_data,$B57,2)&\",\"&INDEX(swimmers_data,$B57,4)&\",\"&TEXT(INDEX(swimmers_data,$B57,3),\"ddmmYy\")&\",\"&LEFT(\"000000\",6-LEN(K57))&K57&\",\"&Y$11&\",\"&\"F\",\"\")","v":""},{"$f":"IF(AND(ISNUMBER($B57),$B57>0,L57<>\"\"),INDEX(swimmers_data,$B57,5)&\",\"&INDEX(swimmers_data,$B57,1)&\",\"&INDEX(swimmers_data,$B57,2)&\",\"&INDEX(swimmers_data,$B57,4)&\",\"&TEXT(INDEX(swimmers_data,$B57,3),\"ddmmYy\")&\",\"&LEFT(\"000000\",6-LEN(L57))&L57&\",\"&Z$11&\",\"&\"F\",\"\")","v":""},{"$f":"IF(AND(ISNUMBER($B57),$B57>0,M57<>\"\"),INDEX(swimmers_data,$B57,5)&\",\"&INDEX(swimmers_data,$B57,1)&\",\"&INDEX(swimmers_data,$B57,2)&\",\"&INDEX(swimmers_data,$B57,4)&\",\"&TEXT(INDEX(swimmers_data,$B57,3),\"ddmmYy\")&\",\"&LEFT(\"000000\",6-LEN(M57))&M57&\",\"&AA$11&\",\"&\"F\",\"\")","v":""},{"$f":"IF(AND(ISNUMBER($B57),$B57>0,N57<>\"\"),INDEX(swimmers_data,$B57,5)&\",\"&INDEX(swimmers_data,$B57,1)&\",\"&INDEX(swimmers_data,$B57,2)&\",\"&INDEX(swimmers_data,$B57,4)&\",\"&TEXT(INDEX(swimmers_data,$B57,3),\"ddmmYy\")&\",\"&LEFT(\"000000\",6-LEN(N57))&N57&\",\"&AB$11&\",\"&\"F\",\"\")","v":""},null,null,"","","",{"$f":"IF(AND(ISNUMBER($B57),$B57>0,E57<>\"\"),formatMMSSHHtime(E57),\"\")","v":""},{"$f":"IF(AND(ISNUMBER($B57),$B57>0,F57<>\"\"),formatMMSSHHtime(F57),\"\")","v":""},{"$f":"IF(AND(ISNUMBER($B57),$B57>0,G57<>\"\"),formatMMSSHHtime(G57),\"\")","v":""},{"$f":"IF(AND(ISNUMBER($B57),$B57>0,H57<>\"\"),formatMMSSHHtime(H57),\"\")","v":""},{"$f":"IF(AND(ISNUMBER($B57),$B57>0,I57<>\"\"),formatMMSSHHtime(I57),\"\")","v":""},{"$f":"IF(AND(ISNUMBER($B57),$B57>0,J57<>\"\"),formatMMSSHHtime(J57),\"\")","v":""},{"$f":"IF(AND(ISNUMBER($B57),$B57>0,K57<>\"\"),formatMMSSHHtime(K57),\"\")","v":""},{"$f":"IF(AND(ISNUMBER($B57),$B57>0,L57<>\"\"),formatMMSSHHtime(L57),\"\")","v":""},{"$f":"IF(AND(ISNUMBER($B57),$B57>0,M57<>\"\"),formatMMSSHHtime(M57),\"\")","v":""},{"$f":"IF(AND(ISNUMBER($B57),$B57>0,N57<>\"\"),formatMMSSHHtime(N57),\"\")","v":""}]
["","",{"$f":"IF(AND(ISNUMBER(B58),B58>0),DATEDIF(INDEX(swimmers_data,B58,3),$C$8,\"Y\"),\"\")","v":""},{"$f":"IF(AND(ISNUMBER(B58),B58>0),INDEX(swimmers_data,B58,5),\"\")","v":""},null,null,null,null,null,null,null,null,null,null,null,null,null,null,{"$f":"IF(AND(ISNUMBER($B58),$B58>0,E58<>\"\"),INDEX(swimmers_data,$B58,5)&\",\"&INDEX(swimmers_data,$B58,1)&\",\"&INDEX(swimmers_data,$B58,2)&\",\"&INDEX(swimmers_data,$B58,4)&\",\"&TEXT(INDEX(swimmers_data,$B58,3),\"ddmmYy\")&\",\"&LEFT(\"000000\",6-LEN(E58))&E58&\",\"&S$11&\",\"&\"F\",\"\")","v":""},{"$f":"IF(AND(ISNUMBER($B58),$B58>0,F58<>\"\"),INDEX(swimmers_data,$B58,5)&\",\"&INDEX(swimmers_data,$B58,1)&\",\"&INDEX(swimmers_data,$B58,2)&\",\"&INDEX(swimmers_data,$B58,4)&\",\"&TEXT(INDEX(swimmers_data,$B58,3),\"ddmmYy\")&\",\"&LEFT(\"000000\",6-LEN(F58))&F58&\",\"&T$11&\",\"&\"F\",\"\")","v":""},{"$f":"IF(AND(ISNUMBER($B58),$B58>0,G58<>\"\"),INDEX(swimmers_data,$B58,5)&\",\"&INDEX(swimmers_data,$B58,1)&\",\"&INDEX(swimmers_data,$B58,2)&\",\"&INDEX(swimmers_data,$B58,4)&\",\"&TEXT(INDEX(swimmers_data,$B58,3),\"ddmmYy\")&\",\"&LEFT(\"000000\",6-LEN(G58))&G58&\",\"&U$11&\",\"&\"F\",\"\")","v":""},{"$f":"IF(AND(ISNUMBER($B58),$B58>0,H58<>\"\"),INDEX(swimmers_data,$B58,5)&\",\"&INDEX(swimmers_data,$B58,1)&\",\"&INDEX(swimmers_data,$B58,2)&\",\"&INDEX(swimmers_data,$B58,4)&\",\"&TEXT(INDEX(swimmers_data,$B58,3),\"ddmmYy\")&\",\"&LEFT(\"000000\",6-LEN(H58))&H58&\",\"&V$11&\",\"&\"F\",\"\")","v":""},{"$f":"IF(AND(ISNUMBER($B58),$B58>0,I58<>\"\"),INDEX(swimmers_data,$B58,5)&\",\"&INDEX(swimmers_data,$B58,1)&\",\"&INDEX(swimmers_data,$B58,2)&\",\"&INDEX(swimmers_data,$B58,4)&\",\"&TEXT(INDEX(swimmers_data,$B58,3),\"ddmmYy\")&\",\"&LEFT(\"000000\",6-LEN(I58))&I58&\",\"&W$11&\",\"&\"F\",\"\")","v":""},{"$f":"IF(AND(ISNUMBER($B58),$B58>0,J58<>\"\"),INDEX(swimmers_data,$B58,5)&\",\"&INDEX(swimmers_data,$B58,1)&\",\"&INDEX(swimmers_data,$B58,2)&\",\"&INDEX(swimmers_data,$B58,4)&\",\"&TEXT(INDEX(swimmers_data,$B58,3),\"ddmmYy\")&\",\"&LEFT(\"000000\",6-LEN(J58))&J58&\",\"&X$11&\",\"&\"F\",\"\")","v":""},{"$f":"IF(AND(ISNUMBER($B58),$B58>0,K58<>\"\"),INDEX(swimmers_data,$B58,5)&\",\"&INDEX(swimmers_data,$B58,1)&\",\"&INDEX(swimmers_data,$B58,2)&\",\"&INDEX(swimmers_data,$B58,4)&\",\"&TEXT(INDEX(swimmers_data,$B58,3),\"ddmmYy\")&\",\"&LEFT(\"000000\",6-LEN(K58))&K58&\",\"&Y$11&\",\"&\"F\",\"\")","v":""},{"$f":"IF(AND(ISNUMBER($B58),$B58>0,L58<>\"\"),INDEX(swimmers_data,$B58,5)&\",\"&INDEX(swimmers_data,$B58,1)&\",\"&INDEX(swimmers_data,$B58,2)&\",\"&INDEX(swimmers_data,$B58,4)&\",\"&TEXT(INDEX(swimmers_data,$B58,3),\"ddmmYy\")&\",\"&LEFT(\"000000\",6-LEN(L58))&L58&\",\"&Z$11&\",\"&\"F\",\"\")","v":""},{"$f":"IF(AND(ISNUMBER($B58),$B58>0,M58<>\"\"),INDEX(swimmers_data,$B58,5)&\",\"&INDEX(swimmers_data,$B58,1)&\",\"&INDEX(swimmers_data,$B58,2)&\",\"&INDEX(swimmers_data,$B58,4)&\",\"&TEXT(INDEX(swimmers_data,$B58,3),\"ddmmYy\")&\",\"&LEFT(\"000000\",6-LEN(M58))&M58&\",\"&AA$11&\",\"&\"F\",\"\")","v":""},{"$f":"IF(AND(ISNUMBER($B58),$B58>0,N58<>\"\"),INDEX(swimmers_data,$B58,5)&\",\"&INDEX(swimmers_data,$B58,1)&\",\"&INDEX(swimmers_data,$B58,2)&\",\"&INDEX(swimmers_data,$B58,4)&\",\"&TEXT(INDEX(swimmers_data,$B58,3),\"ddmmYy\")&\",\"&LEFT(\"000000\",6-LEN(N58))&N58&\",\"&AB$11&\",\"&\"F\",\"\")","v":""},null,null,"","","",{"$f":"IF(AND(ISNUMBER($B58),$B58>0,E58<>\"\"),formatMMSSHHtime(E58),\"\")","v":""},{"$f":"IF(AND(ISNUMBER($B58),$B58>0,F58<>\"\"),formatMMSSHHtime(F58),\"\")","v":""},{"$f":"IF(AND(ISNUMBER($B58),$B58>0,G58<>\"\"),formatMMSSHHtime(G58),\"\")","v":""},{"$f":"IF(AND(ISNUMBER($B58),$B58>0,H58<>\"\"),formatMMSSHHtime(H58),\"\")","v":""},{"$f":"IF(AND(ISNUMBER($B58),$B58>0,I58<>\"\"),formatMMSSHHtime(I58),\"\")","v":""},{"$f":"IF(AND(ISNUMBER($B58),$B58>0,J58<>\"\"),formatMMSSHHtime(J58),\"\")","v":""},{"$f":"IF(AND(ISNUMBER($B58),$B58>0,K58<>\"\"),formatMMSSHHtime(K58),\"\")","v":""},{"$f":"IF(AND(ISNUMBER($B58),$B58>0,L58<>\"\"),formatMMSSHHtime(L58),\"\")","v":""},{"$f":"IF(AND(ISNUMBER($B58),$B58>0,M58<>\"\"),formatMMSSHHtime(M58),\"\")","v":""},{"$f":"IF(AND(ISNUMBER($B58),$B58>0,N58<>\"\"),formatMMSSHHtime(N58),\"\")","v":""}]
["","",{"$f":"IF(AND(ISNUMBER(B59),B59>0),DATEDIF(INDEX(swimmers_data,B59,3),$C$8,\"Y\"),\"\")","v":""},{"$f":"IF(AND(ISNUMBER(B59),B59>0),INDEX(swimmers_data,B59,5),\"\")","v":""},null,null,null,null,null,null,null,null,null,null,null,null,null,null,{"$f":"IF(AND(ISNUMBER($B59),$B59>0,E59<>\"\"),INDEX(swimmers_data,$B59,5)&\",\"&INDEX(swimmers_data,$B59,1)&\",\"&INDEX(swimmers_data,$B59,2)&\",\"&INDEX(swimmers_data,$B59,4)&\",\"&TEXT(INDEX(swimmers_data,$B59,3),\"ddmmYy\")&\",\"&LEFT(\"000000\",6-LEN(E59))&E59&\",\"&S$11&\",\"&\"F\",\"\")","v":""},{"$f":"IF(AND(ISNUMBER($B59),$B59>0,F59<>\"\"),INDEX(swimmers_data,$B59,5)&\",\"&INDEX(swimmers_data,$B59,1)&\",\"&INDEX(swimmers_data,$B59,2)&\",\"&INDEX(swimmers_data,$B59,4)&\",\"&TEXT(INDEX(swimmers_data,$B59,3),\"ddmmYy\")&\",\"&LEFT(\"000000\",6-LEN(F59))&F59&\",\"&T$11&\",\"&\"F\",\"\")","v":""},{"$f":"IF(AND(ISNUMBER($B59),$B59>0,G59<>\"\"),INDEX(swimmers_data,$B59,5)&\",\"&INDEX(swimmers_data,$B59,1)&\",\"&INDEX(swimmers_data,$B59,2)&\",\"&INDEX(swimmers_data,$B59,4)&\",\"&TEXT(INDEX(swimmers_data,$B59,3),\"ddmmYy\")&\",\"&LEFT(\"000000\",6-LEN(G59))&G59&\",\"&U$11&\",\"&\"F\",\"\")","v":""},{"$f":"IF(AND(ISNUMBER($B59),$B59>0,H59<>\"\"),INDEX(swimmers_data,$B59,5)&\",\"&INDEX(swimmers_data,$B59,1)&\",\"&INDEX(swimmers_data,$B59,2)&\",\"&INDEX(swimmers_data,$B59,4)&\",\"&TEXT(INDEX(swimmers_data,$B59,3),\"ddmmYy\")&\",\"&LEFT(\"000000\",6-LEN(H59))&H59&\",\"&V$11&\",\"&\"F\",\"\")","v":""},{"$f":"IF(AND(ISNUMBER($B59),$B59>0,I59<>\"\"),INDEX(swimmers_data,$B59,5)&\",\"&INDEX(swimmers_data,$B59,1)&\",\"&INDEX(swimmers_data,$B59,2)&\",\"&INDEX(swimmers_data,$B59,4)&\",\"&TEXT(INDEX(swimmers_data,$B59,3),\"ddmmYy\")&\",\"&LEFT(\"000000\",6-LEN(I59))&I59&\",\"&W$11&\",\"&\"F\",\"\")","v":""},{"$f":"IF(AND(ISNUMBER($B59),$B59>0,J59<>\"\"),INDEX(swimmers_data,$B59,5)&\",\"&INDEX(swimmers_data,$B59,1)&\",\"&INDEX(swimmers_data,$B59,2)&\",\"&INDEX(swimmers_data,$B59,4)&\",\"&TEXT(INDEX(swimmers_data,$B59,3),\"ddmmYy\")&\",\"&LEFT(\"000000\",6-LEN(J59))&J59&\",\"&X$11&\",\"&\"F\",\"\")","v":""},{"$f":"IF(AND(ISNUMBER($B59),$B59>0,K59<>\"\"),INDEX(swimmers_data,$B59,5)&\",\"&INDEX(swimmers_data,$B59,1)&\",\"&INDEX(swimmers_data,$B59,2)&\",\"&INDEX(swimmers_data,$B59,4)&\",\"&TEXT(INDEX(swimmers_data,$B59,3),\"ddmmYy\")&\",\"&LEFT(\"000000\",6-LEN(K59))&K59&\",\"&Y$11&\",\"&\"F\",\"\")","v":""},{"$f":"IF(AND(ISNUMBER($B59),$B59>0,L59<>\"\"),INDEX(swimmers_data,$B59,5)&\",\"&INDEX(swimmers_data,$B59,1)&\",\"&INDEX(swimmers_data,$B59,2)&\",\"&INDEX(swimmers_data,$B59,4)&\",\"&TEXT(INDEX(swimmers_data,$B59,3),\"ddmmYy\")&\",\"&LEFT(\"000000\",6-LEN(L59))&L59&\",\"&Z$11&\",\"&\"F\",\"\")","v":""},{"$f":"IF(AND(ISNUMBER($B59),$B59>0,M59<>\"\"),INDEX(swimmers_data,$B59,5)&\",\"&INDEX(swimmers_data,$B59,1)&\",\"&INDEX(swimmers_data,$B59,2)&\",\"&INDEX(swimmers_data,$B59,4)&\",\"&TEXT(INDEX(swimmers_data,$B59,3),\"ddmmYy\")&\",\"&LEFT(\"000000\",6-LEN(M59))&M59&\",\"&AA$11&\",\"&\"F\",\"\")","v":""},{"$f":"IF(AND(ISNUMBER($B59),$B59>0,N59<>\"\"),INDEX(swimmers_data,$B59,5)&\",\"&INDEX(swimmers_data,$B59,1)&\",\"&INDEX(swimmers_data,$B59,2)&\",\"&INDEX(swimmers_data,$B59,4)&\",\"&TEXT(INDEX(swimmers_data,$B59,3),\"ddmmYy\")&\",\"&LEFT(\"000000\",6-LEN(N59))&N59&\",\"&AB$11&\",\"&\"F\",\"\")","v":""},null,null,"","","",{"$f":"IF(AND(ISNUMBER($B59),$B59>0,E59<>\"\"),formatMMSSHHtime(E59),\"\")","v":""},{"$f":"IF(AND(ISNUMBER($B59),$B59>0,F59<>\"\"),formatMMSSHHtime(F59),\"\")","v":""},{"$f":"IF(AND(ISNUMBER($B59),$B59>0,G59<>\"\"),formatMMSSHHtime(G59),\"\")","v":""},{"$f":"IF(AND(ISNUMBER($B59),$B59>0,H59<>\"\"),formatMMSSHHtime(H59),\"\")","v":""},{"$f":"IF(AND(ISNUMBER($B59),$B59>0,I59<>\"\"),formatMMSSHHtime(I59),\"\")","v":""},{"$f":"IF(AND(ISNUMBER($B59),$B59>0,J59<>\"\"),formatMMSSHHtime(J59),\"\")","v":""},{"$f":"IF(AND(ISNUMBER($B59),$B59>0,K59<>\"\"),formatMMSSHHtime(K59),\"\")","v":""},{"$f":"IF(AND(ISNUMBER($B59),$B59>0,L59<>\"\"),formatMMSSHHtime(L59),\"\")","v":""},{"$f":"IF(AND(ISNUMBER($B59),$B59>0,M59<>\"\"),formatMMSSHHtime(M59),\"\")","v":""},{"$f":"IF(AND(ISNUMBER($B59),$B59>0,N59<>\"\"),formatMMSSHHtime(N59),\"\")","v":""}]
["","",{"$f":"IF(AND(ISNUMBER(B60),B60>0),DATEDIF(INDEX(swimmers_data,B60,3),$C$8,\"Y\"),\"\")","v":""},{"$f":"IF(AND(ISNUMBER(B60),B60>0),INDEX(swimmers_data,B60,5),\"\")","v":""},null,null,null,null,null,null,null,null,null,null,null,null,null,null,{"$f":"IF(AND(ISNUMBER($B60),$B60>0,E60<>\"\"),INDEX(swimmers_data,$B60,5)&\",\"&INDEX(swimmers_data,$B60,1)&\",\"&INDEX(swimmers_data,$B60,2)&\",\"&INDEX(swimmers_data,$B60,4)&\",\"&TEXT(INDEX(swimmers_data,$B60,3),\"ddmmYy\")&\",\"&LEFT(\"000000\",6-LEN(E60))&E60&\",\"&S$11&\",\"&\"F\",\"\")","v":""},{"$f":"IF(AND(ISNUMBER($B60),$B60>0,F60<>\"\"),INDEX(swimmers_data,$B60,5)&\",\"&INDEX(swimmers_data,$B60,1)&\",\"&INDEX(swimmers_data,$B60,2)&\",\"&INDEX(swimmers_data,$B60,4)&\",\"&TEXT(INDEX(swimmers_data,$B60,3),\"ddmmYy\")&\",\"&LEFT(\"000000\",6-LEN(F60))&F60&\",\"&T$11&\",\"&\"F\",\"\")","v":""},{"$f":"IF(AND(ISNUMBER($B60),$B60>0,G60<>\"\"),INDEX(swimmers_data,$B60,5)&\",\"&INDEX(swimmers_data,$B60,1)&\",\"&INDEX(swimmers_data,$B60,2)&\",\"&INDEX(swimmers_data,$B60,4)&\",\"&TEXT(INDEX(swimmers_data,$B60,3),\"ddmmYy\")&\",\"&LEFT(\"000000\",6-LEN(G60))&G60&\",\"&U$11&\",\"&\"F\",\"\")","v":""},{"$f":"IF(AND(ISNUMBER($B60),$B60>0,H60<>\"\"),INDEX(swimmers_data,$B60,5)&\",\"&INDEX(swimmers_data,$B60,1)&\",\"&INDEX(swimmers_data,$B60,2)&\",\"&INDEX(swimmers_data,$B60,4)&\",\"&TEXT(INDEX(swimmers_data,$B60,3),\"ddmmYy\")&\",\"&LEFT(\"000000\",6-LEN(H60))&H60&\",\"&V$11&\",\"&\"F\",\"\")","v":""},{"$f":"IF(AND(ISNUMBER($B60),$B60>0,I60<>\"\"),INDEX(swimmers_data,$B60,5)&\",\"&INDEX(swimmers_data,$B60,1)&\",\"&INDEX(swimmers_data,$B60,2)&\",\"&INDEX(swimmers_data,$B60,4)&\",\"&TEXT(INDEX(swimmers_data,$B60,3),\"ddmmYy\")&\",\"&LEFT(\"000000\",6-LEN(I60))&I60&\",\"&W$11&\",\"&\"F\",\"\")","v":""},{"$f":"IF(AND(ISNUMBER($B60),$B60>0,J60<>\"\"),INDEX(swimmers_data,$B60,5)&\",\"&INDEX(swimmers_data,$B60,1)&\",\"&INDEX(swimmers_data,$B60,2)&\",\"&INDEX(swimmers_data,$B60,4)&\",\"&TEXT(INDEX(swimmers_data,$B60,3),\"ddmmYy\")&\",\"&LEFT(\"000000\",6-LEN(J60))&J60&\",\"&X$11&\",\"&\"F\",\"\")","v":""},{"$f":"IF(AND(ISNUMBER($B60),$B60>0,K60<>\"\"),INDEX(swimmers_data,$B60,5)&\",\"&INDEX(swimmers_data,$B60,1)&\",\"&INDEX(swimmers_data,$B60,2)&\",\"&INDEX(swimmers_data,$B60,4)&\",\"&TEXT(INDEX(swimmers_data,$B60,3),\"ddmmYy\")&\",\"&LEFT(\"000000\",6-LEN(K60))&K60&\",\"&Y$11&\",\"&\"F\",\"\")","v":""},{"$f":"IF(AND(ISNUMBER($B60),$B60>0,L60<>\"\"),INDEX(swimmers_data,$B60,5)&\",\"&INDEX(swimmers_data,$B60,1)&\",\"&INDEX(swimmers_data,$B60,2)&\",\"&INDEX(swimmers_data,$B60,4)&\",\"&TEXT(INDEX(swimmers_data,$B60,3),\"ddmmYy\")&\",\"&LEFT(\"000000\",6-LEN(L60))&L60&\",\"&Z$11&\",\"&\"F\",\"\")","v":""},{"$f":"IF(AND(ISNUMBER($B60),$B60>0,M60<>\"\"),INDEX(swimmers_data,$B60,5)&\",\"&INDEX(swimmers_data,$B60,1)&\",\"&INDEX(swimmers_data,$B60,2)&\",\"&INDEX(swimmers_data,$B60,4)&\",\"&TEXT(INDEX(swimmers_data,$B60,3),\"ddmmYy\")&\",\"&LEFT(\"000000\",6-LEN(M60))&M60&\",\"&AA$11&\",\"&\"F\",\"\")","v":""},{"$f":"IF(AND(ISNUMBER($B60),$B60>0,N60<>\"\"),INDEX(swimmers_data,$B60,5)&\",\"&INDEX(swimmers_data,$B60,1)&\",\"&INDEX(swimmers_data,$B60,2)&\",\"&INDEX(swimmers_data,$B60,4)&\",\"&TEXT(INDEX(swimmers_data,$B60,3),\"ddmmYy\")&\",\"&LEFT(\"000000\",6-LEN(N60))&N60&\",\"&AB$11&\",\"&\"F\",\"\")","v":""},null,null,"","","",{"$f":"IF(AND(ISNUMBER($B60),$B60>0,E60<>\"\"),formatMMSSHHtime(E60),\"\")","v":""},{"$f":"IF(AND(ISNUMBER($B60),$B60>0,F60<>\"\"),formatMMSSHHtime(F60),\"\")","v":""},{"$f":"IF(AND(ISNUMBER($B60),$B60>0,G60<>\"\"),formatMMSSHHtime(G60),\"\")","v":""},{"$f":"IF(AND(ISNUMBER($B60),$B60>0,H60<>\"\"),formatMMSSHHtime(H60),\"\")","v":""},{"$f":"IF(AND(ISNUMBER($B60),$B60>0,I60<>\"\"),formatMMSSHHtime(I60),\"\")","v":""},{"$f":"IF(AND(ISNUMBER($B60),$B60>0,J60<>\"\"),formatMMSSHHtime(J60),\"\")","v":""},{"$f":"IF(AND(ISNUMBER($B60),$B60>0,K60<>\"\"),formatMMSSHHtime(K60),\"\")","v":""},{"$f":"IF(AND(ISNUMBER($B60),$B60>0,L60<>\"\"),formatMMSSHHtime(L60),\"\")","v":""},{"$f":"IF(AND(ISNUMBER($B60),$B60>0,M60<>\"\"),formatMMSSHHtime(M60),\"\")","v":""},{"$f":"IF(AND(ISNUMBER($B60),$B60>0,N60<>\"\"),formatMMSSHHtime(N60),\"\")","v":""}]
["","",{"$f":"IF(AND(ISNUMBER(B61),B61>0),DATEDIF(INDEX(swimmers_data,B61,3),$C$8,\"Y\"),\"\")","v":""},{"$f":"IF(AND(ISNUMBER(B61),B61>0),INDEX(swimmers_data,B61,5),\"\")","v":""},null,null,null,null,null,null,null,null,null,null,null,null,null,null,{"$f":"IF(AND(ISNUMBER($B61),$B61>0,E61<>\"\"),INDEX(swimmers_data,$B61,5)&\",\"&INDEX(swimmers_data,$B61,1)&\",\"&INDEX(swimmers_data,$B61,2)&\",\"&INDEX(swimmers_data,$B61,4)&\",\"&TEXT(INDEX(swimmers_data,$B61,3),\"ddmmYy\")&\",\"&LEFT(\"000000\",6-LEN(E61))&E61&\",\"&S$11&\",\"&\"F\",\"\")","v":""},{"$f":"IF(AND(ISNUMBER($B61),$B61>0,F61<>\"\"),INDEX(swimmers_data,$B61,5)&\",\"&INDEX(swimmers_data,$B61,1)&\",\"&INDEX(swimmers_data,$B61,2)&\",\"&INDEX(swimmers_data,$B61,4)&\",\"&TEXT(INDEX(swimmers_data,$B61,3),\"ddmmYy\")&\",\"&LEFT(\"000000\",6-LEN(F61))&F61&\",\"&T$11&\",\"&\"F\",\"\")","v":""},{"$f":"IF(AND(ISNUMBER($B61),$B61>0,G61<>\"\"),INDEX(swimmers_data,$B61,5)&\",\"&INDEX(swimmers_data,$B61,1)&\",\"&INDEX(swimmers_data,$B61,2)&\",\"&INDEX(swimmers_data,$B61,4)&\",\"&TEXT(INDEX(swimmers_data,$B61,3),\"ddmmYy\")&\",\"&LEFT(\"000000\",6-LEN(G61))&G61&\",\"&U$11&\",\"&\"F\",\"\")","v":""},{"$f":"IF(AND(ISNUMBER($B61),$B61>0,H61<>\"\"),INDEX(swimmers_data,$B61,5)&\",\"&INDEX(swimmers_data,$B61,1)&\",\"&INDEX(swimmers_data,$B61,2)&\",\"&INDEX(swimmers_data,$B61,4)&\",\"&TEXT(INDEX(swimmers_data,$B61,3),\"ddmmYy\")&\",\"&LEFT(\"000000\",6-LEN(H61))&H61&\",\"&V$11&\",\"&\"F\",\"\")","v":""},{"$f":"IF(AND(ISNUMBER($B61),$B61>0,I61<>\"\"),INDEX(swimmers_data,$B61,5)&\",\"&INDEX(swimmers_data,$B61,1)&\",\"&INDEX(swimmers_data,$B61,2)&\",\"&INDEX(swimmers_data,$B61,4)&\",\"&TEXT(INDEX(swimmers_data,$B61,3),\"ddmmYy\")&\",\"&LEFT(\"000000\",6-LEN(I61))&I61&\",\"&W$11&\",\"&\"F\",\"\")","v":""},{"$f":"IF(AND(ISNUMBER($B61),$B61>0,J61<>\"\"),INDEX(swimmers_data,$B61,5)&\",\"&INDEX(swimmers_data,$B61,1)&\",\"&INDEX(swimmers_data,$B61,2)&\",\"&INDEX(swimmers_data,$B61,4)&\",\"&TEXT(INDEX(swimmers_data,$B61,3),\"ddmmYy\")&\",\"&LEFT(\"000000\",6-LEN(J61))&J61&\",\"&X$11&\",\"&\"F\",\"\")","v":""},{"$f":"IF(AND(ISNUMBER($B61),$B61>0,K61<>\"\"),INDEX(swimmers_data,$B61,5)&\",\"&INDEX(swimmers_data,$B61,1)&\",\"&INDEX(swimmers_data,$B61,2)&\",\"&INDEX(swimmers_data,$B61,4)&\",\"&TEXT(INDEX(swimmers_data,$B61,3),\"ddmmYy\")&\",\"&LEFT(\"000000\",6-LEN(K61))&K61&\",\"&Y$11&\",\"&\"F\",\"\")","v":""},{"$f":"IF(AND(ISNUMBER($B61),$B61>0,L61<>\"\"),INDEX(swimmers_data,$B61,5)&\",\"&INDEX(swimmers_data,$B61,1)&\",\"&INDEX(swimmers_data,$B61,2)&\",\"&INDEX(swimmers_data,$B61,4)&\",\"&TEXT(INDEX(swimmers_data,$B61,3),\"ddmmYy\")&\",\"&LEFT(\"000000\",6-LEN(L61))&L61&\",\"&Z$11&\",\"&\"F\",\"\")","v":""},{"$f":"IF(AND(ISNUMBER($B61),$B61>0,M61<>\"\"),INDEX(swimmers_data,$B61,5)&\",\"&INDEX(swimmers_data,$B61,1)&\",\"&INDEX(swimmers_data,$B61,2)&\",\"&INDEX(swimmers_data,$B61,4)&\",\"&TEXT(INDEX(swimmers_data,$B61,3),\"ddmmYy\")&\",\"&LEFT(\"000000\",6-LEN(M61))&M61&\",\"&AA$11&\",\"&\"F\",\"\")","v":""},{"$f":"IF(AND(ISNUMBER($B61),$B61>0,N61<>\"\"),INDEX(swimmers_data,$B61,5)&\",\"&INDEX(swimmers_data,$B61,1)&\",\"&INDEX(swimmers_data,$B61,2)&\",\"&INDEX(swimmers_data,$B61,4)&\",\"&TEXT(INDEX(swimmers_data,$B61,3),\"ddmmYy\")&\",\"&LEFT(\"000000\",6-LEN(N61))&N61&\",\"&AB$11&\",\"&\"F\",\"\")","v":""},null,null,"","","",{"$f":"IF(AND(ISNUMBER($B61),$B61>0,E61<>\"\"),formatMMSSHHtime(E61),\"\")","v":""},{"$f":"IF(AND(ISNUMBER($B61),$B61>0,F61<>\"\"),formatMMSSHHtime(F61),\"\")","v":""},{"$f":"IF(AND(ISNUMBER($B61),$B61>0,G61<>\"\"),formatMMSSHHtime(G61),\"\")","v":""},{"$f":"IF(AND(ISNUMBER($B61),$B61>0,H61<>\"\"),formatMMSSHHtime(H61),\"\")","v":""},{"$f":"IF(AND(ISNUMBER($B61),$B61>0,I61<>\"\"),formatMMSSHHtime(I61),\"\")","v":""},{"$f":"IF(AND(ISNUMBER($B61),$B61>0,J61<>\"\"),formatMMSSHHtime(J61),\"\")","v":""},{"$f":"IF(AND(ISNUMBER($B61),$B61>0,K61<>\"\"),formatMMSSHHtime(K61),\"\")","v":""},{"$f":"IF(AND(ISNUMBER($B61),$B61>0,L61<>\"\"),formatMMSSHHtime(L61),\"\")","v":""},{"$f":"IF(AND(ISNUMBER($B61),$B61>0,M61<>\"\"),formatMMSSHHtime(M61),\"\")","v":""},{"$f":"IF(AND(ISNUMBER($B61),$B61>0,N61<>\"\"),formatMMSSHHtime(N61),\"\")","v":""}]
["","",{"$f":"IF(AND(ISNUMBER(B62),B62>0),DATEDIF(INDEX(swimmers_data,B62,3),$C$8,\"Y\"),\"\")","v":""},{"$f":"IF(AND(ISNUMBER(B62),B62>0),INDEX(swimmers_data,B62,5),\"\")","v":""},null,null,null,null,null,null,null,null,null,null,null,null,null,null,{"$f":"IF(AND(ISNUMBER($B62),$B62>0,E62<>\"\"),INDEX(swimmers_data,$B62,5)&\",\"&INDEX(swimmers_data,$B62,1)&\",\"&INDEX(swimmers_data,$B62,2)&\",\"&INDEX(swimmers_data,$B62,4)&\",\"&TEXT(INDEX(swimmers_data,$B62,3),\"ddmmYy\")&\",\"&LEFT(\"000000\",6-LEN(E62))&E62&\",\"&S$11&\",\"&\"F\",\"\")","v":""},{"$f":"IF(AND(ISNUMBER($B62),$B62>0,F62<>\"\"),INDEX(swimmers_data,$B62,5)&\",\"&INDEX(swimmers_data,$B62,1)&\",\"&INDEX(swimmers_data,$B62,2)&\",\"&INDEX(swimmers_data,$B62,4)&\",\"&TEXT(INDEX(swimmers_data,$B62,3),\"ddmmYy\")&\",\"&LEFT(\"000000\",6-LEN(F62))&F62&\",\"&T$11&\",\"&\"F\",\"\")","v":""},{"$f":"IF(AND(ISNUMBER($B62),$B62>0,G62<>\"\"),INDEX(swimmers_data,$B62,5)&\",\"&INDEX(swimmers_data,$B62,1)&\",\"&INDEX(swimmers_data,$B62,2)&\",\"&INDEX(swimmers_data,$B62,4)&\",\"&TEXT(INDEX(swimmers_data,$B62,3),\"ddmmYy\")&\",\"&LEFT(\"000000\",6-LEN(G62))&G62&\",\"&U$11&\",\"&\"F\",\"\")","v":""},{"$f":"IF(AND(ISNUMBER($B62),$B62>0,H62<>\"\"),INDEX(swimmers_data,$B62,5)&\",\"&INDEX(swimmers_data,$B62,1)&\",\"&INDEX(swimmers_data,$B62,2)&\",\"&INDEX(swimmers_data,$B62,4)&\",\"&TEXT(INDEX(swimmers_data,$B62,3),\"ddmmYy\")&\",\"&LEFT(\"000000\",6-LEN(H62))&H62&\",\"&V$11&\",\"&\"F\",\"\")","v":""},{"$f":"IF(AND(ISNUMBER($B62),$B62>0,I62<>\"\"),INDEX(swimmers_data,$B62,5)&\",\"&INDEX(swimmers_data,$B62,1)&\",\"&INDEX(swimmers_data,$B62,2)&\",\"&INDEX(swimmers_data,$B62,4)&\",\"&TEXT(INDEX(swimmers_data,$B62,3),\"ddmmYy\")&\",\"&LEFT(\"000000\",6-LEN(I62))&I62&\",\"&W$11&\",\"&\"F\",\"\")","v":""},{"$f":"IF(AND(ISNUMBER($B62),$B62>0,J62<>\"\"),INDEX(swimmers_data,$B62,5)&\",\"&INDEX(swimmers_data,$B62,1)&\",\"&INDEX(swimmers_data,$B62,2)&\",\"&INDEX(swimmers_data,$B62,4)&\",\"&TEXT(INDEX(swimmers_data,$B62,3),\"ddmmYy\")&\",\"&LEFT(\"000000\",6-LEN(J62))&J62&\",\"&X$11&\",\"&\"F\",\"\")","v":""},{"$f":"IF(AND(ISNUMBER($B62),$B62>0,K62<>\"\"),INDEX(swimmers_data,$B62,5)&\",\"&INDEX(swimmers_data,$B62,1)&\",\"&INDEX(swimmers_data,$B62,2)&\",\"&INDEX(swimmers_data,$B62,4)&\",\"&TEXT(INDEX(swimmers_data,$B62,3),\"ddmmYy\")&\",\"&LEFT(\"000000\",6-LEN(K62))&K62&\",\"&Y$11&\",\"&\"F\",\"\")","v":""},{"$f":"IF(AND(ISNUMBER($B62),$B62>0,L62<>\"\"),INDEX(swimmers_data,$B62,5)&\",\"&INDEX(swimmers_data,$B62,1)&\",\"&INDEX(swimmers_data,$B62,2)&\",\"&INDEX(swimmers_data,$B62,4)&\",\"&TEXT(INDEX(swimmers_data,$B62,3),\"ddmmYy\")&\",\"&LEFT(\"000000\",6-LEN(L62))&L62&\",\"&Z$11&\",\"&\"F\",\"\")","v":""},{"$f":"IF(AND(ISNUMBER($B62),$B62>0,M62<>\"\"),INDEX(swimmers_data,$B62,5)&\",\"&INDEX(swimmers_data,$B62,1)&\",\"&INDEX(swimmers_data,$B62,2)&\",\"&INDEX(swimmers_data,$B62,4)&\",\"&TEXT(INDEX(swimmers_data,$B62,3),\"ddmmYy\")&\",\"&LEFT(\"000000\",6-LEN(M62))&M62&\",\"&AA$11&\",\"&\"F\",\"\")","v":""},{"$f":"IF(AND(ISNUMBER($B62),$B62>0,N62<>\"\"),INDEX(swimmers_data,$B62,5)&\",\"&INDEX(swimmers_data,$B62,1)&\",\"&INDEX(swimmers_data,$B62,2)&\",\"&INDEX(swimmers_data,$B62,4)&\",\"&TEXT(INDEX(swimmers_data,$B62,3),\"ddmmYy\")&\",\"&LEFT(\"000000\",6-LEN(N62))&N62&\",\"&AB$11&\",\"&\"F\",\"\")","v":""},null,null,"","","",{"$f":"IF(AND(ISNUMBER($B62),$B62>0,E62<>\"\"),formatMMSSHHtime(E62),\"\")","v":""},{"$f":"IF(AND(ISNUMBER($B62),$B62>0,F62<>\"\"),formatMMSSHHtime(F62),\"\")","v":""},{"$f":"IF(AND(ISNUMBER($B62),$B62>0,G62<>\"\"),formatMMSSHHtime(G62),\"\")","v":""},{"$f":"IF(AND(ISNUMBER($B62),$B62>0,H62<>\"\"),formatMMSSHHtime(H62),\"\")","v":""},{"$f":"IF(AND(ISNUMBER($B62),$B62>0,I62<>\"\"),formatMMSSHHtime(I62),\"\")","v":""},{"$f":"IF(AND(ISNUMBER($B62),$B62>0,J62<>\"\"),formatMMSSHHtime(J62),\"\")","v":""},{"$f":"IF(AND(ISNUMBER($B62),$B62>0,K62<>\"\"),formatMMSSHHtime(K62),\"\")","v":""},{"$f":"IF(AND(ISNUMBER($B62),$B62>0,L62<>\"\"),formatMMSSHHtime(L62),\"\")","v":""},{"$f":"IF(AND(ISNUMBER($B62),$B62>0,M62<>\"\"),formatMMSSHHtime(M62),\"\")","v":""},{"$f":"IF(AND(ISNUMBER($B62),$B62>0,N62<>\"\"),formatMMSSHHtime(N62),\"\")","v":""}]
["","",{"$f":"IF(AND(ISNUMBER(B63),B63>0),DATEDIF(INDEX(swimmers_data,B63,3),$C$8,\"Y\"),\"\")","v":""},{"$f":"IF(AND(ISNUMBER(B63),B63>0),INDEX(swimmers_data,B63,5),\"\")","v":""},null,null,null,null,null,null,null,null,null,null,null,null,null,null,{"$f":"IF(AND(ISNUMBER($B63),$B63>0,E63<>\"\"),INDEX(swimmers_data,$B63,5)&\",\"&INDEX(swimmers_data,$B63,1)&\",\"&INDEX(swimmers_data,$B63,2)&\",\"&INDEX(swimmers_data,$B63,4)&\",\"&TEXT(INDEX(swimmers_data,$B63,3),\"ddmmYy\")&\",\"&LEFT(\"000000\",6-LEN(E63))&E63&\",\"&S$11&\",\"&\"F\",\"\")","v":""},{"$f":"IF(AND(ISNUMBER($B63),$B63>0,F63<>\"\"),INDEX(swimmers_data,$B63,5)&\",\"&INDEX(swimmers_data,$B63,1)&\",\"&INDEX(swimmers_data,$B63,2)&\",\"&INDEX(swimmers_data,$B63,4)&\",\"&TEXT(INDEX(swimmers_data,$B63,3),\"ddmmYy\")&\",\"&LEFT(\"000000\",6-LEN(F63))&F63&\",\"&T$11&\",\"&\"F\",\"\")","v":""},{"$f":"IF(AND(ISNUMBER($B63),$B63>0,G63<>\"\"),INDEX(swimmers_data,$B63,5)&\",\"&INDEX(swimmers_data,$B63,1)&\",\"&INDEX(swimmers_data,$B63,2)&\",\"&INDEX(swimmers_data,$B63,4)&\",\"&TEXT(INDEX(swimmers_data,$B63,3),\"ddmmYy\")&\",\"&LEFT(\"000000\",6-LEN(G63))&G63&\",\"&U$11&\",\"&\"F\",\"\")","v":""},{"$f":"IF(AND(ISNUMBER($B63),$B63>0,H63<>\"\"),INDEX(swimmers_data,$B63,5)&\",\"&INDEX(swimmers_data,$B63,1)&\",\"&INDEX(swimmers_data,$B63,2)&\",\"&INDEX(swimmers_data,$B63,4)&\",\"&TEXT(INDEX(swimmers_data,$B63,3),\"ddmmYy\")&\",\"&LEFT(\"000000\",6-LEN(H63))&H63&\",\"&V$11&\",\"&\"F\",\"\")","v":""},{"$f":"IF(AND(ISNUMBER($B63),$B63>0,I63<>\"\"),INDEX(swimmers_data,$B63,5)&\",\"&INDEX(swimmers_data,$B63,1)&\",\"&INDEX(swimmers_data,$B63,2)&\",\"&INDEX(swimmers_data,$B63,4)&\",\"&TEXT(INDEX(swimmers_data,$B63,3),\"ddmmYy\")&\",\"&LEFT(\"000000\",6-LEN(I63))&I63&\",\"&W$11&\",\"&\"F\",\"\")","v":""},{"$f":"IF(AND(ISNUMBER($B63),$B63>0,J63<>\"\"),INDEX(swimmers_data,$B63,5)&\",\"&INDEX(swimmers_data,$B63,1)&\",\"&INDEX(swimmers_data,$B63,2)&\",\"&INDEX(swimmers_data,$B63,4)&\",\"&TEXT(INDEX(swimmers_data,$B63,3),\"ddmmYy\")&\",\"&LEFT(\"000000\",6-LEN(J63))&J63&\",\"&X$11&\",\"&\"F\",\"\")","v":""},{"$f":"IF(AND(ISNUMBER($B63),$B63>0,K63<>\"\"),INDEX(swimmers_data,$B63,5)&\",\"&INDEX(swimmers_data,$B63,1)&\",\"&INDEX(swimmers_data,$B63,2)&\",\"&INDEX(swimmers_data,$B63,4)&\",\"&TEXT(INDEX(swimmers_data,$B63,3),\"ddmmYy\")&\",\"&LEFT(\"000000\",6-LEN(K63))&K63&\",\"&Y$11&\",\"&\"F\",\"\")","v":""},{"$f":"IF(AND(ISNUMBER($B63),$B63>0,L63<>\"\"),INDEX(swimmers_data,$B63,5)&\",\"&INDEX(swimmers_data,$B63,1)&\",\"&INDEX(swimmers_data,$B63,2)&\",\"&INDEX(swimmers_data,$B63,4)&\",\"&TEXT(INDEX(swimmers_data,$B63,3),\"ddmmYy\")&\",\"&LEFT(\"000000\",6-LEN(L63))&L63&\",\"&Z$11&\",\"&\"F\",\"\")","v":""},{"$f":"IF(AND(ISNUMBER($B63),$B63>0,M63<>\"\"),INDEX(swimmers_data,$B63,5)&\",\"&INDEX(swimmers_data,$B63,1)&\",\"&INDEX(swimmers_data,$B63,2)&\",\"&INDEX(swimmers_data,$B63,4)&\",\"&TEXT(INDEX(swimmers_data,$B63,3),\"ddmmYy\")&\",\"&LEFT(\"000000\",6-LEN(M63))&M63&\",\"&AA$11&\",\"&\"F\",\"\")","v":""},{"$f":"IF(AND(ISNUMBER($B63),$B63>0,N63<>\"\"),INDEX(swimmers_data,$B63,5)&\",\"&INDEX(swimmers_data,$B63,1)&\",\"&INDEX(swimmers_data,$B63,2)&\",\"&INDEX(swimmers_data,$B63,4)&\",\"&TEXT(INDEX(swimmers_data,$B63,3),\"ddmmYy\")&\",\"&LEFT(\"000000\",6-LEN(N63))&N63&\",\"&AB$11&\",\"&\"F\",\"\")","v":""},null,null,"","","",{"$f":"IF(AND(ISNUMBER($B63),$B63>0,E63<>\"\"),formatMMSSHHtime(E63),\"\")","v":""},{"$f":"IF(AND(ISNUMBER($B63),$B63>0,F63<>\"\"),formatMMSSHHtime(F63),\"\")","v":""},{"$f":"IF(AND(ISNUMBER($B63),$B63>0,G63<>\"\"),formatMMSSHHtime(G63),\"\")","v":""},{"$f":"IF(AND(ISNUMBER($B63),$B63>0,H63<>\"\"),formatMMSSHHtime(H63),\"\")","v":""},{"$f":"IF(AND(ISNUMBER($B63),$B63>0,I63<>\"\"),formatMMSSHHtime(I63),\"\")","v":""},{"$f":"IF(AND(ISNUMBER($B63),$B63>0,J63<>\"\"),formatMMSSHHtime(J63),\"\")","v":""},{"$f":"IF(AND(ISNUMBER($B63),$B63>0,K63<>\"\"),formatMMSSHHtime(K63),\"\")","v":""},{"$f":"IF(AND(ISNUMBER($B63),$B63>0,L63<>\"\"),formatMMSSHHtime(L63),\"\")","v":""},{"$f":"IF(AND(ISNUMBER($B63),$B63>0,M63<>\"\"),formatMMSSHHtime(M63),\"\")","v":""},{"$f":"IF(AND(ISNUMBER($B63),$B63>0,N63<>\"\"),formatMMSSHHtime(N63),\"\")","v":""}]
["","",{"$f":"IF(AND(ISNUMBER(B64),B64>0),DATEDIF(INDEX(swimmers_data,B64,3),$C$8,\"Y\"),\"\")","v":""},{"$f":"IF(AND(ISNUMBER(B64),B64>0),INDEX(swimmers_data,B64,5),\"\")","v":""},null,null,null,null,null,null,null,null,null,null,null,null,null,null,{"$f":"IF(AND(ISNUMBER($B64),$B64>0,E64<>\"\"),INDEX(swimmers_data,$B64,5)&\",\"&INDEX(swimmers_data,$B64,1)&\",\"&INDEX(swimmers_data,$B64,2)&\",\"&INDEX(swimmers_data,$B64,4)&\",\"&TEXT(INDEX(swimmers_data,$B64,3),\"ddmmYy\")&\",\"&LEFT(\"000000\",6-LEN(E64))&E64&\",\"&S$11&\",\"&\"F\",\"\")","v":""},{"$f":"IF(AND(ISNUMBER($B64),$B64>0,F64<>\"\"),INDEX(swimmers_data,$B64,5)&\",\"&INDEX(swimmers_data,$B64,1)&\",\"&INDEX(swimmers_data,$B64,2)&\",\"&INDEX(swimmers_data,$B64,4)&\",\"&TEXT(INDEX(swimmers_data,$B64,3),\"ddmmYy\")&\",\"&LEFT(\"000000\",6-LEN(F64))&F64&\",\"&T$11&\",\"&\"F\",\"\")","v":""},{"$f":"IF(AND(ISNUMBER($B64),$B64>0,G64<>\"\"),INDEX(swimmers_data,$B64,5)&\",\"&INDEX(swimmers_data,$B64,1)&\",\"&INDEX(swimmers_data,$B64,2)&\",\"&INDEX(swimmers_data,$B64,4)&\",\"&TEXT(INDEX(swimmers_data,$B64,3),\"ddmmYy\")&\",\"&LEFT(\"000000\",6-LEN(G64))&G64&\",\"&U$11&\",\"&\"F\",\"\")","v":""},{"$f":"IF(AND(ISNUMBER($B64),$B64>0,H64<>\"\"),INDEX(swimmers_data,$B64,5)&\",\"&INDEX(swimmers_data,$B64,1)&\",\"&INDEX(swimmers_data,$B64,2)&\",\"&INDEX(swimmers_data,$B64,4)&\",\"&TEXT(INDEX(swimmers_data,$B64,3),\"ddmmYy\")&\",\"&LEFT(\"000000\",6-LEN(H64))&H64&\",\"&V$11&\",\"&\"F\",\"\")","v":""},{"$f":"IF(AND(ISNUMBER($B64),$B64>0,I64<>\"\"),INDEX(swimmers_data,$B64,5)&\",\"&INDEX(swimmers_data,$B64,1)&\",\"&INDEX(swimmers_data,$B64,2)&\",\"&INDEX(swimmers_data,$B64,4)&\",\"&TEXT(INDEX(swimmers_data,$B64,3),\"ddmmYy\")&\",\"&LEFT(\"000000\",6-LEN(I64))&I64&\",\"&W$11&\",\"&\"F\",\"\")","v":""},{"$f":"IF(AND(ISNUMBER($B64),$B64>0,J64<>\"\"),INDEX(swimmers_data,$B64,5)&\",\"&INDEX(swimmers_data,$B64,1)&\",\"&INDEX(swimmers_data,$B64,2)&\",\"&INDEX(swimmers_data,$B64,4)&\",\"&TEXT(INDEX(swimmers_data,$B64,3),\"ddmmYy\")&\",\"&LEFT(\"000000\",6-LEN(J64))&J64&\",\"&X$11&\",\"&\"F\",\"\")","v":""},{"$f":"IF(AND(ISNUMBER($B64),$B64>0,K64<>\"\"),INDEX(swimmers_data,$B64,5)&\",\"&INDEX(swimmers_data,$B64,1)&\",\"&INDEX(swimmers_data,$B64,2)&\",\"&INDEX(swimmers_data,$B64,4)&\",\"&TEXT(INDEX(swimmers_data,$B64,3),\"ddmmYy\")&\",\"&LEFT(\"000000\",6-LEN(K64))&K64&\",\"&Y$11&\",\"&\"F\",\"\")","v":""},{"$f":"IF(AND(ISNUMBER($B64),$B64>0,L64<>\"\"),INDEX(swimmers_data,$B64,5)&\",\"&INDEX(swimmers_data,$B64,1)&\",\"&INDEX(swimmers_data,$B64,2)&\",\"&INDEX(swimmers_data,$B64,4)&\",\"&TEXT(INDEX(swimmers_data,$B64,3),\"ddmmYy\")&\",\"&LEFT(\"000000\",6-LEN(L64))&L64&\",\"&Z$11&\",\"&\"F\",\"\")","v":""},{"$f":"IF(AND(ISNUMBER($B64),$B64>0,M64<>\"\"),INDEX(swimmers_data,$B64,5)&\",\"&INDEX(swimmers_data,$B64,1)&\",\"&INDEX(swimmers_data,$B64,2)&\",\"&INDEX(swimmers_data,$B64,4)&\",\"&TEXT(INDEX(swimmers_data,$B64,3),\"ddmmYy\")&\",\"&LEFT(\"000000\",6-LEN(M64))&M64&\",\"&AA$11&\",\"&\"F\",\"\")","v":""},{"$f":"IF(AND(ISNUMBER($B64),$B64>0,N64<>\"\"),INDEX(swimmers_data,$B64,5)&\",\"&INDEX(swimmers_data,$B64,1)&\",\"&INDEX(swimmers_data,$B64,2)&\",\"&INDEX(swimmers_data,$B64,4)&\",\"&TEXT(INDEX(swimmers_data,$B64,3),\"ddmmYy\")&\",\"&LEFT(\"000000\",6-LEN(N64))&N64&\",\"&AB$11&\",\"&\"F\",\"\")","v":""},null,null,"","","",{"$f":"IF(AND(ISNUMBER($B64),$B64>0,E64<>\"\"),formatMMSSHHtime(E64),\"\")","v":""},{"$f":"IF(AND(ISNUMBER($B64),$B64>0,F64<>\"\"),formatMMSSHHtime(F64),\"\")","v":""},{"$f":"IF(AND(ISNUMBER($B64),$B64>0,G64<>\"\"),formatMMSSHHtime(G64),\"\")","v":""},{"$f":"IF(AND(ISNUMBER($B64),$B64>0,H64<>\"\"),formatMMSSHHtime(H64),\"\")","v":""},{"$f":"IF(AND(ISNUMBER($B64),$B64>0,I64<>\"\"),formatMMSSHHtime(I64),\"\")","v":""},{"$f":"IF(AND(ISNUMBER($B64),$B64>0,J64<>\"\"),formatMMSSHHtime(J64),\"\")","v":""},{"$f":"IF(AND(ISNUMBER($B64),$B64>0,K64<>\"\"),formatMMSSHHtime(K64),\"\")","v":""},{"$f":"IF(AND(ISNUMBER($B64),$B64>0,L64<>\"\"),formatMMSSHHtime(L64),\"\")","v":""},{"$f":"IF(AND(ISNUMBER($B64),$B64>0,M64<>\"\"),formatMMSSHHtime(M64),\"\")","v":""},{"$f":"IF(AND(ISNUMBER($B64),$B64>0,N64<>\"\"),formatMMSSHHtime(N64),\"\")","v":""}]
["","",{"$f":"IF(AND(ISNUMBER(B65),B65>0),DATEDIF(INDEX(swimmers_data,B65,3),$C$8,\"Y\"),\"\")","v":""},{"$f":"IF(AND(ISNUMBER(B65),B65>0),INDEX(swimmers_data,B65,5),\"\")","v":""},null,null,null,null,null,null,null,null,null,null,null,null,null,null,{"$f":"IF(AND(ISNUMBER($B65),$B65>0,E65<>\"\"),INDEX(swimmers_data,$B65,5)&\",\"&INDEX(swimmers_data,$B65,1)&\",\"&INDEX(swimmers_data,$B65,2)&\",\"&INDEX(swimmers_data,$B65,4)&\",\"&TEXT(INDEX(swimmers_data,$B65,3),\"ddmmYy\")&\",\"&LEFT(\"000000\",6-LEN(E65))&E65&\",\"&S$11&\",\"&\"F\",\"\")","v":""},{"$f":"IF(AND(ISNUMBER($B65),$B65>0,F65<>\"\"),INDEX(swimmers_data,$B65,5)&\",\"&INDEX(swimmers_data,$B65,1)&\",\"&INDEX(swimmers_data,$B65,2)&\",\"&INDEX(swimmers_data,$B65,4)&\",\"&TEXT(INDEX(swimmers_data,$B65,3),\"ddmmYy\")&\",\"&LEFT(\"000000\",6-LEN(F65))&F65&\",\"&T$11&\",\"&\"F\",\"\")","v":""},{"$f":"IF(AND(ISNUMBER($B65),$B65>0,G65<>\"\"),INDEX(swimmers_data,$B65,5)&\",\"&INDEX(swimmers_data,$B65,1)&\",\"&INDEX(swimmers_data,$B65,2)&\",\"&INDEX(swimmers_data,$B65,4)&\",\"&TEXT(INDEX(swimmers_data,$B65,3),\"ddmmYy\")&\",\"&LEFT(\"000000\",6-LEN(G65))&G65&\",\"&U$11&\",\"&\"F\",\"\")","v":""},{"$f":"IF(AND(ISNUMBER($B65),$B65>0,H65<>\"\"),INDEX(swimmers_data,$B65,5)&\",\"&INDEX(swimmers_data,$B65,1)&\",\"&INDEX(swimmers_data,$B65,2)&\",\"&INDEX(swimmers_data,$B65,4)&\",\"&TEXT(INDEX(swimmers_data,$B65,3),\"ddmmYy\")&\",\"&LEFT(\"000000\",6-LEN(H65))&H65&\",\"&V$11&\",\"&\"F\",\"\")","v":""},{"$f":"IF(AND(ISNUMBER($B65),$B65>0,I65<>\"\"),INDEX(swimmers_data,$B65,5)&\",\"&INDEX(swimmers_data,$B65,1)&\",\"&INDEX(swimmers_data,$B65,2)&\",\"&INDEX(swimmers_data,$B65,4)&\",\"&TEXT(INDEX(swimmers_data,$B65,3),\"ddmmYy\")&\",\"&LEFT(\"000000\",6-LEN(I65))&I65&\",\"&W$11&\",\"&\"F\",\"\")","v":""},{"$f":"IF(AND(ISNUMBER($B65),$B65>0,J65<>\"\"),INDEX(swimmers_data,$B65,5)&\",\"&INDEX(swimmers_data,$B65,1)&\",\"&INDEX(swimmers_data,$B65,2)&\",\"&INDEX(swimmers_data,$B65,4)&\",\"&TEXT(INDEX(swimmers_data,$B65,3),\"ddmmYy\")&\",\"&LEFT(\"000000\",6-LEN(J65))&J65&\",\"&X$11&\",\"&\"F\",\"\")","v":""},{"$f":"IF(AND(ISNUMBER($B65),$B65>0,K65<>\"\"),INDEX(swimmers_data,$B65,5)&\",\"&INDEX(swimmers_data,$B65,1)&\",\"&INDEX(swimmers_data,$B65,2)&\",\"&INDEX(swimmers_data,$B65,4)&\",\"&TEXT(INDEX(swimmers_data,$B65,3),\"ddmmYy\")&\",\"&LEFT(\"000000\",6-LEN(K65))&K65&\",\"&Y$11&\",\"&\"F\",\"\")","v":""},{"$f":"IF(AND(ISNUMBER($B65),$B65>0,L65<>\"\"),INDEX(swimmers_data,$B65,5)&\",\"&INDEX(swimmers_data,$B65,1)&\",\"&INDEX(swimmers_data,$B65,2)&\",\"&INDEX(swimmers_data,$B65,4)&\",\"&TEXT(INDEX(swimmers_data,$B65,3),\"ddmmYy\")&\",\"&LEFT(\"000000\",6-LEN(L65))&L65&\",\"&Z$11&\",\"&\"F\",\"\")","v":""},{"$f":"IF(AND(ISNUMBER($B65),$B65>0,M65<>\"\"),INDEX(swimmers_data,$B65,5)&\",\"&INDEX(swimmers_data,$B65,1)&\",\"&INDEX(swimmers_data,$B65,2)&\",\"&INDEX(swimmers_data,$B65,4)&\",\"&TEXT(INDEX(swimmers_data,$B65,3),\"ddmmYy\")&\",\"&LEFT(\"000000\",6-LEN(M65))&M65&\",\"&AA$11&\",\"&\"F\",\"\")","v":""},{"$f":"IF(AND(ISNUMBER($B65),$B65>0,N65<>\"\"),INDEX(swimmers_data,$B65,5)&\",\"&INDEX(swimmers_data,$B65,1)&\",\"&INDEX(swimmers_data,$B65,2)&\",\"&INDEX(swimmers_data,$B65,4)&\",\"&TEXT(INDEX(swimmers_data,$B65,3),\"ddmmYy\")&\",\"&LEFT(\"000000\",6-LEN(N65))&N65&\",\"&AB$11&\",\"&\"F\",\"\")","v":""},null,null,"","","",{"$f":"IF(AND(ISNUMBER($B65),$B65>0,E65<>\"\"),formatMMSSHHtime(E65),\"\")","v":""},{"$f":"IF(AND(ISNUMBER($B65),$B65>0,F65<>\"\"),formatMMSSHHtime(F65),\"\")","v":""},{"$f":"IF(AND(ISNUMBER($B65),$B65>0,G65<>\"\"),formatMMSSHHtime(G65),\"\")","v":""},{"$f":"IF(AND(ISNUMBER($B65),$B65>0,H65<>\"\"),formatMMSSHHtime(H65),\"\")","v":""},{"$f":"IF(AND(ISNUMBER($B65),$B65>0,I65<>\"\"),formatMMSSHHtime(I65),\"\")","v":""},{"$f":"IF(AND(ISNUMBER($B65),$B65>0,J65<>\"\"),formatMMSSHHtime(J65),\"\")","v":""},{"$f":"IF(AND(ISNUMBER($B65),$B65>0,K65<>\"\"),formatMMSSHHtime(K65),\"\")","v":""},{"$f":"IF(AND(ISNUMBER($B65),$B65>0,L65<>\"\"),formatMMSSHHtime(L65),\"\")","v":""},{"$f":"IF(AND(ISNUMBER($B65),$B65>0,M65<>\"\"),formatMMSSHHtime(M65),\"\")","v":""},{"$f":"IF(AND(ISNUMBER($B65),$B65>0,N65<>\"\"),formatMMSSHHtime(N65),\"\")","v":""}]
["","",{"$f":"IF(AND(ISNUMBER(B66),B66>0),DATEDIF(INDEX(swimmers_data,B66,3),$C$8,\"Y\"),\"\")","v":""},{"$f":"IF(AND(ISNUMBER(B66),B66>0),INDEX(swimmers_data,B66,5),\"\")","v":""},null,null,null,null,null,null,null,null,null,null,null,null,null,null,{"$f":"IF(AND(ISNUMBER($B66),$B66>0,E66<>\"\"),INDEX(swimmers_data,$B66,5)&\",\"&INDEX(swimmers_data,$B66,1)&\",\"&INDEX(swimmers_data,$B66,2)&\",\"&INDEX(swimmers_data,$B66,4)&\",\"&TEXT(INDEX(swimmers_data,$B66,3),\"ddmmYy\")&\",\"&LEFT(\"000000\",6-LEN(E66))&E66&\",\"&S$11&\",\"&\"F\",\"\")","v":""},{"$f":"IF(AND(ISNUMBER($B66),$B66>0,F66<>\"\"),INDEX(swimmers_data,$B66,5)&\",\"&INDEX(swimmers_data,$B66,1)&\",\"&INDEX(swimmers_data,$B66,2)&\",\"&INDEX(swimmers_data,$B66,4)&\",\"&TEXT(INDEX(swimmers_data,$B66,3),\"ddmmYy\")&\",\"&LEFT(\"000000\",6-LEN(F66))&F66&\",\"&T$11&\",\"&\"F\",\"\")","v":""},{"$f":"IF(AND(ISNUMBER($B66),$B66>0,G66<>\"\"),INDEX(swimmers_data,$B66,5)&\",\"&INDEX(swimmers_data,$B66,1)&\",\"&INDEX(swimmers_data,$B66,2)&\",\"&INDEX(swimmers_data,$B66,4)&\",\"&TEXT(INDEX(swimmers_data,$B66,3),\"ddmmYy\")&\",\"&LEFT(\"000000\",6-LEN(G66))&G66&\",\"&U$11&\",\"&\"F\",\"\")","v":""},{"$f":"IF(AND(ISNUMBER($B66),$B66>0,H66<>\"\"),INDEX(swimmers_data,$B66,5)&\",\"&INDEX(swimmers_data,$B66,1)&\",\"&INDEX(swimmers_data,$B66,2)&\",\"&INDEX(swimmers_data,$B66,4)&\",\"&TEXT(INDEX(swimmers_data,$B66,3),\"ddmmYy\")&\",\"&LEFT(\"000000\",6-LEN(H66))&H66&\",\"&V$11&\",\"&\"F\",\"\")","v":""},{"$f":"IF(AND(ISNUMBER($B66),$B66>0,I66<>\"\"),INDEX(swimmers_data,$B66,5)&\",\"&INDEX(swimmers_data,$B66,1)&\",\"&INDEX(swimmers_data,$B66,2)&\",\"&INDEX(swimmers_data,$B66,4)&\",\"&TEXT(INDEX(swimmers_data,$B66,3),\"ddmmYy\")&\",\"&LEFT(\"000000\",6-LEN(I66))&I66&\",\"&W$11&\",\"&\"F\",\"\")","v":""},{"$f":"IF(AND(ISNUMBER($B66),$B66>0,J66<>\"\"),INDEX(swimmers_data,$B66,5)&\",\"&INDEX(swimmers_data,$B66,1)&\",\"&INDEX(swimmers_data,$B66,2)&\",\"&INDEX(swimmers_data,$B66,4)&\",\"&TEXT(INDEX(swimmers_data,$B66,3),\"ddmmYy\")&\",\"&LEFT(\"000000\",6-LEN(J66))&J66&\",\"&X$11&\",\"&\"F\",\"\")","v":""},{"$f":"IF(AND(ISNUMBER($B66),$B66>0,K66<>\"\"),INDEX(swimmers_data,$B66,5)&\",\"&INDEX(swimmers_data,$B66,1)&\",\"&INDEX(swimmers_data,$B66,2)&\",\"&INDEX(swimmers_data,$B66,4)&\",\"&TEXT(INDEX(swimmers_data,$B66,3),\"ddmmYy\")&\",\"&LEFT(\"000000\",6-LEN(K66))&K66&\",\"&Y$11&\",\"&\"F\",\"\")","v":""},{"$f":"IF(AND(ISNUMBER($B66),$B66>0,L66<>\"\"),INDEX(swimmers_data,$B66,5)&\",\"&INDEX(swimmers_data,$B66,1)&\",\"&INDEX(swimmers_data,$B66,2)&\",\"&INDEX(swimmers_data,$B66,4)&\",\"&TEXT(INDEX(swimmers_data,$B66,3),\"ddmmYy\")&\",\"&LEFT(\"000000\",6-LEN(L66))&L66&\",\"&Z$11&\",\"&\"F\",\"\")","v":""},{"$f":"IF(AND(ISNUMBER($B66),$B66>0,M66<>\"\"),INDEX(swimmers_data,$B66,5)&\",\"&INDEX(swimmers_data,$B66,1)&\",\"&INDEX(swimmers_data,$B66,2)&\",\"&INDEX(swimmers_data,$B66,4)&\",\"&TEXT(INDEX(swimmers_data,$B66,3),\"ddmmYy\")&\",\"&LEFT(\"000000\",6-LEN(M66))&M66&\",\"&AA$11&\",\"&\"F\",\"\")","v":""},{"$f":"IF(AND(ISNUMBER($B66),$B66>0,N66<>\"\"),INDEX(swimmers_data,$B66,5)&\",\"&INDEX(swimmers_data,$B66,1)&\",\"&INDEX(swimmers_data,$B66,2)&\",\"&INDEX(swimmers_data,$B66,4)&\",\"&TEXT(INDEX(swimmers_data,$B66,3),\"ddmmYy\")&\",\"&LEFT(\"000000\",6-LEN(N66))&N66&\",\"&AB$11&\",\"&\"F\",\"\")","v":""},null,null,"","","",{"$f":"IF(AND(ISNUMBER($B66),$B66>0,E66<>\"\"),formatMMSSHHtime(E66),\"\")","v":""},{"$f":"IF(AND(ISNUMBER($B66),$B66>0,F66<>\"\"),formatMMSSHHtime(F66),\"\")","v":""},{"$f":"IF(AND(ISNUMBER($B66),$B66>0,G66<>\"\"),formatMMSSHHtime(G66),\"\")","v":""},{"$f":"IF(AND(ISNUMBER($B66),$B66>0,H66<>\"\"),formatMMSSHHtime(H66),\"\")","v":""},{"$f":"IF(AND(ISNUMBER($B66),$B66>0,I66<>\"\"),formatMMSSHHtime(I66),\"\")","v":""},{"$f":"IF(AND(ISNUMBER($B66),$B66>0,J66<>\"\"),formatMMSSHHtime(J66),\"\")","v":""},{"$f":"IF(AND(ISNUMBER($B66),$B66>0,K66<>\"\"),formatMMSSHHtime(K66),\"\")","v":""},{"$f":"IF(AND(ISNUMBER($B66),$B66>0,L66<>\"\"),formatMMSSHHtime(L66),\"\")","v":""},{"$f":"IF(AND(ISNUMBER($B66),$B66>0,M66<>\"\"),formatMMSSHHtime(M66),\"\")","v":""},{"$f":"IF(AND(ISNUMBER($B66),$B66>0,N66<>\"\"),formatMMSSHHtime(N66),\"\")","v":""}]
["","",{"$f":"IF(AND(ISNUMBER(B67),B67>0),DATEDIF(INDEX(swimmers_data,B67,3),$C$8,\"Y\"),\"\")","v":""},{"$f":"IF(AND(ISNUMBER(B67),B67>0),INDEX(swimmers_data,B67,5),\"\")","v":""},null,null,null,null,null,null,null,null,null,null,null,null,null,null,{"$f":"IF(AND(ISNUMBER($B67),$B67>0,E67<>\"\"),INDEX(swimmers_data,$B67,5)&\",\"&INDEX(swimmers_data,$B67,1)&\",\"&INDEX(swimmers_data,$B67,2)&\",\"&INDEX(swimmers_data,$B67,4)&\",\"&TEXT(INDEX(swimmers_data,$B67,3),\"ddmmYy\")&\",\"&LEFT(\"000000\",6-LEN(E67))&E67&\",\"&S$11&\",\"&\"F\",\"\")","v":""},{"$f":"IF(AND(ISNUMBER($B67),$B67>0,F67<>\"\"),INDEX(swimmers_data,$B67,5)&\",\"&INDEX(swimmers_data,$B67,1)&\",\"&INDEX(swimmers_data,$B67,2)&\",\"&INDEX(swimmers_data,$B67,4)&\",\"&TEXT(INDEX(swimmers_data,$B67,3),\"ddmmYy\")&\",\"&LEFT(\"000000\",6-LEN(F67))&F67&\",\"&T$11&\",\"&\"F\",\"\")","v":""},{"$f":"IF(AND(ISNUMBER($B67),$B67>0,G67<>\"\"),INDEX(swimmers_data,$B67,5)&\",\"&INDEX(swimmers_data,$B67,1)&\",\"&INDEX(swimmers_data,$B67,2)&\",\"&INDEX(swimmers_data,$B67,4)&\",\"&TEXT(INDEX(swimmers_data,$B67,3),\"ddmmYy\")&\",\"&LEFT(\"000000\",6-LEN(G67))&G67&\",\"&U$11&\",\"&\"F\",\"\")","v":""},{"$f":"IF(AND(ISNUMBER($B67),$B67>0,H67<>\"\"),INDEX(swimmers_data,$B67,5)&\",\"&INDEX(swimmers_data,$B67,1)&\",\"&INDEX(swimmers_data,$B67,2)&\",\"&INDEX(swimmers_data,$B67,4)&\",\"&TEXT(INDEX(swimmers_data,$B67,3),\"ddmmYy\")&\",\"&LEFT(\"000000\",6-LEN(H67))&H67&\",\"&V$11&\",\"&\"F\",\"\")","v":""},{"$f":"IF(AND(ISNUMBER($B67),$B67>0,I67<>\"\"),INDEX(swimmers_data,$B67,5)&\",\"&INDEX(swimmers_data,$B67,1)&\",\"&INDEX(swimmers_data,$B67,2)&\",\"&INDEX(swimmers_data,$B67,4)&\",\"&TEXT(INDEX(swimmers_data,$B67,3),\"ddmmYy\")&\",\"&LEFT(\"000000\",6-LEN(I67))&I67&\",\"&W$11&\",\"&\"F\",\"\")","v":""},{"$f":"IF(AND(ISNUMBER($B67),$B67>0,J67<>\"\"),INDEX(swimmers_data,$B67,5)&\",\"&INDEX(swimmers_data,$B67,1)&\",\"&INDEX(swimmers_data,$B67,2)&\",\"&INDEX(swimmers_data,$B67,4)&\",\"&TEXT(INDEX(swimmers_data,$B67,3),\"ddmmYy\")&\",\"&LEFT(\"000000\",6-LEN(J67))&J67&\",\"&X$11&\",\"&\"F\",\"\")","v":""},{"$f":"IF(AND(ISNUMBER($B67),$B67>0,K67<>\"\"),INDEX(swimmers_data,$B67,5)&\",\"&INDEX(swimmers_data,$B67,1)&\",\"&INDEX(swimmers_data,$B67,2)&\",\"&INDEX(swimmers_data,$B67,4)&\",\"&TEXT(INDEX(swimmers_data,$B67,3),\"ddmmYy\")&\",\"&LEFT(\"000000\",6-LEN(K67))&K67&\",\"&Y$11&\",\"&\"F\",\"\")","v":""},{"$f":"IF(AND(ISNUMBER($B67),$B67>0,L67<>\"\"),INDEX(swimmers_data,$B67,5)&\",\"&INDEX(swimmers_data,$B67,1)&\",\"&INDEX(swimmers_data,$B67,2)&\",\"&INDEX(swimmers_data,$B67,4)&\",\"&TEXT(INDEX(swimmers_data,$B67,3),\"ddmmYy\")&\",\"&LEFT(\"000000\",6-LEN(L67))&L67&\",\"&Z$11&\",\"&\"F\",\"\")","v":""},{"$f":"IF(AND(ISNUMBER($B67),$B67>0,M67<>\"\"),INDEX(swimmers_data,$B67,5)&\",\"&INDEX(swimmers_data,$B67,1)&\",\"&INDEX(swimmers_data,$B67,2)&\",\"&INDEX(swimmers_data,$B67,4)&\",\"&TEXT(INDEX(swimmers_data,$B67,3),\"ddmmYy\")&\",\"&LEFT(\"000000\",6-LEN(M67))&M67&\",\"&AA$11&\",\"&\"F\",\"\")","v":""},{"$f":"IF(AND(ISNUMBER($B67),$B67>0,N67<>\"\"),INDEX(swimmers_data,$B67,5)&\",\"&INDEX(swimmers_data,$B67,1)&\",\"&INDEX(swimmers_data,$B67,2)&\",\"&INDEX(swimmers_data,$B67,4)&\",\"&TEXT(INDEX(swimmers_data,$B67,3),\"ddmmYy\")&\",\"&LEFT(\"000000\",6-LEN(N67))&N67&\",\"&AB$11&\",\"&\"F\",\"\")","v":""},null,null,"","","",{"$f":"IF(AND(ISNUMBER($B67),$B67>0,E67<>\"\"),formatMMSSHHtime(E67),\"\")","v":""},{"$f":"IF(AND(ISNUMBER($B67),$B67>0,F67<>\"\"),formatMMSSHHtime(F67),\"\")","v":""},{"$f":"IF(AND(ISNUMBER($B67),$B67>0,G67<>\"\"),formatMMSSHHtime(G67),\"\")","v":""},{"$f":"IF(AND(ISNUMBER($B67),$B67>0,H67<>\"\"),formatMMSSHHtime(H67),\"\")","v":""},{"$f":"IF(AND(ISNUMBER($B67),$B67>0,I67<>\"\"),formatMMSSHHtime(I67),\"\")","v":""},{"$f":"IF(AND(ISNUMBER($B67),$B67>0,J67<>\"\"),formatMMSSHHtime(J67),\"\")","v":""},{"$f":"IF(AND(ISNUMBER($B67),$B67>0,K67<>\"\"),formatMMSSHHtime(K67),\"\")","v":""},{"$f":"IF(AND(ISNUMBER($B67),$B67>0,L67<>\"\"),formatMMSSHHtime(L67),\"\")","v":""},{"$f":"IF(AND(ISNUMBER($B67),$B67>0,M67<>\"\"),formatMMSSHHtime(M67),\"\")","v":""},{"$f":"IF(AND(ISNUMBER($B67),$B67>0,N67<>\"\"),formatMMSSHHtime(N67),\"\")","v":""}]
["","",{"$f":"IF(AND(ISNUMBER(B68),B68>0),DATEDIF(INDEX(swimmers_data,B68,3),$C$8,\"Y\"),\"\")","v":""},{"$f":"IF(AND(ISNUMBER(B68),B68>0),INDEX(swimmers_data,B68,5),\"\")","v":""},null,null,null,null,null,null,null,null,null,null,null,null,null,null,{"$f":"IF(AND(ISNUMBER($B68),$B68>0,E68<>\"\"),INDEX(swimmers_data,$B68,5)&\",\"&INDEX(swimmers_data,$B68,1)&\",\"&INDEX(swimmers_data,$B68,2)&\",\"&INDEX(swimmers_data,$B68,4)&\",\"&TEXT(INDEX(swimmers_data,$B68,3),\"ddmmYy\")&\",\"&LEFT(\"000000\",6-LEN(E68))&E68&\",\"&S$11&\",\"&\"F\",\"\")","v":""},{"$f":"IF(AND(ISNUMBER($B68),$B68>0,F68<>\"\"),INDEX(swimmers_data,$B68,5)&\",\"&INDEX(swimmers_data,$B68,1)&\",\"&INDEX(swimmers_data,$B68,2)&\",\"&INDEX(swimmers_data,$B68,4)&\",\"&TEXT(INDEX(swimmers_data,$B68,3),\"ddmmYy\")&\",\"&LEFT(\"000000\",6-LEN(F68))&F68&\",\"&T$11&\",\"&\"F\",\"\")","v":""},{"$f":"IF(AND(ISNUMBER($B68),$B68>0,G68<>\"\"),INDEX(swimmers_data,$B68,5)&\",\"&INDEX(swimmers_data,$B68,1)&\",\"&INDEX(swimmers_data,$B68,2)&\",\"&INDEX(swimmers_data,$B68,4)&\",\"&TEXT(INDEX(swimmers_data,$B68,3),\"ddmmYy\")&\",\"&LEFT(\"000000\",6-LEN(G68))&G68&\",\"&U$11&\",\"&\"F\",\"\")","v":""},{"$f":"IF(AND(ISNUMBER($B68),$B68>0,H68<>\"\"),INDEX(swimmers_data,$B68,5)&\",\"&INDEX(swimmers_data,$B68,1)&\",\"&INDEX(swimmers_data,$B68,2)&\",\"&INDEX(swimmers_data,$B68,4)&\",\"&TEXT(INDEX(swimmers_data,$B68,3),\"ddmmYy\")&\",\"&LEFT(\"000000\",6-LEN(H68))&H68&\",\"&V$11&\",\"&\"F\",\"\")","v":""},{"$f":"IF(AND(ISNUMBER($B68),$B68>0,I68<>\"\"),INDEX(swimmers_data,$B68,5)&\",\"&INDEX(swimmers_data,$B68,1)&\",\"&INDEX(swimmers_data,$B68,2)&\",\"&INDEX(swimmers_data,$B68,4)&\",\"&TEXT(INDEX(swimmers_data,$B68,3),\"ddmmYy\")&\",\"&LEFT(\"000000\",6-LEN(I68))&I68&\",\"&W$11&\",\"&\"F\",\"\")","v":""},{"$f":"IF(AND(ISNUMBER($B68),$B68>0,J68<>\"\"),INDEX(swimmers_data,$B68,5)&\",\"&INDEX(swimmers_data,$B68,1)&\",\"&INDEX(swimmers_data,$B68,2)&\",\"&INDEX(swimmers_data,$B68,4)&\",\"&TEXT(INDEX(swimmers_data,$B68,3),\"ddmmYy\")&\",\"&LEFT(\"000000\",6-LEN(J68))&J68&\",\"&X$11&\",\"&\"F\",\"\")","v":""},{"$f":"IF(AND(ISNUMBER($B68),$B68>0,K68<>\"\"),INDEX(swimmers_data,$B68,5)&\",\"&INDEX(swimmers_data,$B68,1)&\",\"&INDEX(swimmers_data,$B68,2)&\",\"&INDEX(swimmers_data,$B68,4)&\",\"&TEXT(INDEX(swimmers_data,$B68,3),\"ddmmYy\")&\",\"&LEFT(\"000000\",6-LEN(K68))&K68&\",\"&Y$11&\",\"&\"F\",\"\")","v":""},{"$f":"IF(AND(ISNUMBER($B68),$B68>0,L68<>\"\"),INDEX(swimmers_data,$B68,5)&\",\"&INDEX(swimmers_data,$B68,1)&\",\"&INDEX(swimmers_data,$B68,2)&\",\"&INDEX(swimmers_data,$B68,4)&\",\"&TEXT(INDEX(swimmers_data,$B68,3),\"ddmmYy\")&\",\"&LEFT(\"000000\",6-LEN(L68))&L68&\",\"&Z$11&\",\"&\"F\",\"\")","v":""},{"$f":"IF(AND(ISNUMBER($B68),$B68>0,M68<>\"\"),INDEX(swimmers_data,$B68,5)&\",\"&INDEX(swimmers_data,$B68,1)&\",\"&INDEX(swimmers_data,$B68,2)&\",\"&INDEX(swimmers_data,$B68,4)&\",\"&TEXT(INDEX(swimmers_data,$B68,3),\"ddmmYy\")&\",\"&LEFT(\"000000\",6-LEN(M68))&M68&\",\"&AA$11&\",\"&\"F\",\"\")","v":""},{"$f":"IF(AND(ISNUMBER($B68),$B68>0,N68<>\"\"),INDEX(swimmers_data,$B68,5)&\",\"&INDEX(swimmers_data,$B68,1)&\",\"&INDEX(swimmers_data,$B68,2)&\",\"&INDEX(swimmers_data,$B68,4)&\",\"&TEXT(INDEX(swimmers_data,$B68,3),\"ddmmYy\")&\",\"&LEFT(\"000000\",6-LEN(N68))&N68&\",\"&AB$11&\",\"&\"F\",\"\")","v":""},null,null,"","","",{"$f":"IF(AND(ISNUMBER($B68),$B68>0,E68<>\"\"),formatMMSSHHtime(E68),\"\")","v":""},{"$f":"IF(AND(ISNUMBER($B68),$B68>0,F68<>\"\"),formatMMSSHHtime(F68),\"\")","v":""},{"$f":"IF(AND(ISNUMBER($B68),$B68>0,G68<>\"\"),formatMMSSHHtime(G68),\"\")","v":""},{"$f":"IF(AND(ISNUMBER($B68),$B68>0,H68<>\"\"),formatMMSSHHtime(H68),\"\")","v":""},{"$f":"IF(AND(ISNUMBER($B68),$B68>0,I68<>\"\"),formatMMSSHHtime(I68),\"\")","v":""},{"$f":"IF(AND(ISNUMBER($B68),$B68>0,J68<>\"\"),formatMMSSHHtime(J68),\"\")","v":""},{"$f":"IF(AND(ISNUMBER($B68),$B68>0,K68<>\"\"),formatMMSSHHtime(K68),\"\")","v":""},{"$f":"IF(AND(ISNUMBER($B68),$B68>0,L68<>\"\"),formatMMSSHHtime(L68),\"\")","v":""},{"$f":"IF(AND(ISNUMBER($B68),$B68>0,M68<>\"\"),formatMMSSHHtime(M68),\"\")","v":""},{"$f":"IF(AND(ISNUMBER($B68),$B68>0,N68<>\"\"),formatMMSSHHtime(N68),\"\")","v":""}]
["","",{"$f":"IF(AND(ISNUMBER(B69),B69>0),DATEDIF(INDEX(swimmers_data,B69,3),$C$8,\"Y\"),\"\")","v":""},{"$f":"IF(AND(ISNUMBER(B69),B69>0),INDEX(swimmers_data,B69,5),\"\")","v":""},null,null,null,null,null,null,null,null,null,null,null,null,null,null,{"$f":"IF(AND(ISNUMBER($B69),$B69>0,E69<>\"\"),INDEX(swimmers_data,$B69,5)&\",\"&INDEX(swimmers_data,$B69,1)&\",\"&INDEX(swimmers_data,$B69,2)&\",\"&INDEX(swimmers_data,$B69,4)&\",\"&TEXT(INDEX(swimmers_data,$B69,3),\"ddmmYy\")&\",\"&LEFT(\"000000\",6-LEN(E69))&E69&\",\"&S$11&\",\"&\"F\",\"\")","v":""},{"$f":"IF(AND(ISNUMBER($B69),$B69>0,F69<>\"\"),INDEX(swimmers_data,$B69,5)&\",\"&INDEX(swimmers_data,$B69,1)&\",\"&INDEX(swimmers_data,$B69,2)&\",\"&INDEX(swimmers_data,$B69,4)&\",\"&TEXT(INDEX(swimmers_data,$B69,3),\"ddmmYy\")&\",\"&LEFT(\"000000\",6-LEN(F69))&F69&\",\"&T$11&\",\"&\"F\",\"\")","v":""},{"$f":"IF(AND(ISNUMBER($B69),$B69>0,G69<>\"\"),INDEX(swimmers_data,$B69,5)&\",\"&INDEX(swimmers_data,$B69,1)&\",\"&INDEX(swimmers_data,$B69,2)&\",\"&INDEX(swimmers_data,$B69,4)&\",\"&TEXT(INDEX(swimmers_data,$B69,3),\"ddmmYy\")&\",\"&LEFT(\"000000\",6-LEN(G69))&G69&\",\"&U$11&\",\"&\"F\",\"\")","v":""},{"$f":"IF(AND(ISNUMBER($B69),$B69>0,H69<>\"\"),INDEX(swimmers_data,$B69,5)&\",\"&INDEX(swimmers_data,$B69,1)&\",\"&INDEX(swimmers_data,$B69,2)&\",\"&INDEX(swimmers_data,$B69,4)&\",\"&TEXT(INDEX(swimmers_data,$B69,3),\"ddmmYy\")&\",\"&LEFT(\"000000\",6-LEN(H69))&H69&\",\"&V$11&\",\"&\"F\",\"\")","v":""},{"$f":"IF(AND(ISNUMBER($B69),$B69>0,I69<>\"\"),INDEX(swimmers_data,$B69,5)&\",\"&INDEX(swimmers_data,$B69,1)&\",\"&INDEX(swimmers_data,$B69,2)&\",\"&INDEX(swimmers_data,$B69,4)&\",\"&TEXT(INDEX(swimmers_data,$B69,3),\"ddmmYy\")&\",\"&LEFT(\"000000\",6-LEN(I69))&I69&\",\"&W$11&\",\"&\"F\",\"\")","v":""},{"$f":"IF(AND(ISNUMBER($B69),$B69>0,J69<>\"\"),INDEX(swimmers_data,$B69,5)&\",\"&INDEX(swimmers_data,$B69,1)&\",\"&INDEX(swimmers_data,$B69,2)&\",\"&INDEX(swimmers_data,$B69,4)&\",\"&TEXT(INDEX(swimmers_data,$B69,3),\"ddmmYy\")&\",\"&LEFT(\"000000\",6-LEN(J69))&J69&\",\"&X$11&\",\"&\"F\",\"\")","v":""},{"$f":"IF(AND(ISNUMBER($B69),$B69>0,K69<>\"\"),INDEX(swimmers_data,$B69,5)&\",\"&INDEX(swimmers_data,$B69,1)&\",\"&INDEX(swimmers_data,$B69,2)&\",\"&INDEX(swimmers_data,$B69,4)&\",\"&TEXT(INDEX(swimmers_data,$B69,3),\"ddmmYy\")&\",\"&LEFT(\"000000\",6-LEN(K69))&K69&\",\"&Y$11&\",\"&\"F\",\"\")","v":""},{"$f":"IF(AND(ISNUMBER($B69),$B69>0,L69<>\"\"),INDEX(swimmers_data,$B69,5)&\",\"&INDEX(swimmers_data,$B69,1)&\",\"&INDEX(swimmers_data,$B69,2)&\",\"&INDEX(swimmers_data,$B69,4)&\",\"&TEXT(INDEX(swimmers_data,$B69,3),\"ddmmYy\")&\",\"&LEFT(\"000000\",6-LEN(L69))&L69&\",\"&Z$11&\",\"&\"F\",\"\")","v":""},{"$f":"IF(AND(ISNUMBER($B69),$B69>0,M69<>\"\"),INDEX(swimmers_data,$B69,5)&\",\"&INDEX(swimmers_data,$B69,1)&\",\"&INDEX(swimmers_data,$B69,2)&\",\"&INDEX(swimmers_data,$B69,4)&\",\"&TEXT(INDEX(swimmers_data,$B69,3),\"ddmmYy\")&\",\"&LEFT(\"000000\",6-LEN(M69))&M69&\",\"&AA$11&\",\"&\"F\",\"\")","v":""},{"$f":"IF(AND(ISNUMBER($B69),$B69>0,N69<>\"\"),INDEX(swimmers_data,$B69,5)&\",\"&INDEX(swimmers_data,$B69,1)&\",\"&INDEX(swimmers_data,$B69,2)&\",\"&INDEX(swimmers_data,$B69,4)&\",\"&TEXT(INDEX(swimmers_data,$B69,3),\"ddmmYy\")&\",\"&LEFT(\"000000\",6-LEN(N69))&N69&\",\"&AB$11&\",\"&\"F\",\"\")","v":""},null,null,"","","",{"$f":"IF(AND(ISNUMBER($B69),$B69>0,E69<>\"\"),formatMMSSHHtime(E69),\"\")","v":""},{"$f":"IF(AND(ISNUMBER($B69),$B69>0,F69<>\"\"),formatMMSSHHtime(F69),\"\")","v":""},{"$f":"IF(AND(ISNUMBER($B69),$B69>0,G69<>\"\"),formatMMSSHHtime(G69),\"\")","v":""},{"$f":"IF(AND(ISNUMBER($B69),$B69>0,H69<>\"\"),formatMMSSHHtime(H69),\"\")","v":""},{"$f":"IF(AND(ISNUMBER($B69),$B69>0,I69<>\"\"),formatMMSSHHtime(I69),\"\")","v":""},{"$f":"IF(AND(ISNUMBER($B69),$B69>0,J69<>\"\"),formatMMSSHHtime(J69),\"\")","v":""},{"$f":"IF(AND(ISNUMBER($B69),$B69>0,K69<>\"\"),formatMMSSHHtime(K69),\"\")","v":""},{"$f":"IF(AND(ISNUMBER($B69),$B69>0,L69<>\"\"),formatMMSSHHtime(L69),\"\")","v":""},{"$f":"IF(AND(ISNUMBER($B69),$B69>0,M69<>\"\"),formatMMSSHHtime(M69),\"\")","v":""},{"$f":"IF(AND(ISNUMBER($B69),$B69>0,N69<>\"\"),formatMMSSHHtime(N69),\"\")","v":""}]
["","",{"$f":"IF(AND(ISNUMBER(B70),B70>0),DATEDIF(INDEX(swimmers_data,B70,3),$C$8,\"Y\"),\"\")","v":""},{"$f":"IF(AND(ISNUMBER(B70),B70>0),INDEX(swimmers_data,B70,5),\"\")","v":""},null,null,null,null,null,null,null,null,null,null,null,null,null,null,{"$f":"IF(AND(ISNUMBER($B70),$B70>0,E70<>\"\"),INDEX(swimmers_data,$B70,5)&\",\"&INDEX(swimmers_data,$B70,1)&\",\"&INDEX(swimmers_data,$B70,2)&\",\"&INDEX(swimmers_data,$B70,4)&\",\"&TEXT(INDEX(swimmers_data,$B70,3),\"ddmmYy\")&\",\"&LEFT(\"000000\",6-LEN(E70))&E70&\",\"&S$11&\",\"&\"F\",\"\")","v":""},{"$f":"IF(AND(ISNUMBER($B70),$B70>0,F70<>\"\"),INDEX(swimmers_data,$B70,5)&\",\"&INDEX(swimmers_data,$B70,1)&\",\"&INDEX(swimmers_data,$B70,2)&\",\"&INDEX(swimmers_data,$B70,4)&\",\"&TEXT(INDEX(swimmers_data,$B70,3),\"ddmmYy\")&\",\"&LEFT(\"000000\",6-LEN(F70))&F70&\",\"&T$11&\",\"&\"F\",\"\")","v":""},{"$f":"IF(AND(ISNUMBER($B70),$B70>0,G70<>\"\"),INDEX(swimmers_data,$B70,5)&\",\"&INDEX(swimmers_data,$B70,1)&\",\"&INDEX(swimmers_data,$B70,2)&\",\"&INDEX(swimmers_data,$B70,4)&\",\"&TEXT(INDEX(swimmers_data,$B70,3),\"ddmmYy\")&\",\"&LEFT(\"000000\",6-LEN(G70))&G70&\",\"&U$11&\",\"&\"F\",\"\")","v":""},{"$f":"IF(AND(ISNUMBER($B70),$B70>0,H70<>\"\"),INDEX(swimmers_data,$B70,5)&\",\"&INDEX(swimmers_data,$B70,1)&\",\"&INDEX(swimmers_data,$B70,2)&\",\"&INDEX(swimmers_data,$B70,4)&\",\"&TEXT(INDEX(swimmers_data,$B70,3),\"ddmmYy\")&\",\"&LEFT(\"000000\",6-LEN(H70))&H70&\",\"&V$11&\",\"&\"F\",\"\")","v":""},{"$f":"IF(AND(ISNUMBER($B70),$B70>0,I70<>\"\"),INDEX(swimmers_data,$B70,5)&\",\"&INDEX(swimmers_data,$B70,1)&\",\"&INDEX(swimmers_data,$B70,2)&\",\"&INDEX(swimmers_data,$B70,4)&\",\"&TEXT(INDEX(swimmers_data,$B70,3),\"ddmmYy\")&\",\"&LEFT(\"000000\",6-LEN(I70))&I70&\",\"&W$11&\",\"&\"F\",\"\")","v":""},{"$f":"IF(AND(ISNUMBER($B70),$B70>0,J70<>\"\"),INDEX(swimmers_data,$B70,5)&\",\"&INDEX(swimmers_data,$B70,1)&\",\"&INDEX(swimmers_data,$B70,2)&\",\"&INDEX(swimmers_data,$B70,4)&\",\"&TEXT(INDEX(swimmers_data,$B70,3),\"ddmmYy\")&\",\"&LEFT(\"000000\",6-LEN(J70))&J70&\",\"&X$11&\",\"&\"F\",\"\")","v":""},{"$f":"IF(AND(ISNUMBER($B70),$B70>0,K70<>\"\"),INDEX(swimmers_data,$B70,5)&\",\"&INDEX(swimmers_data,$B70,1)&\",\"&INDEX(swimmers_data,$B70,2)&\",\"&INDEX(swimmers_data,$B70,4)&\",\"&TEXT(INDEX(swimmers_data,$B70,3),\"ddmmYy\")&\",\"&LEFT(\"000000\",6-LEN(K70))&K70&\",\"&Y$11&\",\"&\"F\",\"\")","v":""},{"$f":"IF(AND(ISNUMBER($B70),$B70>0,L70<>\"\"),INDEX(swimmers_data,$B70,5)&\",\"&INDEX(swimmers_data,$B70,1)&\",\"&INDEX(swimmers_data,$B70,2)&\",\"&INDEX(swimmers_data,$B70,4)&\",\"&TEXT(INDEX(swimmers_data,$B70,3),\"ddmmYy\")&\",\"&LEFT(\"000000\",6-LEN(L70))&L70&\",\"&Z$11&\",\"&\"F\",\"\")","v":""},{"$f":"IF(AND(ISNUMBER($B70),$B70>0,M70<>\"\"),INDEX(swimmers_data,$B70,5)&\",\"&INDEX(swimmers_data,$B70,1)&\",\"&INDEX(swimmers_data,$B70,2)&\",\"&INDEX(swimmers_data,$B70,4)&\",\"&TEXT(INDEX(swimmers_data,$B70,3),\"ddmmYy\")&\",\"&LEFT(\"000000\",6-LEN(M70))&M70&\",\"&AA$11&\",\"&\"F\",\"\")","v":""},{"$f":"IF(AND(ISNUMBER($B70),$B70>0,N70<>\"\"),INDEX(swimmers_data,$B70,5)&\",\"&INDEX(swimmers_data,$B70,1)&\",\"&INDEX(swimmers_data,$B70,2)&\",\"&INDEX(swimmers_data,$B70,4)&\",\"&TEXT(INDEX(swimmers_data,$B70,3),\"ddmmYy\")&\",\"&LEFT(\"000000\",6-LEN(N70))&N70&\",\"&AB$11&\",\"&\"F\",\"\")","v":""},null,null,"","","",{"$f":"IF(AND(ISNUMBER($B70),$B70>0,E70<>\"\"),formatMMSSHHtime(E70),\"\")","v":""},{"$f":"IF(AND(ISNUMBER($B70),$B70>0,F70<>\"\"),formatMMSSHHtime(F70),\"\")","v":""},{"$f":"IF(AND(ISNUMBER($B70),$B70>0,G70<>\"\"),formatMMSSHHtime(G70),\"\")","v":""},{"$f":"IF(AND(ISNUMBER($B70),$B70>0,H70<>\"\"),formatMMSSHHtime(H70),\"\")","v":""},{"$f":"IF(AND(ISNUMBER($B70),$B70>0,I70<>\"\"),formatMMSSHHtime(I70),\"\")","v":""},{"$f":"IF(AND(ISNUMBER($B70),$B70>0,J70<>\"\"),formatMMSSHHtime(J70),\"\")","v":""},{"$f":"IF(AND(ISNUMBER($B70),$B70>0,K70<>\"\"),formatMMSSHHtime(K70),\"\")","v":""},{"$f":"IF(AND(ISNUMBER($B70),$B70>0,L70<>\"\"),formatMMSSHHtime(L70),\"\")","v":""},{"$f":"IF(AND(ISNUMBER($B70),$B70>0,M70<>\"\"),formatMMSSHHtime(M70),\"\")","v":""},{"$f":"IF(AND(ISNUMBER($B70),$B70>0,N70<>\"\"),formatMMSSHHtime(N70),\"\")","v":""}]
["","",{"$f":"IF(AND(ISNUMBER(B71),B71>0),DATEDIF(INDEX(swimmers_data,B71,3),$C$8,\"Y\"),\"\")","v":""},{"$f":"IF(AND(ISNUMBER(B71),B71>0),INDEX(swimmers_data,B71,5),\"\")","v":""},null,null,null,null,null,null,null,null,null,null,null,null,null,null,{"$f":"IF(AND(ISNUMBER($B71),$B71>0,E71<>\"\"),INDEX(swimmers_data,$B71,5)&\",\"&INDEX(swimmers_data,$B71,1)&\",\"&INDEX(swimmers_data,$B71,2)&\",\"&INDEX(swimmers_data,$B71,4)&\",\"&TEXT(INDEX(swimmers_data,$B71,3),\"ddmmYy\")&\",\"&LEFT(\"000000\",6-LEN(E71))&E71&\",\"&S$11&\",\"&\"F\",\"\")","v":""},{"$f":"IF(AND(ISNUMBER($B71),$B71>0,F71<>\"\"),INDEX(swimmers_data,$B71,5)&\",\"&INDEX(swimmers_data,$B71,1)&\",\"&INDEX(swimmers_data,$B71,2)&\",\"&INDEX(swimmers_data,$B71,4)&\",\"&TEXT(INDEX(swimmers_data,$B71,3),\"ddmmYy\")&\",\"&LEFT(\"000000\",6-LEN(F71))&F71&\",\"&T$11&\",\"&\"F\",\"\")","v":""},{"$f":"IF(AND(ISNUMBER($B71),$B71>0,G71<>\"\"),INDEX(swimmers_data,$B71,5)&\",\"&INDEX(swimmers_data,$B71,1)&\",\"&INDEX(swimmers_data,$B71,2)&\",\"&INDEX(swimmers_data,$B71,4)&\",\"&TEXT(INDEX(swimmers_data,$B71,3),\"ddmmYy\")&\",\"&LEFT(\"000000\",6-LEN(G71))&G71&\",\"&U$11&\",\"&\"F\",\"\")","v":""},{"$f":"IF(AND(ISNUMBER($B71),$B71>0,H71<>\"\"),INDEX(swimmers_data,$B71,5)&\",\"&INDEX(swimmers_data,$B71,1)&\",\"&INDEX(swimmers_data,$B71,2)&\",\"&INDEX(swimmers_data,$B71,4)&\",\"&TEXT(INDEX(swimmers_data,$B71,3),\"ddmmYy\")&\",\"&LEFT(\"000000\",6-LEN(H71))&H71&\",\"&V$11&\",\"&\"F\",\"\")","v":""},{"$f":"IF(AND(ISNUMBER($B71),$B71>0,I71<>\"\"),INDEX(swimmers_data,$B71,5)&\",\"&INDEX(swimmers_data,$B71,1)&\",\"&INDEX(swimmers_data,$B71,2)&\",\"&INDEX(swimmers_data,$B71,4)&\",\"&TEXT(INDEX(swimmers_data,$B71,3),\"ddmmYy\")&\",\"&LEFT(\"000000\",6-LEN(I71))&I71&\",\"&W$11&\",\"&\"F\",\"\")","v":""},{"$f":"IF(AND(ISNUMBER($B71),$B71>0,J71<>\"\"),INDEX(swimmers_data,$B71,5)&\",\"&INDEX(swimmers_data,$B71,1)&\",\"&INDEX(swimmers_data,$B71,2)&\",\"&INDEX(swimmers_data,$B71,4)&\",\"&TEXT(INDEX(swimmers_data,$B71,3),\"ddmmYy\")&\",\"&LEFT(\"000000\",6-LEN(J71))&J71&\",\"&X$11&\",\"&\"F\",\"\")","v":""},{"$f":"IF(AND(ISNUMBER($B71),$B71>0,K71<>\"\"),INDEX(swimmers_data,$B71,5)&\",\"&INDEX(swimmers_data,$B71,1)&\",\"&INDEX(swimmers_data,$B71,2)&\",\"&INDEX(swimmers_data,$B71,4)&\",\"&TEXT(INDEX(swimmers_data,$B71,3),\"ddmmYy\")&\",\"&LEFT(\"000000\",6-LEN(K71))&K71&\",\"&Y$11&\",\"&\"F\",\"\")","v":""},{"$f":"IF(AND(ISNUMBER($B71),$B71>0,L71<>\"\"),INDEX(swimmers_data,$B71,5)&\",\"&INDEX(swimmers_data,$B71,1)&\",\"&INDEX(swimmers_data,$B71,2)&\",\"&INDEX(swimmers_data,$B71,4)&\",\"&TEXT(INDEX(swimmers_data,$B71,3),\"ddmmYy\")&\",\"&LEFT(\"000000\",6-LEN(L71))&L71&\",\"&Z$11&\",\"&\"F\",\"\")","v":""},{"$f":"IF(AND(ISNUMBER($B71),$B71>0,M71<>\"\"),INDEX(swimmers_data,$B71,5)&\",\"&INDEX(swimmers_data,$B71,1)&\",\"&INDEX(swimmers_data,$B71,2)&\",\"&INDEX(swimmers_data,$B71,4)&\",\"&TEXT(INDEX(swimmers_data,$B71,3),\"ddmmYy\")&\",\"&LEFT(\"000000\",6-LEN(M71))&M71&\",\"&AA$11&\",\"&\"F\",\"\")","v":""},{"$f":"IF(AND(ISNUMBER($B71),$B71>0,N71<>\"\"),INDEX(swimmers_data,$B71,5)&\",\"&INDEX(swimmers_data,$B71,1)&\",\"&INDEX(swimmers_data,$B71,2)&\",\"&INDEX(swimmers_data,$B71,4)&\",\"&TEXT(INDEX(swimmers_data,$B71,3),\"ddmmYy\")&\",\"&LEFT(\"000000\",6-LEN(N71))&N71&\",\"&AB$11&\",\"&\"F\",\"\")","v":""},null,null,"","","",{"$f":"IF(AND(ISNUMBER($B71),$B71>0,E71<>\"\"),formatMMSSHHtime(E71),\"\")","v":""},{"$f":"IF(AND(ISNUMBER($B71),$B71>0,F71<>\"\"),formatMMSSHHtime(F71),\"\")","v":""},{"$f":"IF(AND(ISNUMBER($B71),$B71>0,G71<>\"\"),formatMMSSHHtime(G71),\"\")","v":""},{"$f":"IF(AND(ISNUMBER($B71),$B71>0,H71<>\"\"),formatMMSSHHtime(H71),\"\")","v":""},{"$f":"IF(AND(ISNUMBER($B71),$B71>0,I71<>\"\"),formatMMSSHHtime(I71),\"\")","v":""},{"$f":"IF(AND(ISNUMBER($B71),$B71>0,J71<>\"\"),formatMMSSHHtime(J71),\"\")","v":""},{"$f":"IF(AND(ISNUMBER($B71),$B71>0,K71<>\"\"),formatMMSSHHtime(K71),\"\")","v":""},{"$f":"IF(AND(ISNUMBER($B71),$B71>0,L71<>\"\"),formatMMSSHHtime(L71),\"\")","v":""},{"$f":"IF(AND(ISNUMBER($B71),$B71>0,M71<>\"\"),formatMMSSHHtime(M71),\"\")","v":""},{"$f":"IF(AND(ISNUMBER($B71),$B71>0,N71<>\"\"),formatMMSSHHtime(N71),\"\")","v":""}]
["","",{"$f":"IF(AND(ISNUMBER(B72),B72>0),DATEDIF(INDEX(swimmers_data,B72,3),$C$8,\"Y\"),\"\")","v":""},{"$f":"IF(AND(ISNUMBER(B72),B72>0),INDEX(swimmers_data,B72,5),\"\")","v":""},null,null,null,null,null,null,null,null,null,null,null,null,null,null,{"$f":"IF(AND(ISNUMBER($B72),$B72>0,E72<>\"\"),INDEX(swimmers_data,$B72,5)&\",\"&INDEX(swimmers_data,$B72,1)&\",\"&INDEX(swimmers_data,$B72,2)&\",\"&INDEX(swimmers_data,$B72,4)&\",\"&TEXT(INDEX(swimmers_data,$B72,3),\"ddmmYy\")&\",\"&LEFT(\"000000\",6-LEN(E72))&E72&\",\"&S$11&\",\"&\"F\",\"\")","v":""},{"$f":"IF(AND(ISNUMBER($B72),$B72>0,F72<>\"\"),INDEX(swimmers_data,$B72,5)&\",\"&INDEX(swimmers_data,$B72,1)&\",\"&INDEX(swimmers_data,$B72,2)&\",\"&INDEX(swimmers_data,$B72,4)&\",\"&TEXT(INDEX(swimmers_data,$B72,3),\"ddmmYy\")&\",\"&LEFT(\"000000\",6-LEN(F72))&F72&\",\"&T$11&\",\"&\"F\",\"\")","v":""},{"$f":"IF(AND(ISNUMBER($B72),$B72>0,G72<>\"\"),INDEX(swimmers_data,$B72,5)&\",\"&INDEX(swimmers_data,$B72,1)&\",\"&INDEX(swimmers_data,$B72,2)&\",\"&INDEX(swimmers_data,$B72,4)&\",\"&TEXT(INDEX(swimmers_data,$B72,3),\"ddmmYy\")&\",\"&LEFT(\"000000\",6-LEN(G72))&G72&\",\"&U$11&\",\"&\"F\",\"\")","v":""},{"$f":"IF(AND(ISNUMBER($B72),$B72>0,H72<>\"\"),INDEX(swimmers_data,$B72,5)&\",\"&INDEX(swimmers_data,$B72,1)&\",\"&INDEX(swimmers_data,$B72,2)&\",\"&INDEX(swimmers_data,$B72,4)&\",\"&TEXT(INDEX(swimmers_data,$B72,3),\"ddmmYy\")&\",\"&LEFT(\"000000\",6-LEN(H72))&H72&\",\"&V$11&\",\"&\"F\",\"\")","v":""},{"$f":"IF(AND(ISNUMBER($B72),$B72>0,I72<>\"\"),INDEX(swimmers_data,$B72,5)&\",\"&INDEX(swimmers_data,$B72,1)&\",\"&INDEX(swimmers_data,$B72,2)&\",\"&INDEX(swimmers_data,$B72,4)&\",\"&TEXT(INDEX(swimmers_data,$B72,3),\"ddmmYy\")&\",\"&LEFT(\"000000\",6-LEN(I72))&I72&\",\"&W$11&\",\"&\"F\",\"\")","v":""},{"$f":"IF(AND(ISNUMBER($B72),$B72>0,J72<>\"\"),INDEX(swimmers_data,$B72,5)&\",\"&INDEX(swimmers_data,$B72,1)&\",\"&INDEX(swimmers_data,$B72,2)&\",\"&INDEX(swimmers_data,$B72,4)&\",\"&TEXT(INDEX(swimmers_data,$B72,3),\"ddmmYy\")&\",\"&LEFT(\"000000\",6-LEN(J72))&J72&\",\"&X$11&\",\"&\"F\",\"\")","v":""},{"$f":"IF(AND(ISNUMBER($B72),$B72>0,K72<>\"\"),INDEX(swimmers_data,$B72,5)&\",\"&INDEX(swimmers_data,$B72,1)&\",\"&INDEX(swimmers_data,$B72,2)&\",\"&INDEX(swimmers_data,$B72,4)&\",\"&TEXT(INDEX(swimmers_data,$B72,3),\"ddmmYy\")&\",\"&LEFT(\"000000\",6-LEN(K72))&K72&\",\"&Y$11&\",\"&\"F\",\"\")","v":""},{"$f":"IF(AND(ISNUMBER($B72),$B72>0,L72<>\"\"),INDEX(swimmers_data,$B72,5)&\",\"&INDEX(swimmers_data,$B72,1)&\",\"&INDEX(swimmers_data,$B72,2)&\",\"&INDEX(swimmers_data,$B72,4)&\",\"&TEXT(INDEX(swimmers_data,$B72,3),\"ddmmYy\")&\",\"&LEFT(\"000000\",6-LEN(L72))&L72&\",\"&Z$11&\",\"&\"F\",\"\")","v":""},{"$f":"IF(AND(ISNUMBER($B72),$B72>0,M72<>\"\"),INDEX(swimmers_data,$B72,5)&\",\"&INDEX(swimmers_data,$B72,1)&\",\"&INDEX(swimmers_data,$B72,2)&\",\"&INDEX(swimmers_data,$B72,4)&\",\"&TEXT(INDEX(swimmers_data,$B72,3),\"ddmmYy\")&\",\"&LEFT(\"000000\",6-LEN(M72))&M72&\",\"&AA$11&\",\"&\"F\",\"\")","v":""},{"$f":"IF(AND(ISNUMBER($B72),$B72>0,N72<>\"\"),INDEX(swimmers_data,$B72,5)&\",\"&INDEX(swimmers_data,$B72,1)&\",\"&INDEX(swimmers_data,$B72,2)&\",\"&INDEX(swimmers_data,$B72,4)&\",\"&TEXT(INDEX(swimmers_data,$B72,3),\"ddmmYy\")&\",\"&LEFT(\"000000\",6-LEN(N72))&N72&\",\"&AB$11&\",\"&\"F\",\"\")","v":""},null,null,"","","",{"$f":"IF(AND(ISNUMBER($B72),$B72>0,E72<>\"\"),formatMMSSHHtime(E72),\"\")","v":""},{"$f":"IF(AND(ISNUMBER($B72),$B72>0,F72<>\"\"),formatMMSSHHtime(F72),\"\")","v":""},{"$f":"IF(AND(ISNUMBER($B72),$B72>0,G72<>\"\"),formatMMSSHHtime(G72),\"\")","v":""},{"$f":"IF(AND(ISNUMBER($B72),$B72>0,H72<>\"\"),formatMMSSHHtime(H72),\"\")","v":""},{"$f":"IF(AND(ISNUMBER($B72),$B72>0,I72<>\"\"),formatMMSSHHtime(I72),\"\")","v":""},{"$f":"IF(AND(ISNUMBER($B72),$B72>0,J72<>\"\"),formatMMSSHHtime(J72),\"\")","v":""},{"$f":"IF(AND(ISNUMBER($B72),$B72>0,K72<>\"\"),formatMMSSHHtime(K72),\"\")","v":""},{"$f":"IF(AND(ISNUMBER($B72),$B72>0,L72<>\"\"),formatMMSSHHtime(L72),\"\")","v":""},{"$f":"IF(AND(ISNUMBER($B72),$B72>0,M72<>\"\"),formatMMSSHHtime(M72),\"\")","v":""},{"$f":"IF(AND(ISNUMBER($B72),$B72>0,N72<>\"\"),formatMMSSHHtime(N72),\"\")","v":""}]
["","",{"$f":"IF(AND(ISNUMBER(B73),B73>0),DATEDIF(INDEX(swimmers_data,B73,3),$C$8,\"Y\"),\"\")","v":""},{"$f":"IF(AND(ISNUMBER(B73),B73>0),INDEX(swimmers_data,B73,5),\"\")","v":""},null,null,null,null,null,null,null,null,null,null,null,null,null,null,{"$f":"IF(AND(ISNUMBER($B73),$B73>0,E73<>\"\"),INDEX(swimmers_data,$B73,5)&\",\"&INDEX(swimmers_data,$B73,1)&\",\"&INDEX(swimmers_data,$B73,2)&\",\"&INDEX(swimmers_data,$B73,4)&\",\"&TEXT(INDEX(swimmers_data,$B73,3),\"ddmmYy\")&\",\"&LEFT(\"000000\",6-LEN(E73))&E73&\",\"&S$11&\",\"&\"F\",\"\")","v":""},{"$f":"IF(AND(ISNUMBER($B73),$B73>0,F73<>\"\"),INDEX(swimmers_data,$B73,5)&\",\"&INDEX(swimmers_data,$B73,1)&\",\"&INDEX(swimmers_data,$B73,2)&\",\"&INDEX(swimmers_data,$B73,4)&\",\"&TEXT(INDEX(swimmers_data,$B73,3),\"ddmmYy\")&\",\"&LEFT(\"000000\",6-LEN(F73))&F73&\",\"&T$11&\",\"&\"F\",\"\")","v":""},{"$f":"IF(AND(ISNUMBER($B73),$B73>0,G73<>\"\"),INDEX(swimmers_data,$B73,5)&\",\"&INDEX(swimmers_data,$B73,1)&\",\"&INDEX(swimmers_data,$B73,2)&\",\"&INDEX(swimmers_data,$B73,4)&\",\"&TEXT(INDEX(swimmers_data,$B73,3),\"ddmmYy\")&\",\"&LEFT(\"000000\",6-LEN(G73))&G73&\",\"&U$11&\",\"&\"F\",\"\")","v":""},{"$f":"IF(AND(ISNUMBER($B73),$B73>0,H73<>\"\"),INDEX(swimmers_data,$B73,5)&\",\"&INDEX(swimmers_data,$B73,1)&\",\"&INDEX(swimmers_data,$B73,2)&\",\"&INDEX(swimmers_data,$B73,4)&\",\"&TEXT(INDEX(swimmers_data,$B73,3),\"ddmmYy\")&\",\"&LEFT(\"000000\",6-LEN(H73))&H73&\",\"&V$11&\",\"&\"F\",\"\")","v":""},{"$f":"IF(AND(ISNUMBER($B73),$B73>0,I73<>\"\"),INDEX(swimmers_data,$B73,5)&\",\"&INDEX(swimmers_data,$B73,1)&\",\"&INDEX(swimmers_data,$B73,2)&\",\"&INDEX(swimmers_data,$B73,4)&\",\"&TEXT(INDEX(swimmers_data,$B73,3),\"ddmmYy\")&\",\"&LEFT(\"000000\",6-LEN(I73))&I73&\",\"&W$11&\",\"&\"F\",\"\")","v":""},{"$f":"IF(AND(ISNUMBER($B73),$B73>0,J73<>\"\"),INDEX(swimmers_data,$B73,5)&\",\"&INDEX(swimmers_data,$B73,1)&\",\"&INDEX(swimmers_data,$B73,2)&\",\"&INDEX(swimmers_data,$B73,4)&\",\"&TEXT(INDEX(swimmers_data,$B73,3),\"ddmmYy\")&\",\"&LEFT(\"000000\",6-LEN(J73))&J73&\",\"&X$11&\",\"&\"F\",\"\")","v":""},{"$f":"IF(AND(ISNUMBER($B73),$B73>0,K73<>\"\"),INDEX(swimmers_data,$B73,5)&\",\"&INDEX(swimmers_data,$B73,1)&\",\"&INDEX(swimmers_data,$B73,2)&\",\"&INDEX(swimmers_data,$B73,4)&\",\"&TEXT(INDEX(swimmers_data,$B73,3),\"ddmmYy\")&\",\"&LEFT(\"000000\",6-LEN(K73))&K73&\",\"&Y$11&\",\"&\"F\",\"\")","v":""},{"$f":"IF(AND(ISNUMBER($B73),$B73>0,L73<>\"\"),INDEX(swimmers_data,$B73,5)&\",\"&INDEX(swimmers_data,$B73,1)&\",\"&INDEX(swimmers_data,$B73,2)&\",\"&INDEX(swimmers_data,$B73,4)&\",\"&TEXT(INDEX(swimmers_data,$B73,3),\"ddmmYy\")&\",\"&LEFT(\"000000\",6-LEN(L73))&L73&\",\"&Z$11&\",\"&\"F\",\"\")","v":""},{"$f":"IF(AND(ISNUMBER($B73),$B73>0,M73<>\"\"),INDEX(swimmers_data,$B73,5)&\",\"&INDEX(swimmers_data,$B73,1)&\",\"&INDEX(swimmers_data,$B73,2)&\",\"&INDEX(swimmers_data,$B73,4)&\",\"&TEXT(INDEX(swimmers_data,$B73,3),\"ddmmYy\")&\",\"&LEFT(\"000000\",6-LEN(M73))&M73&\",\"&AA$11&\",\"&\"F\",\"\")","v":""},{"$f":"IF(AND(ISNUMBER($B73),$B73>0,N73<>\"\"),INDEX(swimmers_data,$B73,5)&\",\"&INDEX(swimmers_data,$B73,1)&\",\"&INDEX(swimmers_data,$B73,2)&\",\"&INDEX(swimmers_data,$B73,4)&\",\"&TEXT(INDEX(swimmers_data,$B73,3),\"ddmmYy\")&\",\"&LEFT(\"000000\",6-LEN(N73))&N73&\",\"&AB$11&\",\"&\"F\",\"\")","v":""},null,null,"","","",{"$f":"IF(AND(ISNUMBER($B73),$B73>0,E73<>\"\"),formatMMSSHHtime(E73),\"\")","v":""},{"$f":"IF(AND(ISNUMBER($B73),$B73>0,F73<>\"\"),formatMMSSHHtime(F73),\"\")","v":""},{"$f":"IF(AND(ISNUMBER($B73),$B73>0,G73<>\"\"),formatMMSSHHtime(G73),\"\")","v":""},{"$f":"IF(AND(ISNUMBER($B73),$B73>0,H73<>\"\"),formatMMSSHHtime(H73),\"\")","v":""},{"$f":"IF(AND(ISNUMBER($B73),$B73>0,I73<>\"\"),formatMMSSHHtime(I73),\"\")","v":""},{"$f":"IF(AND(ISNUMBER($B73),$B73>0,J73<>\"\"),formatMMSSHHtime(J73),\"\")","v":""},{"$f":"IF(AND(ISNUMBER($B73),$B73>0,K73<>\"\"),formatMMSSHHtime(K73),\"\")","v":""},{"$f":"IF(AND(ISNUMBER($B73),$B73>0,L73<>\"\"),formatMMSSHHtime(L73),\"\")","v":""},{"$f":"IF(AND(ISNUMBER($B73),$B73>0,M73<>\"\"),formatMMSSHHtime(M73),\"\")","v":""},{"$f":"IF(AND(ISNUMBER($B73),$B73>0,N73<>\"\"),formatMMSSHHtime(N73),\"\")","v":""}]
["","",{"$f":"IF(AND(ISNUMBER(B74),B74>0),DATEDIF(INDEX(swimmers_data,B74,3),$C$8,\"Y\"),\"\")","v":""},{"$f":"IF(AND(ISNUMBER(B74),B74>0),INDEX(swimmers_data,B74,5),\"\")","v":""},null,null,null,null,null,null,null,null,null,null,null,null,null,null,{"$f":"IF(AND(ISNUMBER($B74),$B74>0,E74<>\"\"),INDEX(swimmers_data,$B74,5)&\",\"&INDEX(swimmers_data,$B74,1)&\",\"&INDEX(swimmers_data,$B74,2)&\",\"&INDEX(swimmers_data,$B74,4)&\",\"&TEXT(INDEX(swimmers_data,$B74,3),\"ddmmYy\")&\",\"&LEFT(\"000000\",6-LEN(E74))&E74&\",\"&S$11&\",\"&\"F\",\"\")","v":""},{"$f":"IF(AND(ISNUMBER($B74),$B74>0,F74<>\"\"),INDEX(swimmers_data,$B74,5)&\",\"&INDEX(swimmers_data,$B74,1)&\",\"&INDEX(swimmers_data,$B74,2)&\",\"&INDEX(swimmers_data,$B74,4)&\",\"&TEXT(INDEX(swimmers_data,$B74,3),\"ddmmYy\")&\",\"&LEFT(\"000000\",6-LEN(F74))&F74&\",\"&T$11&\",\"&\"F\",\"\")","v":""},{"$f":"IF(AND(ISNUMBER($B74),$B74>0,G74<>\"\"),INDEX(swimmers_data,$B74,5)&\",\"&INDEX(swimmers_data,$B74,1)&\",\"&INDEX(swimmers_data,$B74,2)&\",\"&INDEX(swimmers_data,$B74,4)&\",\"&TEXT(INDEX(swimmers_data,$B74,3),\"ddmmYy\")&\",\"&LEFT(\"000000\",6-LEN(G74))&G74&\",\"&U$11&\",\"&\"F\",\"\")","v":""},{"$f":"IF(AND(ISNUMBER($B74),$B74>0,H74<>\"\"),INDEX(swimmers_data,$B74,5)&\",\"&INDEX(swimmers_data,$B74,1)&\",\"&INDEX(swimmers_data,$B74,2)&\",\"&INDEX(swimmers_data,$B74,4)&\",\"&TEXT(INDEX(swimmers_data,$B74,3),\"ddmmYy\")&\",\"&LEFT(\"000000\",6-LEN(H74))&H74&\",\"&V$11&\",\"&\"F\",\"\")","v":""},{"$f":"IF(AND(ISNUMBER($B74),$B74>0,I74<>\"\"),INDEX(swimmers_data,$B74,5)&\",\"&INDEX(swimmers_data,$B74,1)&\",\"&INDEX(swimmers_data,$B74,2)&\",\"&INDEX(swimmers_data,$B74,4)&\",\"&TEXT(INDEX(swimmers_data,$B74,3),\"ddmmYy\")&\",\"&LEFT(\"000000\",6-LEN(I74))&I74&\",\"&W$11&\",\"&\"F\",\"\")","v":""},{"$f":"IF(AND(ISNUMBER($B74),$B74>0,J74<>\"\"),INDEX(swimmers_data,$B74,5)&\",\"&INDEX(swimmers_data,$B74,1)&\",\"&INDEX(swimmers_data,$B74,2)&\",\"&INDEX(swimmers_data,$B74,4)&\",\"&TEXT(INDEX(swimmers_data,$B74,3),\"ddmmYy\")&\",\"&LEFT(\"000000\",6-LEN(J74))&J74&\",\"&X$11&\",\"&\"F\",\"\")","v":""},{"$f":"IF(AND(ISNUMBER($B74),$B74>0,K74<>\"\"),INDEX(swimmers_data,$B74,5)&\",\"&INDEX(swimmers_data,$B74,1)&\",\"&INDEX(swimmers_data,$B74,2)&\",\"&INDEX(swimmers_data,$B74,4)&\",\"&TEXT(INDEX(swimmers_data,$B74,3),\"ddmmYy\")&\",\"&LEFT(\"000000\",6-LEN(K74))&K74&\",\"&Y$11&\",\"&\"F\",\"\")","v":""},{"$f":"IF(AND(ISNUMBER($B74),$B74>0,L74<>\"\"),INDEX(swimmers_data,$B74,5)&\",\"&INDEX(swimmers_data,$B74,1)&\",\"&INDEX(swimmers_data,$B74,2)&\",\"&INDEX(swimmers_data,$B74,4)&\",\"&TEXT(INDEX(swimmers_data,$B74,3),\"ddmmYy\")&\",\"&LEFT(\"000000\",6-LEN(L74))&L74&\",\"&Z$11&\",\"&\"F\",\"\")","v":""},{"$f":"IF(AND(ISNUMBER($B74),$B74>0,M74<>\"\"),INDEX(swimmers_data,$B74,5)&\",\"&INDEX(swimmers_data,$B74,1)&\",\"&INDEX(swimmers_data,$B74,2)&\",\"&INDEX(swimmers_data,$B74,4)&\",\"&TEXT(INDEX(swimmers_data,$B74,3),\"ddmmYy\")&\",\"&LEFT(\"000000\",6-LEN(M74))&M74&\",\"&AA$11&\",\"&\"F\",\"\")","v":""},{"$f":"IF(AND(ISNUMBER($B74),$B74>0,N74<>\"\"),INDEX(swimmers_data,$B74,5)&\",\"&INDEX(swimmers_data,$B74,1)&\",\"&INDEX(swimmers_data,$B74,2)&\",\"&INDEX(swimmers_data,$B74,4)&\",\"&TEXT(INDEX(swimmers_data,$B74,3),\"ddmmYy\")&\",\"&LEFT(\"000000\",6-LEN(N74))&N74&\",\"&AB$11&\",\"&\"F\",\"\")","v":""},null,null,"","","",{"$f":"IF(AND(ISNUMBER($B74),$B74>0,E74<>\"\"),formatMMSSHHtime(E74),\"\")","v":""},{"$f":"IF(AND(ISNUMBER($B74),$B74>0,F74<>\"\"),formatMMSSHHtime(F74),\"\")","v":""},{"$f":"IF(AND(ISNUMBER($B74),$B74>0,G74<>\"\"),formatMMSSHHtime(G74),\"\")","v":""},{"$f":"IF(AND(ISNUMBER($B74),$B74>0,H74<>\"\"),formatMMSSHHtime(H74),\"\")","v":""},{"$f":"IF(AND(ISNUMBER($B74),$B74>0,I74<>\"\"),formatMMSSHHtime(I74),\"\")","v":""},{"$f":"IF(AND(ISNUMBER($B74),$B74>0,J74<>\"\"),formatMMSSHHtime(J74),\"\")","v":""},{"$f":"IF(AND(ISNUMBER($B74),$B74>0,K74<>\"\"),formatMMSSHHtime(K74),\"\")","v":""},{"$f":"IF(AND(ISNUMBER($B74),$B74>0,L74<>\"\"),formatMMSSHHtime(L74),\"\")","v":""},{"$f":"IF(AND(ISNUMBER($B74),$B74>0,M74<>\"\"),formatMMSSHHtime(M74),\"\")","v":""},{"$f":"IF(AND(ISNUMBER($B74),$B74>0,N74<>\"\"),formatMMSSHHtime(N74),\"\")","v":""}]
["","",{"$f":"IF(AND(ISNUMBER(B75),B75>0),DATEDIF(INDEX(swimmers_data,B75,3),$C$8,\"Y\"),\"\")","v":""},{"$f":"IF(AND(ISNUMBER(B75),B75>0),INDEX(swimmers_data,B75,5),\"\")","v":""},null,null,null,null,null,null,null,null,null,null,null,null,null,null,{"$f":"IF(AND(ISNUMBER($B75),$B75>0,E75<>\"\"),INDEX(swimmers_data,$B75,5)&\",\"&INDEX(swimmers_data,$B75,1)&\",\"&INDEX(swimmers_data,$B75,2)&\",\"&INDEX(swimmers_data,$B75,4)&\",\"&TEXT(INDEX(swimmers_data,$B75,3),\"ddmmYy\")&\",\"&LEFT(\"000000\",6-LEN(E75))&E75&\",\"&S$11&\",\"&\"F\",\"\")","v":""},{"$f":"IF(AND(ISNUMBER($B75),$B75>0,F75<>\"\"),INDEX(swimmers_data,$B75,5)&\",\"&INDEX(swimmers_data,$B75,1)&\",\"&INDEX(swimmers_data,$B75,2)&\",\"&INDEX(swimmers_data,$B75,4)&\",\"&TEXT(INDEX(swimmers_data,$B75,3),\"ddmmYy\")&\",\"&LEFT(\"000000\",6-LEN(F75))&F75&\",\"&T$11&\",\"&\"F\",\"\")","v":""},{"$f":"IF(AND(ISNUMBER($B75),$B75>0,G75<>\"\"),INDEX(swimmers_data,$B75,5)&\",\"&INDEX(swimmers_data,$B75,1)&\",\"&INDEX(swimmers_data,$B75,2)&\",\"&INDEX(swimmers_data,$B75,4)&\",\"&TEXT(INDEX(swimmers_data,$B75,3),\"ddmmYy\")&\",\"&LEFT(\"000000\",6-LEN(G75))&G75&\",\"&U$11&\",\"&\"F\",\"\")","v":""},{"$f":"IF(AND(ISNUMBER($B75),$B75>0,H75<>\"\"),INDEX(swimmers_data,$B75,5)&\",\"&INDEX(swimmers_data,$B75,1)&\",\"&INDEX(swimmers_data,$B75,2)&\",\"&INDEX(swimmers_data,$B75,4)&\",\"&TEXT(INDEX(swimmers_data,$B75,3),\"ddmmYy\")&\",\"&LEFT(\"000000\",6-LEN(H75))&H75&\",\"&V$11&\",\"&\"F\",\"\")","v":""},{"$f":"IF(AND(ISNUMBER($B75),$B75>0,I75<>\"\"),INDEX(swimmers_data,$B75,5)&\",\"&INDEX(swimmers_data,$B75,1)&\",\"&INDEX(swimmers_data,$B75,2)&\",\"&INDEX(swimmers_data,$B75,4)&\",\"&TEXT(INDEX(swimmers_data,$B75,3),\"ddmmYy\")&\",\"&LEFT(\"000000\",6-LEN(I75))&I75&\",\"&W$11&\",\"&\"F\",\"\")","v":""},{"$f":"IF(AND(ISNUMBER($B75),$B75>0,J75<>\"\"),INDEX(swimmers_data,$B75,5)&\",\"&INDEX(swimmers_data,$B75,1)&\",\"&INDEX(swimmers_data,$B75,2)&\",\"&INDEX(swimmers_data,$B75,4)&\",\"&TEXT(INDEX(swimmers_data,$B75,3),\"ddmmYy\")&\",\"&LEFT(\"000000\",6-LEN(J75))&J75&\",\"&X$11&\",\"&\"F\",\"\")","v":""},{"$f":"IF(AND(ISNUMBER($B75),$B75>0,K75<>\"\"),INDEX(swimmers_data,$B75,5)&\",\"&INDEX(swimmers_data,$B75,1)&\",\"&INDEX(swimmers_data,$B75,2)&\",\"&INDEX(swimmers_data,$B75,4)&\",\"&TEXT(INDEX(swimmers_data,$B75,3),\"ddmmYy\")&\",\"&LEFT(\"000000\",6-LEN(K75))&K75&\",\"&Y$11&\",\"&\"F\",\"\")","v":""},{"$f":"IF(AND(ISNUMBER($B75),$B75>0,L75<>\"\"),INDEX(swimmers_data,$B75,5)&\",\"&INDEX(swimmers_data,$B75,1)&\",\"&INDEX(swimmers_data,$B75,2)&\",\"&INDEX(swimmers_data,$B75,4)&\",\"&TEXT(INDEX(swimmers_data,$B75,3),\"ddmmYy\")&\",\"&LEFT(\"000000\",6-LEN(L75))&L75&\",\"&Z$11&\",\"&\"F\",\"\")","v":""},{"$f":"IF(AND(ISNUMBER($B75),$B75>0,M75<>\"\"),INDEX(swimmers_data,$B75,5)&\",\"&INDEX(swimmers_data,$B75,1)&\",\"&INDEX(swimmers_data,$B75,2)&\",\"&INDEX(swimmers_data,$B75,4)&\",\"&TEXT(INDEX(swimmers_data,$B75,3),\"ddmmYy\")&\",\"&LEFT(\"000000\",6-LEN(M75))&M75&\",\"&AA$11&\",\"&\"F\",\"\")","v":""},{"$f":"IF(AND(ISNUMBER($B75),$B75>0,N75<>\"\"),INDEX(swimmers_data,$B75,5)&\",\"&INDEX(swimmers_data,$B75,1)&\",\"&INDEX(swimmers_data,$B75,2)&\",\"&INDEX(swimmers_data,$B75,4)&\",\"&TEXT(INDEX(swimmers_data,$B75,3),\"ddmmYy\")&\",\"&LEFT(\"000000\",6-LEN(N75))&N75&\",\"&AB$11&\",\"&\"F\",\"\")","v":""},null,null,"","","",{"$f":"IF(AND(ISNUMBER($B75),$B75>0,E75<>\"\"),formatMMSSHHtime(E75),\"\")","v":""},{"$f":"IF(AND(ISNUMBER($B75),$B75>0,F75<>\"\"),formatMMSSHHtime(F75),\"\")","v":""},{"$f":"IF(AND(ISNUMBER($B75),$B75>0,G75<>\"\"),formatMMSSHHtime(G75),\"\")","v":""},{"$f":"IF(AND(ISNUMBER($B75),$B75>0,H75<>\"\"),formatMMSSHHtime(H75),\"\")","v":""},{"$f":"IF(AND(ISNUMBER($B75),$B75>0,I75<>\"\"),formatMMSSHHtime(I75),\"\")","v":""},{"$f":"IF(AND(ISNUMBER($B75),$B75>0,J75<>\"\"),formatMMSSHHtime(J75),\"\")","v":""},{"$f":"IF(AND(ISNUMBER($B75),$B75>0,K75<>\"\"),formatMMSSHHtime(K75),\"\")","v":""},{"$f":"IF(AND(ISNUMBER($B75),$B75>0,L75<>\"\"),formatMMSSHHtime(L75),\"\")","v":""},{"$f":"IF(AND(ISNUMBER($B75),$B75>0,M75<>\"\"),formatMMSSHHtime(M75),\"\")","v":""},{"$f":"IF(AND(ISNUMBER($B75),$B75>0,N75<>\"\"),formatMMSSHHtime(N75),\"\")","v":""}]
["","",{"$f":"IF(AND(ISNUMBER(B76),B76>0),DATEDIF(INDEX(swimmers_data,B76,3),$C$8,\"Y\"),\"\")","v":""},{"$f":"IF(AND(ISNUMBER(B76),B76>0),INDEX(swimmers_data,B76,5),\"\")","v":""},null,null,null,null,null,null,null,null,null,null,null,null,null,null,{"$f":"IF(AND(ISNUMBER($B76),$B76>0,E76<>\"\"),INDEX(swimmers_data,$B76,5)&\",\"&INDEX(swimmers_data,$B76,1)&\",\"&INDEX(swimmers_data,$B76,2)&\",\"&INDEX(swimmers_data,$B76,4)&\",\"&TEXT(INDEX(swimmers_data,$B76,3),\"ddmmYy\")&\",\"&LEFT(\"000000\",6-LEN(E76))&E76&\",\"&S$11&\",\"&\"F\",\"\")","v":""},{"$f":"IF(AND(ISNUMBER($B76),$B76>0,F76<>\"\"),INDEX(swimmers_data,$B76,5)&\",\"&INDEX(swimmers_data,$B76,1)&\",\"&INDEX(swimmers_data,$B76,2)&\",\"&INDEX(swimmers_data,$B76,4)&\",\"&TEXT(INDEX(swimmers_data,$B76,3),\"ddmmYy\")&\",\"&LEFT(\"000000\",6-LEN(F76))&F76&\",\"&T$11&\",\"&\"F\",\"\")","v":""},{"$f":"IF(AND(ISNUMBER($B76),$B76>0,G76<>\"\"),INDEX(swimmers_data,$B76,5)&\",\"&INDEX(swimmers_data,$B76,1)&\",\"&INDEX(swimmers_data,$B76,2)&\",\"&INDEX(swimmers_data,$B76,4)&\",\"&TEXT(INDEX(swimmers_data,$B76,3),\"ddmmYy\")&\",\"&LEFT(\"000000\",6-LEN(G76))&G76&\",\"&U$11&\",\"&\"F\",\"\")","v":""},{"$f":"IF(AND(ISNUMBER($B76),$B76>0,H76<>\"\"),INDEX(swimmers_data,$B76,5)&\",\"&INDEX(swimmers_data,$B76,1)&\",\"&INDEX(swimmers_data,$B76,2)&\",\"&INDEX(swimmers_data,$B76,4)&\",\"&TEXT(INDEX(swimmers_data,$B76,3),\"ddmmYy\")&\",\"&LEFT(\"000000\",6-LEN(H76))&H76&\",\"&V$11&\",\"&\"F\",\"\")","v":""},{"$f":"IF(AND(ISNUMBER($B76),$B76>0,I76<>\"\"),INDEX(swimmers_data,$B76,5)&\",\"&INDEX(swimmers_data,$B76,1)&\",\"&INDEX(swimmers_data,$B76,2)&\",\"&INDEX(swimmers_data,$B76,4)&\",\"&TEXT(INDEX(swimmers_data,$B76,3),\"ddmmYy\")&\",\"&LEFT(\"000000\",6-LEN(I76))&I76&\",\"&W$11&\",\"&\"F\",\"\")","v":""},{"$f":"IF(AND(ISNUMBER($B76),$B76>0,J76<>\"\"),INDEX(swimmers_data,$B76,5)&\",\"&INDEX(swimmers_data,$B76,1)&\",\"&INDEX(swimmers_data,$B76,2)&\",\"&INDEX(swimmers_data,$B76,4)&\",\"&TEXT(INDEX(swimmers_data,$B76,3),\"ddmmYy\")&\",\"&LEFT(\"000000\",6-LEN(J76))&J76&\",\"&X$11&\",\"&\"F\",\"\")","v":""},{"$f":"IF(AND(ISNUMBER($B76),$B76>0,K76<>\"\"),INDEX(swimmers_data,$B76,5)&\",\"&INDEX(swimmers_data,$B76,1)&\",\"&INDEX(swimmers_data,$B76,2)&\",\"&INDEX(swimmers_data,$B76,4)&\",\"&TEXT(INDEX(swimmers_data,$B76,3),\"ddmmYy\")&\",\"&LEFT(\"000000\",6-LEN(K76))&K76&\",\"&Y$11&\",\"&\"F\",\"\")","v":""},{"$f":"IF(AND(ISNUMBER($B76),$B76>0,L76<>\"\"),INDEX(swimmers_data,$B76,5)&\",\"&INDEX(swimmers_data,$B76,1)&\",\"&INDEX(swimmers_data,$B76,2)&\",\"&INDEX(swimmers_data,$B76,4)&\",\"&TEXT(INDEX(swimmers_data,$B76,3),\"ddmmYy\")&\",\"&LEFT(\"000000\",6-LEN(L76))&L76&\",\"&Z$11&\",\"&\"F\",\"\")","v":""},{"$f":"IF(AND(ISNUMBER($B76),$B76>0,M76<>\"\"),INDEX(swimmers_data,$B76,5)&\",\"&INDEX(swimmers_data,$B76,1)&\",\"&INDEX(swimmers_data,$B76,2)&\",\"&INDEX(swimmers_data,$B76,4)&\",\"&TEXT(INDEX(swimmers_data,$B76,3),\"ddmmYy\")&\",\"&LEFT(\"000000\",6-LEN(M76))&M76&\",\"&AA$11&\",\"&\"F\",\"\")","v":""},{"$f":"IF(AND(ISNUMBER($B76),$B76>0,N76<>\"\"),INDEX(swimmers_data,$B76,5)&\",\"&INDEX(swimmers_data,$B76,1)&\",\"&INDEX(swimmers_data,$B76,2)&\",\"&INDEX(swimmers_data,$B76,4)&\",\"&TEXT(INDEX(swimmers_data,$B76,3),\"ddmmYy\")&\",\"&LEFT(\"000000\",6-LEN(N76))&N76&\",\"&AB$11&\",\"&\"F\",\"\")","v":""},null,null,"","","",{"$f":"IF(AND(ISNUMBER($B76),$B76>0,E76<>\"\"),formatMMSSHHtime(E76),\"\")","v":""},{"$f":"IF(AND(ISNUMBER($B76),$B76>0,F76<>\"\"),formatMMSSHHtime(F76),\"\")","v":""},{"$f":"IF(AND(ISNUMBER($B76),$B76>0,G76<>\"\"),formatMMSSHHtime(G76),\"\")","v":""},{"$f":"IF(AND(ISNUMBER($B76),$B76>0,H76<>\"\"),formatMMSSHHtime(H76),\"\")","v":""},{"$f":"IF(AND(ISNUMBER($B76),$B76>0,I76<>\"\"),formatMMSSHHtime(I76),\"\")","v":""},{"$f":"IF(AND(ISNUMBER($B76),$B76>0,J76<>\"\"),formatMMSSHHtime(J76),\"\")","v":""},{"$f":"IF(AND(ISNUMBER($B76),$B76>0,K76<>\"\"),formatMMSSHHtime(K76),\"\")","v":""},{"$f":"IF(AND(ISNUMBER($B76),$B76>0,L76<>\"\"),formatMMSSHHtime(L76),\"\")","v":""},{"$f":"IF(AND(ISNUMBER($B76),$B76>0,M76<>\"\"),formatMMSSHHtime(M76),\"\")","v":""},{"$f":"IF(AND(ISNUMBER($B76),$B76>0,N76<>\"\"),formatMMSSHHtime(N76),\"\")","v":""}]
["",{"$f":"IF(A77<>\"\",IFERROR(MATCH(A77,swimmers_fullname,0),0),\"\")","v":""},{"$f":"IF(AND(ISNUMBER(B77),B77>0),DATEDIF(INDEX(swimmers_data,B77,3),$C$8,\"Y\"),\"\")","v":""},{"$f":"IF(AND(ISNUMBER(B77),B77>0),INDEX(swimmers_data,B77,5),\"\")","v":""},null,null,null,null,null,null,null,null,null,null,null,null,null,null,{"$f":"IF(AND(ISNUMBER($B77),$B77>0,E77<>\"\"),INDEX(swimmers_data,$B77,5)&\",\"&INDEX(swimmers_data,$B77,1)&\",\"&INDEX(swimmers_data,$B77,2)&\",\"&INDEX(swimmers_data,$B77,4)&\",\"&TEXT(INDEX(swimmers_data,$B77,3),\"ddmmYy\")&\",\"&LEFT(\"000000\",6-LEN(E77))&E77&\",\"&S$11&\",\"&\"F\",\"\")","v":""},{"$f":"IF(AND(ISNUMBER($B77),$B77>0,F77<>\"\"),INDEX(swimmers_data,$B77,5)&\",\"&INDEX(swimmers_data,$B77,1)&\",\"&INDEX(swimmers_data,$B77,2)&\",\"&INDEX(swimmers_data,$B77,4)&\",\"&TEXT(INDEX(swimmers_data,$B77,3),\"ddmmYy\")&\",\"&LEFT(\"000000\",6-LEN(F77))&F77&\",\"&T$11&\",\"&\"F\",\"\")","v":""},{"$f":"IF(AND(ISNUMBER($B77),$B77>0,G77<>\"\"),INDEX(swimmers_data,$B77,5)&\",\"&INDEX(swimmers_data,$B77,1)&\",\"&INDEX(swimmers_data,$B77,2)&\",\"&INDEX(swimmers_data,$B77,4)&\",\"&TEXT(INDEX(swimmers_data,$B77,3),\"ddmmYy\")&\",\"&LEFT(\"000000\",6-LEN(G77))&G77&\",\"&U$11&\",\"&\"F\",\"\")","v":""},{"$f":"IF(AND(ISNUMBER($B77),$B77>0,H77<>\"\"),INDEX(swimmers_data,$B77,5)&\",\"&INDEX(swimmers_data,$B77,1)&\",\"&INDEX(swimmers_data,$B77,2)&\",\"&INDEX(swimmers_data,$B77,4)&\",\"&TEXT(INDEX(swimmers_data,$B77,3),\"ddmmYy\")&\",\"&LEFT(\"000000\",6-LEN(H77))&H77&\",\"&V$11&\",\"&\"F\",\"\")","v":""},{"$f":"IF(AND(ISNUMBER($B77),$B77>0,I77<>\"\"),INDEX(swimmers_data,$B77,5)&\",\"&INDEX(swimmers_data,$B77,1)&\",\"&INDEX(swimmers_data,$B77,2)&\",\"&INDEX(swimmers_data,$B77,4)&\",\"&TEXT(INDEX(swimmers_data,$B77,3),\"ddmmYy\")&\",\"&LEFT(\"000000\",6-LEN(I77))&I77&\",\"&W$11&\",\"&\"F\",\"\")","v":""},{"$f":"IF(AND(ISNUMBER($B77),$B77>0,J77<>\"\"),INDEX(swimmers_data,$B77,5)&\",\"&INDEX(swimmers_data,$B77,1)&\",\"&INDEX(swimmers_data,$B77,2)&\",\"&INDEX(swimmers_data,$B77,4)&\",\"&TEXT(INDEX(swimmers_data,$B77,3),\"ddmmYy\")&\",\"&LEFT(\"000000\",6-LEN(J77))&J77&\",\"&X$11&\",\"&\"F\",\"\")","v":""},{"$f":"IF(AND(ISNUMBER($B77),$B77>0,K77<>\"\"),INDEX(swimmers_data,$B77,5)&\",\"&INDEX(swimmers_data,$B77,1)&\",\"&INDEX(swimmers_data,$B77,2)&\",\"&INDEX(swimmers_data,$B77,4)&\",\"&TEXT(INDEX(swimmers_data,$B77,3),\"ddmmYy\")&\",\"&LEFT(\"000000\",6-LEN(K77))&K77&\",\"&Y$11&\",\"&\"F\",\"\")","v":""},{"$f":"IF(AND(ISNUMBER($B77),$B77>0,L77<>\"\"),INDEX(swimmers_data,$B77,5)&\",\"&INDEX(swimmers_data,$B77,1)&\",\"&INDEX(swimmers_data,$B77,2)&\",\"&INDEX(swimmers_data,$B77,4)&\",\"&TEXT(INDEX(swimmers_data,$B77,3),\"ddmmYy\")&\",\"&LEFT(\"000000\",6-LEN(L77))&L77&\",\"&Z$11&\",\"&\"F\",\"\")","v":""},{"$f":"IF(AND(ISNUMBER($B77),$B77>0,M77<>\"\"),INDEX(swimmers_data,$B77,5)&\",\"&INDEX(swimmers_data,$B77,1)&\",\"&INDEX(swimmers_data,$B77,2)&\",\"&INDEX(swimmers_data,$B77,4)&\",\"&TEXT(INDEX(swimmers_data,$B77,3),\"ddmmYy\")&\",\"&LEFT(\"000000\",6-LEN(M77))&M77&\",\"&AA$11&\",\"&\"F\",\"\")","v":""},{"$f":"IF(AND(ISNUMBER($B77),$B77>0,N77<>\"\"),INDEX(swimmers_data,$B77,5)&\",\"&INDEX(swimmers_data,$B77,1)&\",\"&INDEX(swimmers_data,$B77,2)&\",\"&INDEX(swimmers_data,$B77,4)&\",\"&TEXT(INDEX(swimmers_data,$B77,3),\"ddmmYy\")&\",\"&LEFT(\"000000\",6-LEN(N77))&N77&\",\"&AB$11&\",\"&\"F\",\"\")","v":""},null,null,"","","",{"$f":"IF(AND(ISNUMBER($B77),$B77>0,E77<>\"\"),formatMMSSHHtime(E77),\"\")","v":""},{"$f":"IF(AND(ISNUMBER($B77),$B77>0,F77<>\"\"),formatMMSSHHtime(F77),\"\")","v":""},{"$f":"IF(AND(ISNUMBER($B77),$B77>0,G77<>\"\"),formatMMSSHHtime(G77),\"\")","v":""},{"$f":"IF(AND(ISNUMBER($B77),$B77>0,H77<>\"\"),formatMMSSHHtime(H77),\"\")","v":""},{"$f":"IF(AND(ISNUMBER($B77),$B77>0,I77<>\"\"),formatMMSSHHtime(I77),\"\")","v":""},{"$f":"IF(AND(ISNUMBER($B77),$B77>0,J77<>\"\"),formatMMSSHHtime(J77),\"\")","v":""},{"$f":"IF(AND(ISNUMBER($B77),$B77>0,K77<>\"\"),formatMMSSHHtime(K77),\"\")","v":""},{"$f":"IF(AND(ISNUMBER($B77),$B77>0,L77<>\"\"),formatMMSSHHtime(L77),\"\")","v":""},{"$f":"IF(AND(ISNUMBER($B77),$B77>0,M77<>\"\"),formatMMSSHHtime(M77),\"\")","v":""},{"$f":"IF(AND(ISNUMBER($B77),$B77>0,N77<>\"\"),formatMMSSHHtime(N77),\"\")","v":""}]
["","",{"$f":"IF(AND(ISNUMBER(B78),B78>0),DATEDIF(INDEX(swimmers_data,B78,3),$C$8,\"Y\"),\"\")","v":""},{"$f":"IF(AND(ISNUMBER(B78),B78>0),INDEX(swimmers_data,B78,5),\"\")","v":""},null,null,null,null,null,null,null,null,null,null,null,null,null,null,{"$f":"IF(AND(ISNUMBER($B78),$B78>0,E78<>\"\"),INDEX(swimmers_data,$B78,5)&\",\"&INDEX(swimmers_data,$B78,1)&\",\"&INDEX(swimmers_data,$B78,2)&\",\"&INDEX(swimmers_data,$B78,4)&\",\"&TEXT(INDEX(swimmers_data,$B78,3),\"ddmmYy\")&\",\"&LEFT(\"000000\",6-LEN(E78))&E78&\",\"&S$11&\",\"&\"F\",\"\")","v":""},{"$f":"IF(AND(ISNUMBER($B78),$B78>0,F78<>\"\"),INDEX(swimmers_data,$B78,5)&\",\"&INDEX(swimmers_data,$B78,1)&\",\"&INDEX(swimmers_data,$B78,2)&\",\"&INDEX(swimmers_data,$B78,4)&\",\"&TEXT(INDEX(swimmers_data,$B78,3),\"ddmmYy\")&\",\"&LEFT(\"000000\",6-LEN(F78))&F78&\",\"&T$11&\",\"&\"F\",\"\")","v":""},{"$f":"IF(AND(ISNUMBER($B78),$B78>0,G78<>\"\"),INDEX(swimmers_data,$B78,5)&\",\"&INDEX(swimmers_data,$B78,1)&\",\"&INDEX(swimmers_data,$B78,2)&\",\"&INDEX(swimmers_data,$B78,4)&\",\"&TEXT(INDEX(swimmers_data,$B78,3),\"ddmmYy\")&\",\"&LEFT(\"000000\",6-LEN(G78))&G78&\",\"&U$11&\",\"&\"F\",\"\")","v":""},{"$f":"IF(AND(ISNUMBER($B78),$B78>0,H78<>\"\"),INDEX(swimmers_data,$B78,5)&\",\"&INDEX(swimmers_data,$B78,1)&\",\"&INDEX(swimmers_data,$B78,2)&\",\"&INDEX(swimmers_data,$B78,4)&\",\"&TEXT(INDEX(swimmers_data,$B78,3),\"ddmmYy\")&\",\"&LEFT(\"000000\",6-LEN(H78))&H78&\",\"&V$11&\",\"&\"F\",\"\")","v":""},{"$f":"IF(AND(ISNUMBER($B78),$B78>0,I78<>\"\"),INDEX(swimmers_data,$B78,5)&\",\"&INDEX(swimmers_data,$B78,1)&\",\"&INDEX(swimmers_data,$B78,2)&\",\"&INDEX(swimmers_data,$B78,4)&\",\"&TEXT(INDEX(swimmers_data,$B78,3),\"ddmmYy\")&\",\"&LEFT(\"000000\",6-LEN(I78))&I78&\",\"&W$11&\",\"&\"F\",\"\")","v":""},{"$f":"IF(AND(ISNUMBER($B78),$B78>0,J78<>\"\"),INDEX(swimmers_data,$B78,5)&\",\"&INDEX(swimmers_data,$B78,1)&\",\"&INDEX(swimmers_data,$B78,2)&\",\"&INDEX(swimmers_data,$B78,4)&\",\"&TEXT(INDEX(swimmers_data,$B78,3),\"ddmmYy\")&\",\"&LEFT(\"000000\",6-LEN(J78))&J78&\",\"&X$11&\",\"&\"F\",\"\")","v":""},{"$f":"IF(AND(ISNUMBER($B78),$B78>0,K78<>\"\"),INDEX(swimmers_data,$B78,5)&\",\"&INDEX(swimmers_data,$B78,1)&\",\"&INDEX(swimmers_data,$B78,2)&\",\"&INDEX(swimmers_data,$B78,4)&\",\"&TEXT(INDEX(swimmers_data,$B78,3),\"ddmmYy\")&\",\"&LEFT(\"000000\",6-LEN(K78))&K78&\",\"&Y$11&\",\"&\"F\",\"\")","v":""},{"$f":"IF(AND(ISNUMBER($B78),$B78>0,L78<>\"\"),INDEX(swimmers_data,$B78,5)&\",\"&INDEX(swimmers_data,$B78,1)&\",\"&INDEX(swimmers_data,$B78,2)&\",\"&INDEX(swimmers_data,$B78,4)&\",\"&TEXT(INDEX(swimmers_data,$B78,3),\"ddmmYy\")&\",\"&LEFT(\"000000\",6-LEN(L78))&L78&\",\"&Z$11&\",\"&\"F\",\"\")","v":""},{"$f":"IF(AND(ISNUMBER($B78),$B78>0,M78<>\"\"),INDEX(swimmers_data,$B78,5)&\",\"&INDEX(swimmers_data,$B78,1)&\",\"&INDEX(swimmers_data,$B78,2)&\",\"&INDEX(swimmers_data,$B78,4)&\",\"&TEXT(INDEX(swimmers_data,$B78,3),\"ddmmYy\")&\",\"&LEFT(\"000000\",6-LEN(M78))&M78&\",\"&AA$11&\",\"&\"F\",\"\")","v":""},{"$f":"IF(AND(ISNUMBER($B78),$B78>0,N78<>\"\"),INDEX(swimmers_data,$B78,5)&\",\"&INDEX(swimmers_data,$B78,1)&\",\"&INDEX(swimmers_data,$B78,2)&\",\"&INDEX(swimmers_data,$B78,4)&\",\"&TEXT(INDEX(swimmers_data,$B78,3),\"ddmmYy\")&\",\"&LEFT(\"000000\",6-LEN(N78))&N78&\",\"&AB$11&\",\"&\"F\",\"\")","v":""},null,null,{"$f":"IF(AND(ISNUMBER($B78),$B78>0),A78,\"\")","v":""},{"$f":"C78","v":""},{"$f":"D78","v":""},{"$f":"IF(AND(ISNUMBER($B78),$B78>0,E78<>\"\"),formatMMSSHHtime(E78),\"\")","v":""},{"$f":"IF(AND(ISNUMBER($B78),$B78>0,F78<>\"\"),formatMMSSHHtime(F78),\"\")","v":""},{"$f":"IF(AND(ISNUMBER($B78),$B78>0,G78<>\"\"),formatMMSSHHtime(G78),\"\")","v":""},{"$f":"IF(AND(ISNUMBER($B78),$B78>0,H78<>\"\"),formatMMSSHHtime(H78),\"\")","v":""},{"$f":"IF(AND(ISNUMBER($B78),$B78>0,I78<>\"\"),formatMMSSHHtime(I78),\"\")","v":""},{"$f":"IF(AND(ISNUMBER($B78),$B78>0,J78<>\"\"),formatMMSSHHtime(J78),\"\")","v":""},{"$f":"IF(AND(ISNUMBER($B78),$B78>0,K78<>\"\"),formatMMSSHHtime(K78),\"\")","v":""},{"$f":"IF(AND(ISNUMBER($B78),$B78>0,L78<>\"\"),formatMMSSHHtime(L78),\"\")","v":""},{"$f":"IF(AND(ISNUMBER($B78),$B78>0,M78<>\"\"),formatMMSSHHtime(M78),\"\")","v":""},{"$f":"IF(AND(ISNUMBER($B78),$B78>0,N78<>\"\"),formatMMSSHHtime(N78),\"\")","v":""}]
["","",{"$f":"IF(AND(ISNUMBER(B79),B79>0),DATEDIF(INDEX(swimmers_data,B79,3),$C$8,\"Y\"),\"\")","v":""},{"$f":"IF(AND(ISNUMBER(B79),B79>0),INDEX(swimmers_data,B79,5),\"\")","v":""},null,null,null,null,null,null,null,null,null,null,null,null,null,null,{"$f":"IF(AND(ISNUMBER($B79),$B79>0,E79<>\"\"),INDEX(swimmers_data,$B79,5)&\",\"&INDEX(swimmers_data,$B79,1)&\",\"&INDEX(swimmers_data,$B79,2)&\",\"&INDEX(swimmers_data,$B79,4)&\",\"&TEXT(INDEX(swimmers_data,$B79,3),\"ddmmYy\")&\",\"&LEFT(\"000000\",6-LEN(E79))&E79&\",\"&S$11&\",\"&\"F\",\"\")","v":""},{"$f":"IF(AND(ISNUMBER($B79),$B79>0,F79<>\"\"),INDEX(swimmers_data,$B79,5)&\",\"&INDEX(swimmers_data,$B79,1)&\",\"&INDEX(swimmers_data,$B79,2)&\",\"&INDEX(swimmers_data,$B79,4)&\",\"&TEXT(INDEX(swimmers_data,$B79,3),\"ddmmYy\")&\",\"&LEFT(\"000000\",6-LEN(F79))&F79&\",\"&T$11&\",\"&\"F\",\"\")","v":""},{"$f":"IF(AND(ISNUMBER($B79),$B79>0,G79<>\"\"),INDEX(swimmers_data,$B79,5)&\",\"&INDEX(swimmers_data,$B79,1)&\",\"&INDEX(swimmers_data,$B79,2)&\",\"&INDEX(swimmers_data,$B79,4)&\",\"&TEXT(INDEX(swimmers_data,$B79,3),\"ddmmYy\")&\",\"&LEFT(\"000000\",6-LEN(G79))&G79&\",\"&U$11&\",\"&\"F\",\"\")","v":""},{"$f":"IF(AND(ISNUMBER($B79),$B79>0,H79<>\"\"),INDEX(swimmers_data,$B79,5)&\",\"&INDEX(swimmers_data,$B79,1)&\",\"&INDEX(swimmers_data,$B79,2)&\",\"&INDEX(swimmers_data,$B79,4)&\",\"&TEXT(INDEX(swimmers_data,$B79,3),\"ddmmYy\")&\",\"&LEFT(\"000000\",6-LEN(H79))&H79&\",\"&V$11&\",\"&\"F\",\"\")","v":""},{"$f":"IF(AND(ISNUMBER($B79),$B79>0,I79<>\"\"),INDEX(swimmers_data,$B79,5)&\",\"&INDEX(swimmers_data,$B79,1)&\",\"&INDEX(swimmers_data,$B79,2)&\",\"&INDEX(swimmers_data,$B79,4)&\",\"&TEXT(INDEX(swimmers_data,$B79,3),\"ddmmYy\")&\",\"&LEFT(\"000000\",6-LEN(I79))&I79&\",\"&W$11&\",\"&\"F\",\"\")","v":""},{"$f":"IF(AND(ISNUMBER($B79),$B79>0,J79<>\"\"),INDEX(swimmers_data,$B79,5)&\",\"&INDEX(swimmers_data,$B79,1)&\",\"&INDEX(swimmers_data,$B79,2)&\",\"&INDEX(swimmers_data,$B79,4)&\",\"&TEXT(INDEX(swimmers_data,$B79,3),\"ddmmYy\")&\",\"&LEFT(\"000000\",6-LEN(J79))&J79&\",\"&X$11&\",\"&\"F\",\"\")","v":""},{"$f":"IF(AND(ISNUMBER($B79),$B79>0,K79<>\"\"),INDEX(swimmers_data,$B79,5)&\",\"&INDEX(swimmers_data,$B79,1)&\",\"&INDEX(swimmers_data,$B79,2)&\",\"&INDEX(swimmers_data,$B79,4)&\",\"&TEXT(INDEX(swimmers_data,$B79,3),\"ddmmYy\")&\",\"&LEFT(\"000000\",6-LEN(K79))&K79&\",\"&Y$11&\",\"&\"F\",\"\")","v":""},{"$f":"IF(AND(ISNUMBER($B79),$B79>0,L79<>\"\"),INDEX(swimmers_data,$B79,5)&\",\"&INDEX(swimmers_data,$B79,1)&\",\"&INDEX(swimmers_data,$B79,2)&\",\"&INDEX(swimmers_data,$B79,4)&\",\"&TEXT(INDEX(swimmers_data,$B79,3),\"ddmmYy\")&\",\"&LEFT(\"000000\",6-LEN(L79))&L79&\",\"&Z$11&\",\"&\"F\",\"\")","v":""},{"$f":"IF(AND(ISNUMBER($B79),$B79>0,M79<>\"\"),INDEX(swimmers_data,$B79,5)&\",\"&INDEX(swimmers_data,$B79,1)&\",\"&INDEX(swimmers_data,$B79,2)&\",\"&INDEX(swimmers_data,$B79,4)&\",\"&TEXT(INDEX(swimmers_data,$B79,3),\"ddmmYy\")&\",\"&LEFT(\"000000\",6-LEN(M79))&M79&\",\"&AA$11&\",\"&\"F\",\"\")","v":""},{"$f":"IF(AND(ISNUMBER($B79),$B79>0,N79<>\"\"),INDEX(swimmers_data,$B79,5)&\",\"&INDEX(swimmers_data,$B79,1)&\",\"&INDEX(swimmers_data,$B79,2)&\",\"&INDEX(swimmers_data,$B79,4)&\",\"&TEXT(INDEX(swimmers_data,$B79,3),\"ddmmYy\")&\",\"&LEFT(\"000000\",6-LEN(N79))&N79&\",\"&AB$11&\",\"&\"F\",\"\")","v":""},null,null,"","","",{"$f":"IF(AND(ISNUMBER($B79),$B79>0,E79<>\"\"),formatMMSSHHtime(E79),\"\")","v":""},{"$f":"IF(AND(ISNUMBER($B79),$B79>0,F79<>\"\"),formatMMSSHHtime(F79),\"\")","v":""},{"$f":"IF(AND(ISNUMBER($B79),$B79>0,G79<>\"\"),formatMMSSHHtime(G79),\"\")","v":""},{"$f":"IF(AND(ISNUMBER($B79),$B79>0,H79<>\"\"),formatMMSSHHtime(H79),\"\")","v":""},{"$f":"IF(AND(ISNUMBER($B79),$B79>0,I79<>\"\"),formatMMSSHHtime(I79),\"\")","v":""},{"$f":"IF(AND(ISNUMBER($B79),$B79>0,J79<>\"\"),formatMMSSHHtime(J79),\"\")","v":""},{"$f":"IF(AND(ISNUMBER($B79),$B79>0,K79<>\"\"),formatMMSSHHtime(K79),\"\")","v":""},{"$f":"IF(AND(ISNUMBER($B79),$B79>0,L79<>\"\"),formatMMSSHHtime(L79),\"\")","v":""},{"$f":"IF(AND(ISNUMBER($B79),$B79>0,M79<>\"\"),formatMMSSHHtime(M79),\"\")","v":""},{"$f":"IF(AND(ISNUMBER($B79),$B79>0,N79<>\"\"),formatMMSSHHtime(N79),\"\")","v":""}]
["","",{"$f":"IF(AND(ISNUMBER(B80),B80>0),DATEDIF(INDEX(swimmers_data,B80,3),$C$8,\"Y\"),\"\")","v":""},{"$f":"IF(AND(ISNUMBER(B80),B80>0),INDEX(swimmers_data,B80,5),\"\")","v":""},null,null,null,null,null,null,null,null,null,null,null,null,null,null,{"$f":"IF(AND(ISNUMBER($B80),$B80>0,E80<>\"\"),INDEX(swimmers_data,$B80,5)&\",\"&INDEX(swimmers_data,$B80,1)&\",\"&INDEX(swimmers_data,$B80,2)&\",\"&INDEX(swimmers_data,$B80,4)&\",\"&TEXT(INDEX(swimmers_data,$B80,3),\"ddmmYy\")&\",\"&LEFT(\"000000\",6-LEN(E80))&E80&\",\"&S$11&\",\"&\"F\",\"\")","v":""},{"$f":"IF(AND(ISNUMBER($B80),$B80>0,F80<>\"\"),INDEX(swimmers_data,$B80,5)&\",\"&INDEX(swimmers_data,$B80,1)&\",\"&INDEX(swimmers_data,$B80,2)&\",\"&INDEX(swimmers_data,$B80,4)&\",\"&TEXT(INDEX(swimmers_data,$B80,3),\"ddmmYy\")&\",\"&LEFT(\"000000\",6-LEN(F80))&F80&\",\"&T$11&\",\"&\"F\",\"\")","v":""},{"$f":"IF(AND(ISNUMBER($B80),$B80>0,G80<>\"\"),INDEX(swimmers_data,$B80,5)&\",\"&INDEX(swimmers_data,$B80,1)&\",\"&INDEX(swimmers_data,$B80,2)&\",\"&INDEX(swimmers_data,$B80,4)&\",\"&TEXT(INDEX(swimmers_data,$B80,3),\"ddmmYy\")&\",\"&LEFT(\"000000\",6-LEN(G80))&G80&\",\"&U$11&\",\"&\"F\",\"\")","v":""},{"$f":"IF(AND(ISNUMBER($B80),$B80>0,H80<>\"\"),INDEX(swimmers_data,$B80,5)&\",\"&INDEX(swimmers_data,$B80,1)&\",\"&INDEX(swimmers_data,$B80,2)&\",\"&INDEX(swimmers_data,$B80,4)&\",\"&TEXT(INDEX(swimmers_data,$B80,3),\"ddmmYy\")&\",\"&LEFT(\"000000\",6-LEN(H80))&H80&\",\"&V$11&\",\"&\"F\",\"\")","v":""},{"$f":"IF(AND(ISNUMBER($B80),$B80>0,I80<>\"\"),INDEX(swimmers_data,$B80,5)&\",\"&INDEX(swimmers_data,$B80,1)&\",\"&INDEX(swimmers_data,$B80,2)&\",\"&INDEX(swimmers_data,$B80,4)&\",\"&TEXT(INDEX(swimmers_data,$B80,3),\"ddmmYy\")&\",\"&LEFT(\"000000\",6-LEN(I80))&I80&\",\"&W$11&\",\"&\"F\",\"\")","v":""},{"$f":"IF(AND(ISNUMBER($B80),$B80>0,J80<>\"\"),INDEX(swimmers_data,$B80,5)&\",\"&INDEX(swimmers_data,$B80,1)&\",\"&INDEX(swimmers_data,$B80,2)&\",\"&INDEX(swimmers_data,$B80,4)&\",\"&TEXT(INDEX(swimmers_data,$B80,3),\"ddmmYy\")&\",\"&LEFT(\"000000\",6-LEN(J80))&J80&\",\"&X$11&\",\"&\"F\",\"\")","v":""},{"$f":"IF(AND(ISNUMBER($B80),$B80>0,K80<>\"\"),INDEX(swimmers_data,$B80,5)&\",\"&INDEX(swimmers_data,$B80,1)&\",\"&INDEX(swimmers_data,$B80,2)&\",\"&INDEX(swimmers_data,$B80,4)&\",\"&TEXT(INDEX(swimmers_data,$B80,3),\"ddmmYy\")&\",\"&LEFT(\"000000\",6-LEN(K80))&K80&\",\"&Y$11&\",\"&\"F\",\"\")","v":""},{"$f":"IF(AND(ISNUMBER($B80),$B80>0,L80<>\"\"),INDEX(swimmers_data,$B80,5)&\",\"&INDEX(swimmers_data,$B80,1)&\",\"&INDEX(swimmers_data,$B80,2)&\",\"&INDEX(swimmers_data,$B80,4)&\",\"&TEXT(INDEX(swimmers_data,$B80,3),\"ddmmYy\")&\",\"&LEFT(\"000000\",6-LEN(L80))&L80&\",\"&Z$11&\",\"&\"F\",\"\")","v":""},{"$f":"IF(AND(ISNUMBER($B80),$B80>0,M80<>\"\"),INDEX(swimmers_data,$B80,5)&\",\"&INDEX(swimmers_data,$B80,1)&\",\"&INDEX(swimmers_data,$B80,2)&\",\"&INDEX(swimmers_data,$B80,4)&\",\"&TEXT(INDEX(swimmers_data,$B80,3),\"ddmmYy\")&\",\"&LEFT(\"000000\",6-LEN(M80))&M80&\",\"&AA$11&\",\"&\"F\",\"\")","v":""},{"$f":"IF(AND(ISNUMBER($B80),$B80>0,N80<>\"\"),INDEX(swimmers_data,$B80,5)&\",\"&INDEX(swimmers_data,$B80,1)&\",\"&INDEX(swimmers_data,$B80,2)&\",\"&INDEX(swimmers_data,$B80,4)&\",\"&TEXT(INDEX(swimmers_data,$B80,3),\"ddmmYy\")&\",\"&LEFT(\"000000\",6-LEN(N80))&N80&\",\"&AB$11&\",\"&\"F\",\"\")","v":""},null,null,"","","",{"$f":"IF(AND(ISNUMBER($B80),$B80>0,E80<>\"\"),formatMMSSHHtime(E80),\"\")","v":""},{"$f":"IF(AND(ISNUMBER($B80),$B80>0,F80<>\"\"),formatMMSSHHtime(F80),\"\")","v":""},{"$f":"IF(AND(ISNUMBER($B80),$B80>0,G80<>\"\"),formatMMSSHHtime(G80),\"\")","v":""},{"$f":"IF(AND(ISNUMBER($B80),$B80>0,H80<>\"\"),formatMMSSHHtime(H80),\"\")","v":""},{"$f":"IF(AND(ISNUMBER($B80),$B80>0,I80<>\"\"),formatMMSSHHtime(I80),\"\")","v":""},{"$f":"IF(AND(ISNUMBER($B80),$B80>0,J80<>\"\"),formatMMSSHHtime(J80),\"\")","v":""},{"$f":"IF(AND(ISNUMBER($B80),$B80>0,K80<>\"\"),formatMMSSHHtime(K80),\"\")","v":""},{"$f":"IF(AND(ISNUMBER($B80),$B80>0,L80<>\"\"),formatMMSSHHtime(L80),\"\")","v":""},{"$f":"IF(AND(ISNUMBER($B80),$B80>0,M80<>\"\"),formatMMSSHHtime(M80),\"\")","v":""},{"$f":"IF(AND(ISNUMBER($B80),$B80>0,N80<>\"\"),formatMMSSHHtime(N80),\"\")","v":""}]
["","",{"$f":"IF(AND(ISNUMBER(B81),B81>0),DATEDIF(INDEX(swimmers_data,B81,3),$C$8,\"Y\"),\"\")","v":""},{"$f":"IF(AND(ISNUMBER(B81),B81>0),INDEX(swimmers_data,B81,5),\"\")","v":""},null,null,null,null,null,null,null,null,null,null,null,null,null,null,{"$f":"IF(AND(ISNUMBER($B81),$B81>0,E81<>\"\"),INDEX(swimmers_data,$B81,5)&\",\"&INDEX(swimmers_data,$B81,1)&\",\"&INDEX(swimmers_data,$B81,2)&\",\"&INDEX(swimmers_data,$B81,4)&\",\"&TEXT(INDEX(swimmers_data,$B81,3),\"ddmmYy\")&\",\"&LEFT(\"000000\",6-LEN(E81))&E81&\",\"&S$11&\",\"&\"F\",\"\")","v":""},{"$f":"IF(AND(ISNUMBER($B81),$B81>0,F81<>\"\"),INDEX(swimmers_data,$B81,5)&\",\"&INDEX(swimmers_data,$B81,1)&\",\"&INDEX(swimmers_data,$B81,2)&\",\"&INDEX(swimmers_data,$B81,4)&\",\"&TEXT(INDEX(swimmers_data,$B81,3),\"ddmmYy\")&\",\"&LEFT(\"000000\",6-LEN(F81))&F81&\",\"&T$11&\",\"&\"F\",\"\")","v":""},{"$f":"IF(AND(ISNUMBER($B81),$B81>0,G81<>\"\"),INDEX(swimmers_data,$B81,5)&\",\"&INDEX(swimmers_data,$B81,1)&\",\"&INDEX(swimmers_data,$B81,2)&\",\"&INDEX(swimmers_data,$B81,4)&\",\"&TEXT(INDEX(swimmers_data,$B81,3),\"ddmmYy\")&\",\"&LEFT(\"000000\",6-LEN(G81))&G81&\",\"&U$11&\",\"&\"F\",\"\")","v":""},{"$f":"IF(AND(ISNUMBER($B81),$B81>0,H81<>\"\"),INDEX(swimmers_data,$B81,5)&\",\"&INDEX(swimmers_data,$B81,1)&\",\"&INDEX(swimmers_data,$B81,2)&\",\"&INDEX(swimmers_data,$B81,4)&\",\"&TEXT(INDEX(swimmers_data,$B81,3),\"ddmmYy\")&\",\"&LEFT(\"000000\",6-LEN(H81))&H81&\",\"&V$11&\",\"&\"F\",\"\")","v":""},{"$f":"IF(AND(ISNUMBER($B81),$B81>0,I81<>\"\"),INDEX(swimmers_data,$B81,5)&\",\"&INDEX(swimmers_data,$B81,1)&\",\"&INDEX(swimmers_data,$B81,2)&\",\"&INDEX(swimmers_data,$B81,4)&\",\"&TEXT(INDEX(swimmers_data,$B81,3),\"ddmmYy\")&\",\"&LEFT(\"000000\",6-LEN(I81))&I81&\",\"&W$11&\",\"&\"F\",\"\")","v":""},{"$f":"IF(AND(ISNUMBER($B81),$B81>0,J81<>\"\"),INDEX(swimmers_data,$B81,5)&\",\"&INDEX(swimmers_data,$B81,1)&\",\"&INDEX(swimmers_data,$B81,2)&\",\"&INDEX(swimmers_data,$B81,4)&\",\"&TEXT(INDEX(swimmers_data,$B81,3),\"ddmmYy\")&\",\"&LEFT(\"000000\",6-LEN(J81))&J81&\",\"&X$11&\",\"&\"F\",\"\")","v":""},{"$f":"IF(AND(ISNUMBER($B81),$B81>0,K81<>\"\"),INDEX(swimmers_data,$B81,5)&\",\"&INDEX(swimmers_data,$B81,1)&\",\"&INDEX(swimmers_data,$B81,2)&\",\"&INDEX(swimmers_data,$B81,4)&\",\"&TEXT(INDEX(swimmers_data,$B81,3),\"ddmmYy\")&\",\"&LEFT(\"000000\",6-LEN(K81))&K81&\",\"&Y$11&\",\"&\"F\",\"\")","v":""},{"$f":"IF(AND(ISNUMBER($B81),$B81>0,L81<>\"\"),INDEX(swimmers_data,$B81,5)&\",\"&INDEX(swimmers_data,$B81,1)&\",\"&INDEX(swimmers_data,$B81,2)&\",\"&INDEX(swimmers_data,$B81,4)&\",\"&TEXT(INDEX(swimmers_data,$B81,3),\"ddmmYy\")&\",\"&LEFT(\"000000\",6-LEN(L81))&L81&\",\"&Z$11&\",\"&\"F\",\"\")","v":""},{"$f":"IF(AND(ISNUMBER($B81),$B81>0,M81<>\"\"),INDEX(swimmers_data,$B81,5)&\",\"&INDEX(swimmers_data,$B81,1)&\",\"&INDEX(swimmers_data,$B81,2)&\",\"&INDEX(swimmers_data,$B81,4)&\",\"&TEXT(INDEX(swimmers_data,$B81,3),\"ddmmYy\")&\",\"&LEFT(\"000000\",6-LEN(M81))&M81&\",\"&AA$11&\",\"&\"F\",\"\")","v":""},{"$f":"IF(AND(ISNUMBER($B81),$B81>0,N81<>\"\"),INDEX(swimmers_data,$B81,5)&\",\"&INDEX(swimmers_data,$B81,1)&\",\"&INDEX(swimmers_data,$B81,2)&\",\"&INDEX(swimmers_data,$B81,4)&\",\"&TEXT(INDEX(swimmers_data,$B81,3),\"ddmmYy\")&\",\"&LEFT(\"000000\",6-LEN(N81))&N81&\",\"&AB$11&\",\"&\"F\",\"\")","v":""},null,null,"","","",{"$f":"IF(AND(ISNUMBER($B81),$B81>0,E81<>\"\"),formatMMSSHHtime(E81),\"\")","v":""},{"$f":"IF(AND(ISNUMBER($B81),$B81>0,F81<>\"\"),formatMMSSHHtime(F81),\"\")","v":""},{"$f":"IF(AND(ISNUMBER($B81),$B81>0,G81<>\"\"),formatMMSSHHtime(G81),\"\")","v":""},{"$f":"IF(AND(ISNUMBER($B81),$B81>0,H81<>\"\"),formatMMSSHHtime(H81),\"\")","v":""},{"$f":"IF(AND(ISNUMBER($B81),$B81>0,I81<>\"\"),formatMMSSHHtime(I81),\"\")","v":""},{"$f":"IF(AND(ISNUMBER($B81),$B81>0,J81<>\"\"),formatMMSSHHtime(J81),\"\")","v":""},{"$f":"IF(AND(ISNUMBER($B81),$B81>0,K81<>\"\"),formatMMSSHHtime(K81),\"\")","v":""},{"$f":"IF(AND(ISNUMBER($B81),$B81>0,L81<>\"\"),formatMMSSHHtime(L81),\"\")","v":""},{"$f":"IF(AND(ISNUMBER($B81),$B81>0,M81<>\"\"),formatMMSSHHtime(M81),\"\")","v":""},{"$f":"IF(AND(ISNUMBER($B81),$B81>0,N81<>\"\"),formatMMSSHHtime(N81),\"\")","v":""}]
["","",{"$f":"IF(AND(ISNUMBER(B82),B82>0),DATEDIF(INDEX(swimmers_data,B82,3),$C$8,\"Y\"),\"\")","v":""},{"$f":"IF(AND(ISNUMBER(B82),B82>0),INDEX(swimmers_data,B82,5),\"\")","v":""},null,null,null,null,null,null,null,null,null,null,null,null,null,null,{"$f":"IF(AND(ISNUMBER($B82),$B82>0,E82<>\"\"),INDEX(swimmers_data,$B82,5)&\",\"&INDEX(swimmers_data,$B82,1)&\",\"&INDEX(swimmers_data,$B82,2)&\",\"&INDEX(swimmers_data,$B82,4)&\",\"&TEXT(INDEX(swimmers_data,$B82,3),\"ddmmYy\")&\",\"&LEFT(\"000000\",6-LEN(E82))&E82&\",\"&S$11&\",\"&\"F\",\"\")","v":""},{"$f":"IF(AND(ISNUMBER($B82),$B82>0,F82<>\"\"),INDEX(swimmers_data,$B82,5)&\",\"&INDEX(swimmers_data,$B82,1)&\",\"&INDEX(swimmers_data,$B82,2)&\",\"&INDEX(swimmers_data,$B82,4)&\",\"&TEXT(INDEX(swimmers_data,$B82,3),\"ddmmYy\")&\",\"&LEFT(\"000000\",6-LEN(F82))&F82&\",\"&T$11&\",\"&\"F\",\"\")","v":""},{"$f":"IF(AND(ISNUMBER($B82),$B82>0,G82<>\"\"),INDEX(swimmers_data,$B82,5)&\",\"&INDEX(swimmers_data,$B82,1)&\",\"&INDEX(swimmers_data,$B82,2)&\",\"&INDEX(swimmers_data,$B82,4)&\",\"&TEXT(INDEX(swimmers_data,$B82,3),\"ddmmYy\")&\",\"&LEFT(\"000000\",6-LEN(G82))&G82&\",\"&U$11&\",\"&\"F\",\"\")","v":""},{"$f":"IF(AND(ISNUMBER($B82),$B82>0,H82<>\"\"),INDEX(swimmers_data,$B82,5)&\",\"&INDEX(swimmers_data,$B82,1)&\",\"&INDEX(swimmers_data,$B82,2)&\",\"&INDEX(swimmers_data,$B82,4)&\",\"&TEXT(INDEX(swimmers_data,$B82,3),\"ddmmYy\")&\",\"&LEFT(\"000000\",6-LEN(H82))&H82&\",\"&V$11&\",\"&\"F\",\"\")","v":""},{"$f":"IF(AND(ISNUMBER($B82),$B82>0,I82<>\"\"),INDEX(swimmers_data,$B82,5)&\",\"&INDEX(swimmers_data,$B82,1)&\",\"&INDEX(swimmers_data,$B82,2)&\",\"&INDEX(swimmers_data,$B82,4)&\",\"&TEXT(INDEX(swimmers_data,$B82,3),\"ddmmYy\")&\",\"&LEFT(\"000000\",6-LEN(I82))&I82&\",\"&W$11&\",\"&\"F\",\"\")","v":""},{"$f":"IF(AND(ISNUMBER($B82),$B82>0,J82<>\"\"),INDEX(swimmers_data,$B82,5)&\",\"&INDEX(swimmers_data,$B82,1)&\",\"&INDEX(swimmers_data,$B82,2)&\",\"&INDEX(swimmers_data,$B82,4)&\",\"&TEXT(INDEX(swimmers_data,$B82,3),\"ddmmYy\")&\",\"&LEFT(\"000000\",6-LEN(J82))&J82&\",\"&X$11&\",\"&\"F\",\"\")","v":""},{"$f":"IF(AND(ISNUMBER($B82),$B82>0,K82<>\"\"),INDEX(swimmers_data,$B82,5)&\",\"&INDEX(swimmers_data,$B82,1)&\",\"&INDEX(swimmers_data,$B82,2)&\",\"&INDEX(swimmers_data,$B82,4)&\",\"&TEXT(INDEX(swimmers_data,$B82,3),\"ddmmYy\")&\",\"&LEFT(\"000000\",6-LEN(K82))&K82&\",\"&Y$11&\",\"&\"F\",\"\")","v":""},{"$f":"IF(AND(ISNUMBER($B82),$B82>0,L82<>\"\"),INDEX(swimmers_data,$B82,5)&\",\"&INDEX(swimmers_data,$B82,1)&\",\"&INDEX(swimmers_data,$B82,2)&\",\"&INDEX(swimmers_data,$B82,4)&\",\"&TEXT(INDEX(swimmers_data,$B82,3),\"ddmmYy\")&\",\"&LEFT(\"000000\",6-LEN(L82))&L82&\",\"&Z$11&\",\"&\"F\",\"\")","v":""},{"$f":"IF(AND(ISNUMBER($B82),$B82>0,M82<>\"\"),INDEX(swimmers_data,$B82,5)&\",\"&INDEX(swimmers_data,$B82,1)&\",\"&INDEX(swimmers_data,$B82,2)&\",\"&INDEX(swimmers_data,$B82,4)&\",\"&TEXT(INDEX(swimmers_data,$B82,3),\"ddmmYy\")&\",\"&LEFT(\"000000\",6-LEN(M82))&M82&\",\"&AA$11&\",\"&\"F\",\"\")","v":""},{"$f":"IF(AND(ISNUMBER($B82),$B82>0,N82<>\"\"),INDEX(swimmers_data,$B82,5)&\",\"&INDEX(swimmers_data,$B82,1)&\",\"&INDEX(swimmers_data,$B82,2)&\",\"&INDEX(swimmers_data,$B82,4)&\",\"&TEXT(INDEX(swimmers_data,$B82,3),\"ddmmYy\")&\",\"&LEFT(\"000000\",6-LEN(N82))&N82&\",\"&AB$11&\",\"&\"F\",\"\")","v":""},null,null,"","","",{"$f":"IF(AND(ISNUMBER($B82),$B82>0,E82<>\"\"),formatMMSSHHtime(E82),\"\")","v":""},{"$f":"IF(AND(ISNUMBER($B82),$B82>0,F82<>\"\"),formatMMSSHHtime(F82),\"\")","v":""},{"$f":"IF(AND(ISNUMBER($B82),$B82>0,G82<>\"\"),formatMMSSHHtime(G82),\"\")","v":""},{"$f":"IF(AND(ISNUMBER($B82),$B82>0,H82<>\"\"),formatMMSSHHtime(H82),\"\")","v":""},{"$f":"IF(AND(ISNUMBER($B82),$B82>0,I82<>\"\"),formatMMSSHHtime(I82),\"\")","v":""},{"$f":"IF(AND(ISNUMBER($B82),$B82>0,J82<>\"\"),formatMMSSHHtime(J82),\"\")","v":""},{"$f":"IF(AND(ISNUMBER($B82),$B82>0,K82<>\"\"),formatMMSSHHtime(K82),\"\")","v":""},{"$f":"IF(AND(ISNUMBER($B82),$B82>0,L82<>\"\"),formatMMSSHHtime(L82),\"\")","v":""},{"$f":"IF(AND(ISNUMBER($B82),$B82>0,M82<>\"\"),formatMMSSHHtime(M82),\"\")","v":""},{"$f":"IF(AND(ISNUMBER($B82),$B82>0,N82<>\"\"),formatMMSSHHtime(N82),\"\")","v":""}]
["","",{"$f":"IF(AND(ISNUMBER(B83),B83>0),DATEDIF(INDEX(swimmers_data,B83,3),$C$8,\"Y\"),\"\")","v":""},{"$f":"IF(AND(ISNUMBER(B83),B83>0),INDEX(swimmers_data,B83,5),\"\")","v":""},null,null,null,null,null,null,null,null,null,null,null,null,null,null,{"$f":"IF(AND(ISNUMBER($B83),$B83>0,E83<>\"\"),INDEX(swimmers_data,$B83,5)&\",\"&INDEX(swimmers_data,$B83,1)&\",\"&INDEX(swimmers_data,$B83,2)&\",\"&INDEX(swimmers_data,$B83,4)&\",\"&TEXT(INDEX(swimmers_data,$B83,3),\"ddmmYy\")&\",\"&LEFT(\"000000\",6-LEN(E83))&E83&\",\"&S$11&\",\"&\"F\",\"\")","v":""},{"$f":"IF(AND(ISNUMBER($B83),$B83>0,F83<>\"\"),INDEX(swimmers_data,$B83,5)&\",\"&INDEX(swimmers_data,$B83,1)&\",\"&INDEX(swimmers_data,$B83,2)&\",\"&INDEX(swimmers_data,$B83,4)&\",\"&TEXT(INDEX(swimmers_data,$B83,3),\"ddmmYy\")&\",\"&LEFT(\"000000\",6-LEN(F83))&F83&\",\"&T$11&\",\"&\"F\",\"\")","v":""},{"$f":"IF(AND(ISNUMBER($B83),$B83>0,G83<>\"\"),INDEX(swimmers_data,$B83,5)&\",\"&INDEX(swimmers_data,$B83,1)&\",\"&INDEX(swimmers_data,$B83,2)&\",\"&INDEX(swimmers_data,$B83,4)&\",\"&TEXT(INDEX(swimmers_data,$B83,3),\"ddmmYy\")&\",\"&LEFT(\"000000\",6-LEN(G83))&G83&\",\"&U$11&\",\"&\"F\",\"\")","v":""},{"$f":"IF(AND(ISNUMBER($B83),$B83>0,H83<>\"\"),INDEX(swimmers_data,$B83,5)&\",\"&INDEX(swimmers_data,$B83,1)&\",\"&INDEX(swimmers_data,$B83,2)&\",\"&INDEX(swimmers_data,$B83,4)&\",\"&TEXT(INDEX(swimmers_data,$B83,3),\"ddmmYy\")&\",\"&LEFT(\"000000\",6-LEN(H83))&H83&\",\"&V$11&\",\"&\"F\",\"\")","v":""},{"$f":"IF(AND(ISNUMBER($B83),$B83>0,I83<>\"\"),INDEX(swimmers_data,$B83,5)&\",\"&INDEX(swimmers_data,$B83,1)&\",\"&INDEX(swimmers_data,$B83,2)&\",\"&INDEX(swimmers_data,$B83,4)&\",\"&TEXT(INDEX(swimmers_data,$B83,3),\"ddmmYy\")&\",\"&LEFT(\"000000\",6-LEN(I83))&I83&\",\"&W$11&\",\"&\"F\",\"\")","v":""},{"$f":"IF(AND(ISNUMBER($B83),$B83>0,J83<>\"\"),INDEX(swimmers_data,$B83,5)&\",\"&INDEX(swimmers_data,$B83,1)&\",\"&INDEX(swimmers_data,$B83,2)&\",\"&INDEX(swimmers_data,$B83,4)&\",\"&TEXT(INDEX(swimmers_data,$B83,3),\"ddmmYy\")&\",\"&LEFT(\"000000\",6-LEN(J83))&J83&\",\"&X$11&\",\"&\"F\",\"\")","v":""},{"$f":"IF(AND(ISNUMBER($B83),$B83>0,K83<>\"\"),INDEX(swimmers_data,$B83,5)&\",\"&INDEX(swimmers_data,$B83,1)&\",\"&INDEX(swimmers_data,$B83,2)&\",\"&INDEX(swimmers_data,$B83,4)&\",\"&TEXT(INDEX(swimmers_data,$B83,3),\"ddmmYy\")&\",\"&LEFT(\"000000\",6-LEN(K83))&K83&\",\"&Y$11&\",\"&\"F\",\"\")","v":""},{"$f":"IF(AND(ISNUMBER($B83),$B83>0,L83<>\"\"),INDEX(swimmers_data,$B83,5)&\",\"&INDEX(swimmers_data,$B83,1)&\",\"&INDEX(swimmers_data,$B83,2)&\",\"&INDEX(swimmers_data,$B83,4)&\",\"&TEXT(INDEX(swimmers_data,$B83,3),\"ddmmYy\")&\",\"&LEFT(\"000000\",6-LEN(L83))&L83&\",\"&Z$11&\",\"&\"F\",\"\")","v":""},{"$f":"IF(AND(ISNUMBER($B83),$B83>0,M83<>\"\"),INDEX(swimmers_data,$B83,5)&\",\"&INDEX(swimmers_data,$B83,1)&\",\"&INDEX(swimmers_data,$B83,2)&\",\"&INDEX(swimmers_data,$B83,4)&\",\"&TEXT(INDEX(swimmers_data,$B83,3),\"ddmmYy\")&\",\"&LEFT(\"000000\",6-LEN(M83))&M83&\",\"&AA$11&\",\"&\"F\",\"\")","v":""},{"$f":"IF(AND(ISNUMBER($B83),$B83>0,N83<>\"\"),INDEX(swimmers_data,$B83,5)&\",\"&INDEX(swimmers_data,$B83,1)&\",\"&INDEX(swimmers_data,$B83,2)&\",\"&INDEX(swimmers_data,$B83,4)&\",\"&TEXT(INDEX(swimmers_data,$B83,3),\"ddmmYy\")&\",\"&LEFT(\"000000\",6-LEN(N83))&N83&\",\"&AB$11&\",\"&\"F\",\"\")","v":""},null,null,"","","",{"$f":"IF(AND(ISNUMBER($B83),$B83>0,E83<>\"\"),formatMMSSHHtime(E83),\"\")","v":""},{"$f":"IF(AND(ISNUMBER($B83),$B83>0,F83<>\"\"),formatMMSSHHtime(F83),\"\")","v":""},{"$f":"IF(AND(ISNUMBER($B83),$B83>0,G83<>\"\"),formatMMSSHHtime(G83),\"\")","v":""},{"$f":"IF(AND(ISNUMBER($B83),$B83>0,H83<>\"\"),formatMMSSHHtime(H83),\"\")","v":""},{"$f":"IF(AND(ISNUMBER($B83),$B83>0,I83<>\"\"),formatMMSSHHtime(I83),\"\")","v":""},{"$f":"IF(AND(ISNUMBER($B83),$B83>0,J83<>\"\"),formatMMSSHHtime(J83),\"\")","v":""},{"$f":"IF(AND(ISNUMBER($B83),$B83>0,K83<>\"\"),formatMMSSHHtime(K83),\"\")","v":""},{"$f":"IF(AND(ISNUMBER($B83),$B83>0,L83<>\"\"),formatMMSSHHtime(L83),\"\")","v":""},{"$f":"IF(AND(ISNUMBER($B83),$B83>0,M83<>\"\"),formatMMSSHHtime(M83),\"\")","v":""},{"$f":"IF(AND(ISNUMBER($B83),$B83>0,N83<>\"\"),formatMMSSHHtime(N83),\"\")","v":""}]
["","",{"$f":"IF(AND(ISNUMBER(B84),B84>0),DATEDIF(INDEX(swimmers_data,B84,3),$C$8,\"Y\"),\"\")","v":""},{"$f":"IF(AND(ISNUMBER(B84),B84>0),INDEX(swimmers_data,B84,5),\"\")","v":""},null,null,null,null,null,null,null,null,null,null,null,null,null,null,{"$f":"IF(AND(ISNUMBER($B84),$B84>0,E84<>\"\"),INDEX(swimmers_data,$B84,5)&\",\"&INDEX(swimmers_data,$B84,1)&\",\"&INDEX(swimmers_data,$B84,2)&\",\"&INDEX(swimmers_data,$B84,4)&\",\"&TEXT(INDEX(swimmers_data,$B84,3),\"ddmmYy\")&\",\"&LEFT(\"000000\",6-LEN(E84))&E84&\",\"&S$11&\",\"&\"F\",\"\")","v":""},{"$f":"IF(AND(ISNUMBER($B84),$B84>0,F84<>\"\"),INDEX(swimmers_data,$B84,5)&\",\"&INDEX(swimmers_data,$B84,1)&\",\"&INDEX(swimmers_data,$B84,2)&\",\"&INDEX(swimmers_data,$B84,4)&\",\"&TEXT(INDEX(swimmers_data,$B84,3),\"ddmmYy\")&\",\"&LEFT(\"000000\",6-LEN(F84))&F84&\",\"&T$11&\",\"&\"F\",\"\")","v":""},{"$f":"IF(AND(ISNUMBER($B84),$B84>0,G84<>\"\"),INDEX(swimmers_data,$B84,5)&\",\"&INDEX(swimmers_data,$B84,1)&\",\"&INDEX(swimmers_data,$B84,2)&\",\"&INDEX(swimmers_data,$B84,4)&\",\"&TEXT(INDEX(swimmers_data,$B84,3),\"ddmmYy\")&\",\"&LEFT(\"000000\",6-LEN(G84))&G84&\",\"&U$11&\",\"&\"F\",\"\")","v":""},{"$f":"IF(AND(ISNUMBER($B84),$B84>0,H84<>\"\"),INDEX(swimmers_data,$B84,5)&\",\"&INDEX(swimmers_data,$B84,1)&\",\"&INDEX(swimmers_data,$B84,2)&\",\"&INDEX(swimmers_data,$B84,4)&\",\"&TEXT(INDEX(swimmers_data,$B84,3),\"ddmmYy\")&\",\"&LEFT(\"000000\",6-LEN(H84))&H84&\",\"&V$11&\",\"&\"F\",\"\")","v":""},{"$f":"IF(AND(ISNUMBER($B84),$B84>0,I84<>\"\"),INDEX(swimmers_data,$B84,5)&\",\"&INDEX(swimmers_data,$B84,1)&\",\"&INDEX(swimmers_data,$B84,2)&\",\"&INDEX(swimmers_data,$B84,4)&\",\"&TEXT(INDEX(swimmers_data,$B84,3),\"ddmmYy\")&\",\"&LEFT(\"000000\",6-LEN(I84))&I84&\",\"&W$11&\",\"&\"F\",\"\")","v":""},{"$f":"IF(AND(ISNUMBER($B84),$B84>0,J84<>\"\"),INDEX(swimmers_data,$B84,5)&\",\"&INDEX(swimmers_data,$B84,1)&\",\"&INDEX(swimmers_data,$B84,2)&\",\"&INDEX(swimmers_data,$B84,4)&\",\"&TEXT(INDEX(swimmers_data,$B84,3),\"ddmmYy\")&\",\"&LEFT(\"000000\",6-LEN(J84))&J84&\",\"&X$11&\",\"&\"F\",\"\")","v":""},{"$f":"IF(AND(ISNUMBER($B84),$B84>0,K84<>\"\"),INDEX(swimmers_data,$B84,5)&\",\"&INDEX(swimmers_data,$B84,1)&\",\"&INDEX(swimmers_data,$B84,2)&\",\"&INDEX(swimmers_data,$B84,4)&\",\"&TEXT(INDEX(swimmers_data,$B84,3),\"ddmmYy\")&\",\"&LEFT(\"000000\",6-LEN(K84))&K84&\",\"&Y$11&\",\"&\"F\",\"\")","v":""},{"$f":"IF(AND(ISNUMBER($B84),$B84>0,L84<>\"\"),INDEX(swimmers_data,$B84,5)&\",\"&INDEX(swimmers_data,$B84,1)&\",\"&INDEX(swimmers_data,$B84,2)&\",\"&INDEX(swimmers_data,$B84,4)&\",\"&TEXT(INDEX(swimmers_data,$B84,3),\"ddmmYy\")&\",\"&LEFT(\"000000\",6-LEN(L84))&L84&\",\"&Z$11&\",\"&\"F\",\"\")","v":""},{"$f":"IF(AND(ISNUMBER($B84),$B84>0,M84<>\"\"),INDEX(swimmers_data,$B84,5)&\",\"&INDEX(swimmers_data,$B84,1)&\",\"&INDEX(swimmers_data,$B84,2)&\",\"&INDEX(swimmers_data,$B84,4)&\",\"&TEXT(INDEX(swimmers_data,$B84,3),\"ddmmYy\")&\",\"&LEFT(\"000000\",6-LEN(M84))&M84&\",\"&AA$11&\",\"&\"F\",\"\")","v":""},{"$f":"IF(AND(ISNUMBER($B84),$B84>0,N84<>\"\"),INDEX(swimmers_data,$B84,5)&\",\"&INDEX(swimmers_data,$B84,1)&\",\"&INDEX(swimmers_data,$B84,2)&\",\"&INDEX(swimmers_data,$B84,4)&\",\"&TEXT(INDEX(swimmers_data,$B84,3),\"ddmmYy\")&\",\"&LEFT(\"000000\",6-LEN(N84))&N84&\",\"&AB$11&\",\"&\"F\",\"\")","v":""},null,null,"","","",{"$f":"IF(AND(ISNUMBER($B84),$B84>0,E84<>\"\"),formatMMSSHHtime(E84),\"\")","v":""},{"$f":"IF(AND(ISNUMBER($B84),$B84>0,F84<>\"\"),formatMMSSHHtime(F84),\"\")","v":""},{"$f":"IF(AND(ISNUMBER($B84),$B84>0,G84<>\"\"),formatMMSSHHtime(G84),\"\")","v":""},{"$f":"IF(AND(ISNUMBER($B84),$B84>0,H84<>\"\"),formatMMSSHHtime(H84),\"\")","v":""},{"$f":"IF(AND(ISNUMBER($B84),$B84>0,I84<>\"\"),formatMMSSHHtime(I84),\"\")","v":""},{"$f":"IF(AND(ISNUMBER($B84),$B84>0,J84<>\"\"),formatMMSSHHtime(J84),\"\")","v":""},{"$f":"IF(AND(ISNUMBER($B84),$B84>0,K84<>\"\"),formatMMSSHHtime(K84),\"\")","v":""},{"$f":"IF(AND(ISNUMBER($B84),$B84>0,L84<>\"\"),formatMMSSHHtime(L84),\"\")","v":""},{"$f":"IF(AND(ISNUMBER($B84),$B84>0,M84<>\"\"),formatMMSSHHtime(M84),\"\")","v":""},{"$f":"IF(AND(ISNUMBER($B84),$B84>0,N84<>\"\"),formatMMSSHHtime(N84),\"\")","v":""}]
["","",{"$f":"IF(AND(ISNUMBER(B85),B85>0),DATEDIF(INDEX(swimmers_data,B85,3),$C$8,\"Y\"),\"\")","v":""},{"$f":"IF(AND(ISNUMBER(B85),B85>0),INDEX(swimmers_data,B85,5),\"\")","v":""},null,null,null,null,null,null,null,null,null,null,null,null,null,null,{"$f":"IF(AND(ISNUMBER($B85),$B85>0,E85<>\"\"),INDEX(swimmers_data,$B85,5)&\",\"&INDEX(swimmers_data,$B85,1)&\",\"&INDEX(swimmers_data,$B85,2)&\",\"&INDEX(swimmers_data,$B85,4)&\",\"&TEXT(INDEX(swimmers_data,$B85,3),\"ddmmYy\")&\",\"&LEFT(\"000000\",6-LEN(E85))&E85&\",\"&S$11&\",\"&\"F\",\"\")","v":""},{"$f":"IF(AND(ISNUMBER($B85),$B85>0,F85<>\"\"),INDEX(swimmers_data,$B85,5)&\",\"&INDEX(swimmers_data,$B85,1)&\",\"&INDEX(swimmers_data,$B85,2)&\",\"&INDEX(swimmers_data,$B85,4)&\",\"&TEXT(INDEX(swimmers_data,$B85,3),\"ddmmYy\")&\",\"&LEFT(\"000000\",6-LEN(F85))&F85&\",\"&T$11&\",\"&\"F\",\"\")","v":""},{"$f":"IF(AND(ISNUMBER($B85),$B85>0,G85<>\"\"),INDEX(swimmers_data,$B85,5)&\",\"&INDEX(swimmers_data,$B85,1)&\",\"&INDEX(swimmers_data,$B85,2)&\",\"&INDEX(swimmers_data,$B85,4)&\",\"&TEXT(INDEX(swimmers_data,$B85,3),\"ddmmYy\")&\",\"&LEFT(\"000000\",6-LEN(G85))&G85&\",\"&U$11&\",\"&\"F\",\"\")","v":""},{"$f":"IF(AND(ISNUMBER($B85),$B85>0,H85<>\"\"),INDEX(swimmers_data,$B85,5)&\",\"&INDEX(swimmers_data,$B85,1)&\",\"&INDEX(swimmers_data,$B85,2)&\",\"&INDEX(swimmers_data,$B85,4)&\",\"&TEXT(INDEX(swimmers_data,$B85,3),\"ddmmYy\")&\",\"&LEFT(\"000000\",6-LEN(H85))&H85&\",\"&V$11&\",\"&\"F\",\"\")","v":""},{"$f":"IF(AND(ISNUMBER($B85),$B85>0,I85<>\"\"),INDEX(swimmers_data,$B85,5)&\",\"&INDEX(swimmers_data,$B85,1)&\",\"&INDEX(swimmers_data,$B85,2)&\",\"&INDEX(swimmers_data,$B85,4)&\",\"&TEXT(INDEX(swimmers_data,$B85,3),\"ddmmYy\")&\",\"&LEFT(\"000000\",6-LEN(I85))&I85&\",\"&W$11&\",\"&\"F\",\"\")","v":""},{"$f":"IF(AND(ISNUMBER($B85),$B85>0,J85<>\"\"),INDEX(swimmers_data,$B85,5)&\",\"&INDEX(swimmers_data,$B85,1)&\",\"&INDEX(swimmers_data,$B85,2)&\",\"&INDEX(swimmers_data,$B85,4)&\",\"&TEXT(INDEX(swimmers_data,$B85,3),\"ddmmYy\")&\",\"&LEFT(\"000000\",6-LEN(J85))&J85&\",\"&X$11&\",\"&\"F\",\"\")","v":""},{"$f":"IF(AND(ISNUMBER($B85),$B85>0,K85<>\"\"),INDEX(swimmers_data,$B85,5)&\",\"&INDEX(swimmers_data,$B85,1)&\",\"&INDEX(swimmers_data,$B85,2)&\",\"&INDEX(swimmers_data,$B85,4)&\",\"&TEXT(INDEX(swimmers_data,$B85,3),\"ddmmYy\")&\",\"&LEFT(\"000000\",6-LEN(K85))&K85&\",\"&Y$11&\",\"&\"F\",\"\")","v":""},{"$f":"IF(AND(ISNUMBER($B85),$B85>0,L85<>\"\"),INDEX(swimmers_data,$B85,5)&\",\"&INDEX(swimmers_data,$B85,1)&\",\"&INDEX(swimmers_data,$B85,2)&\",\"&INDEX(swimmers_data,$B85,4)&\",\"&TEXT(INDEX(swimmers_data,$B85,3),\"ddmmYy\")&\",\"&LEFT(\"000000\",6-LEN(L85))&L85&\",\"&Z$11&\",\"&\"F\",\"\")","v":""},{"$f":"IF(AND(ISNUMBER($B85),$B85>0,M85<>\"\"),INDEX(swimmers_data,$B85,5)&\",\"&INDEX(swimmers_data,$B85,1)&\",\"&INDEX(swimmers_data,$B85,2)&\",\"&INDEX(swimmers_data,$B85,4)&\",\"&TEXT(INDEX(swimmers_data,$B85,3),\"ddmmYy\")&\",\"&LEFT(\"000000\",6-LEN(M85))&M85&\",\"&AA$11&\",\"&\"F\",\"\")","v":""},{"$f":"IF(AND(ISNUMBER($B85),$B85>0,N85<>\"\"),INDEX(swimmers_data,$B85,5)&\",\"&INDEX(swimmers_data,$B85,1)&\",\"&INDEX(swimmers_data,$B85,2)&\",\"&INDEX(swimmers_data,$B85,4)&\",\"&TEXT(INDEX(swimmers_data,$B85,3),\"ddmmYy\")&\",\"&LEFT(\"000000\",6-LEN(N85))&N85&\",\"&AB$11&\",\"&\"F\",\"\")","v":""},null,null,"","","",{"$f":"IF(AND(ISNUMBER($B85),$B85>0,E85<>\"\"),formatMMSSHHtime(E85),\"\")","v":""},{"$f":"IF(AND(ISNUMBER($B85),$B85>0,F85<>\"\"),formatMMSSHHtime(F85),\"\")","v":""},{"$f":"IF(AND(ISNUMBER($B85),$B85>0,G85<>\"\"),formatMMSSHHtime(G85),\"\")","v":""},{"$f":"IF(AND(ISNUMBER($B85),$B85>0,H85<>\"\"),formatMMSSHHtime(H85),\"\")","v":""},{"$f":"IF(AND(ISNUMBER($B85),$B85>0,I85<>\"\"),formatMMSSHHtime(I85),\"\")","v":""},{"$f":"IF(AND(ISNUMBER($B85),$B85>0,J85<>\"\"),formatMMSSHHtime(J85),\"\")","v":""},{"$f":"IF(AND(ISNUMBER($B85),$B85>0,K85<>\"\"),formatMMSSHHtime(K85),\"\")","v":""},{"$f":"IF(AND(ISNUMBER($B85),$B85>0,L85<>\"\"),formatMMSSHHtime(L85),\"\")","v":""},{"$f":"IF(AND(ISNUMBER($B85),$B85>0,M85<>\"\"),formatMMSSHHtime(M85),\"\")","v":""},{"$f":"IF(AND(ISNUMBER($B85),$B85>0,N85<>\"\"),formatMMSSHHtime(N85),\"\")","v":""}]
["","",{"$f":"IF(AND(ISNUMBER(B86),B86>0),DATEDIF(INDEX(swimmers_data,B86,3),$C$8,\"Y\"),\"\")","v":""},{"$f":"IF(AND(ISNUMBER(B86),B86>0),INDEX(swimmers_data,B86,5),\"\")","v":""},null,null,null,null,null,null,null,null,null,null,null,null,null,null,{"$f":"IF(AND(ISNUMBER($B86),$B86>0,E86<>\"\"),INDEX(swimmers_data,$B86,5)&\",\"&INDEX(swimmers_data,$B86,1)&\",\"&INDEX(swimmers_data,$B86,2)&\",\"&INDEX(swimmers_data,$B86,4)&\",\"&TEXT(INDEX(swimmers_data,$B86,3),\"ddmmYy\")&\",\"&LEFT(\"000000\",6-LEN(E86))&E86&\",\"&S$11&\",\"&\"F\",\"\")","v":""},{"$f":"IF(AND(ISNUMBER($B86),$B86>0,F86<>\"\"),INDEX(swimmers_data,$B86,5)&\",\"&INDEX(swimmers_data,$B86,1)&\",\"&INDEX(swimmers_data,$B86,2)&\",\"&INDEX(swimmers_data,$B86,4)&\",\"&TEXT(INDEX(swimmers_data,$B86,3),\"ddmmYy\")&\",\"&LEFT(\"000000\",6-LEN(F86))&F86&\",\"&T$11&\",\"&\"F\",\"\")","v":""},{"$f":"IF(AND(ISNUMBER($B86),$B86>0,G86<>\"\"),INDEX(swimmers_data,$B86,5)&\",\"&INDEX(swimmers_data,$B86,1)&\",\"&INDEX(swimmers_data,$B86,2)&\",\"&INDEX(swimmers_data,$B86,4)&\",\"&TEXT(INDEX(swimmers_data,$B86,3),\"ddmmYy\")&\",\"&LEFT(\"000000\",6-LEN(G86))&G86&\",\"&U$11&\",\"&\"F\",\"\")","v":""},{"$f":"IF(AND(ISNUMBER($B86),$B86>0,H86<>\"\"),INDEX(swimmers_data,$B86,5)&\",\"&INDEX(swimmers_data,$B86,1)&\",\"&INDEX(swimmers_data,$B86,2)&\",\"&INDEX(swimmers_data,$B86,4)&\",\"&TEXT(INDEX(swimmers_data,$B86,3),\"ddmmYy\")&\",\"&LEFT(\"000000\",6-LEN(H86))&H86&\",\"&V$11&\",\"&\"F\",\"\")","v":""},{"$f":"IF(AND(ISNUMBER($B86),$B86>0,I86<>\"\"),INDEX(swimmers_data,$B86,5)&\",\"&INDEX(swimmers_data,$B86,1)&\",\"&INDEX(swimmers_data,$B86,2)&\",\"&INDEX(swimmers_data,$B86,4)&\",\"&TEXT(INDEX(swimmers_data,$B86,3),\"ddmmYy\")&\",\"&LEFT(\"000000\",6-LEN(I86))&I86&\",\"&W$11&\",\"&\"F\",\"\")","v":""},{"$f":"IF(AND(ISNUMBER($B86),$B86>0,J86<>\"\"),INDEX(swimmers_data,$B86,5)&\",\"&INDEX(swimmers_data,$B86,1)&\",\"&INDEX(swimmers_data,$B86,2)&\",\"&INDEX(swimmers_data,$B86,4)&\",\"&TEXT(INDEX(swimmers_data,$B86,3),\"ddmmYy\")&\",\"&LEFT(\"000000\",6-LEN(J86))&J86&\",\"&X$11&\",\"&\"F\",\"\")","v":""},{"$f":"IF(AND(ISNUMBER($B86),$B86>0,K86<>\"\"),INDEX(swimmers_data,$B86,5)&\",\"&INDEX(swimmers_data,$B86,1)&\",\"&INDEX(swimmers_data,$B86,2)&\",\"&INDEX(swimmers_data,$B86,4)&\",\"&TEXT(INDEX(swimmers_data,$B86,3),\"ddmmYy\")&\",\"&LEFT(\"000000\",6-LEN(K86))&K86&\",\"&Y$11&\",\"&\"F\",\"\")","v":""},{"$f":"IF(AND(ISNUMBER($B86),$B86>0,L86<>\"\"),INDEX(swimmers_data,$B86,5)&\",\"&INDEX(swimmers_data,$B86,1)&\",\"&INDEX(swimmers_data,$B86,2)&\",\"&INDEX(swimmers_data,$B86,4)&\",\"&TEXT(INDEX(swimmers_data,$B86,3),\"ddmmYy\")&\",\"&LEFT(\"000000\",6-LEN(L86))&L86&\",\"&Z$11&\",\"&\"F\",\"\")","v":""},{"$f":"IF(AND(ISNUMBER($B86),$B86>0,M86<>\"\"),INDEX(swimmers_data,$B86,5)&\",\"&INDEX(swimmers_data,$B86,1)&\",\"&INDEX(swimmers_data,$B86,2)&\",\"&INDEX(swimmers_data,$B86,4)&\",\"&TEXT(INDEX(swimmers_data,$B86,3),\"ddmmYy\")&\",\"&LEFT(\"000000\",6-LEN(M86))&M86&\",\"&AA$11&\",\"&\"F\",\"\")","v":""},{"$f":"IF(AND(ISNUMBER($B86),$B86>0,N86<>\"\"),INDEX(swimmers_data,$B86,5)&\",\"&INDEX(swimmers_data,$B86,1)&\",\"&INDEX(swimmers_data,$B86,2)&\",\"&INDEX(swimmers_data,$B86,4)&\",\"&TEXT(INDEX(swimmers_data,$B86,3),\"ddmmYy\")&\",\"&LEFT(\"000000\",6-LEN(N86))&N86&\",\"&AB$11&\",\"&\"F\",\"\")","v":""},null,null,"","","",{"$f":"IF(AND(ISNUMBER($B86),$B86>0,E86<>\"\"),formatMMSSHHtime(E86),\"\")","v":""},{"$f":"IF(AND(ISNUMBER($B86),$B86>0,F86<>\"\"),formatMMSSHHtime(F86),\"\")","v":""},{"$f":"IF(AND(ISNUMBER($B86),$B86>0,G86<>\"\"),formatMMSSHHtime(G86),\"\")","v":""},{"$f":"IF(AND(ISNUMBER($B86),$B86>0,H86<>\"\"),formatMMSSHHtime(H86),\"\")","v":""},{"$f":"IF(AND(ISNUMBER($B86),$B86>0,I86<>\"\"),formatMMSSHHtime(I86),\"\")","v":""},{"$f":"IF(AND(ISNUMBER($B86),$B86>0,J86<>\"\"),formatMMSSHHtime(J86),\"\")","v":""},{"$f":"IF(AND(ISNUMBER($B86),$B86>0,K86<>\"\"),formatMMSSHHtime(K86),\"\")","v":""},{"$f":"IF(AND(ISNUMBER($B86),$B86>0,L86<>\"\"),formatMMSSHHtime(L86),\"\")","v":""},{"$f":"IF(AND(ISNUMBER($B86),$B86>0,M86<>\"\"),formatMMSSHHtime(M86),\"\")","v":""},{"$f":"IF(AND(ISNUMBER($B86),$B86>0,N86<>\"\"),formatMMSSHHtime(N86),\"\")","v":""}]
["","",{"$f":"IF(AND(ISNUMBER(B87),B87>0),DATEDIF(INDEX(swimmers_data,B87,3),$C$8,\"Y\"),\"\")","v":""},{"$f":"IF(AND(ISNUMBER(B87),B87>0),INDEX(swimmers_data,B87,5),\"\")","v":""},null,null,null,null,null,null,null,null,null,null,null,null,null,null,{"$f":"IF(AND(ISNUMBER($B87),$B87>0,E87<>\"\"),INDEX(swimmers_data,$B87,5)&\",\"&INDEX(swimmers_data,$B87,1)&\",\"&INDEX(swimmers_data,$B87,2)&\",\"&INDEX(swimmers_data,$B87,4)&\",\"&TEXT(INDEX(swimmers_data,$B87,3),\"ddmmYy\")&\",\"&LEFT(\"000000\",6-LEN(E87))&E87&\",\"&S$11&\",\"&\"F\",\"\")","v":""},{"$f":"IF(AND(ISNUMBER($B87),$B87>0,F87<>\"\"),INDEX(swimmers_data,$B87,5)&\",\"&INDEX(swimmers_data,$B87,1)&\",\"&INDEX(swimmers_data,$B87,2)&\",\"&INDEX(swimmers_data,$B87,4)&\",\"&TEXT(INDEX(swimmers_data,$B87,3),\"ddmmYy\")&\",\"&LEFT(\"000000\",6-LEN(F87))&F87&\",\"&T$11&\",\"&\"F\",\"\")","v":""},{"$f":"IF(AND(ISNUMBER($B87),$B87>0,G87<>\"\"),INDEX(swimmers_data,$B87,5)&\",\"&INDEX(swimmers_data,$B87,1)&\",\"&INDEX(swimmers_data,$B87,2)&\",\"&INDEX(swimmers_data,$B87,4)&\",\"&TEXT(INDEX(swimmers_data,$B87,3),\"ddmmYy\")&\",\"&LEFT(\"000000\",6-LEN(G87))&G87&\",\"&U$11&\",\"&\"F\",\"\")","v":""},{"$f":"IF(AND(ISNUMBER($B87),$B87>0,H87<>\"\"),INDEX(swimmers_data,$B87,5)&\",\"&INDEX(swimmers_data,$B87,1)&\",\"&INDEX(swimmers_data,$B87,2)&\",\"&INDEX(swimmers_data,$B87,4)&\",\"&TEXT(INDEX(swimmers_data,$B87,3),\"ddmmYy\")&\",\"&LEFT(\"000000\",6-LEN(H87))&H87&\",\"&V$11&\",\"&\"F\",\"\")","v":""},{"$f":"IF(AND(ISNUMBER($B87),$B87>0,I87<>\"\"),INDEX(swimmers_data,$B87,5)&\",\"&INDEX(swimmers_data,$B87,1)&\",\"&INDEX(swimmers_data,$B87,2)&\",\"&INDEX(swimmers_data,$B87,4)&\",\"&TEXT(INDEX(swimmers_data,$B87,3),\"ddmmYy\")&\",\"&LEFT(\"000000\",6-LEN(I87))&I87&\",\"&W$11&\",\"&\"F\",\"\")","v":""},{"$f":"IF(AND(ISNUMBER($B87),$B87>0,J87<>\"\"),INDEX(swimmers_data,$B87,5)&\",\"&INDEX(swimmers_data,$B87,1)&\",\"&INDEX(swimmers_data,$B87,2)&\",\"&INDEX(swimmers_data,$B87,4)&\",\"&TEXT(INDEX(swimmers_data,$B87,3),\"ddmmYy\")&\",\"&LEFT(\"000000\",6-LEN(J87))&J87&\",\"&X$11&\",\"&\"F\",\"\")","v":""},{"$f":"IF(AND(ISNUMBER($B87),$B87>0,K87<>\"\"),INDEX(swimmers_data,$B87,5)&\",\"&INDEX(swimmers_data,$B87,1)&\",\"&INDEX(swimmers_data,$B87,2)&\",\"&INDEX(swimmers_data,$B87,4)&\",\"&TEXT(INDEX(swimmers_data,$B87,3),\"ddmmYy\")&\",\"&LEFT(\"000000\",6-LEN(K87))&K87&\",\"&Y$11&\",\"&\"F\",\"\")","v":""},{"$f":"IF(AND(ISNUMBER($B87),$B87>0,L87<>\"\"),INDEX(swimmers_data,$B87,5)&\",\"&INDEX(swimmers_data,$B87,1)&\",\"&INDEX(swimmers_data,$B87,2)&\",\"&INDEX(swimmers_data,$B87,4)&\",\"&TEXT(INDEX(swimmers_data,$B87,3),\"ddmmYy\")&\",\"&LEFT(\"000000\",6-LEN(L87))&L87&\",\"&Z$11&\",\"&\"F\",\"\")","v":""},{"$f":"IF(AND(ISNUMBER($B87),$B87>0,M87<>\"\"),INDEX(swimmers_data,$B87,5)&\",\"&INDEX(swimmers_data,$B87,1)&\",\"&INDEX(swimmers_data,$B87,2)&\",\"&INDEX(swimmers_data,$B87,4)&\",\"&TEXT(INDEX(swimmers_data,$B87,3),\"ddmmYy\")&\",\"&LEFT(\"000000\",6-LEN(M87))&M87&\",\"&AA$11&\",\"&\"F\",\"\")","v":""},{"$f":"IF(AND(ISNUMBER($B87),$B87>0,N87<>\"\"),INDEX(swimmers_data,$B87,5)&\",\"&INDEX(swimmers_data,$B87,1)&\",\"&INDEX(swimmers_data,$B87,2)&\",\"&INDEX(swimmers_data,$B87,4)&\",\"&TEXT(INDEX(swimmers_data,$B87,3),\"ddmmYy\")&\",\"&LEFT(\"000000\",6-LEN(N87))&N87&\",\"&AB$11&\",\"&\"F\",\"\")","v":""},null,null,"","","",{"$f":"IF(AND(ISNUMBER($B87),$B87>0,E87<>\"\"),formatMMSSHHtime(E87),\"\")","v":""},{"$f":"IF(AND(ISNUMBER($B87),$B87>0,F87<>\"\"),formatMMSSHHtime(F87),\"\")","v":""},{"$f":"IF(AND(ISNUMBER($B87),$B87>0,G87<>\"\"),formatMMSSHHtime(G87),\"\")","v":""},{"$f":"IF(AND(ISNUMBER($B87),$B87>0,H87<>\"\"),formatMMSSHHtime(H87),\"\")","v":""},{"$f":"IF(AND(ISNUMBER($B87),$B87>0,I87<>\"\"),formatMMSSHHtime(I87),\"\")","v":""},{"$f":"IF(AND(ISNUMBER($B87),$B87>0,J87<>\"\"),formatMMSSHHtime(J87),\"\")","v":""},{"$f":"IF(AND(ISNUMBER($B87),$B87>0,K87<>\"\"),formatMMSSHHtime(K87),\"\")","v":""},{"$f":"IF(AND(ISNUMBER($B87),$B87>0,L87<>\"\"),formatMMSSHHtime(L87),\"\")","v":""},{"$f":"IF(AND(ISNUMBER($B87),$B87>0,M87<>\"\"),formatMMSSHHtime(M87),\"\")","v":""},{"$f":"IF(AND(ISNUMBER($B87),$B87>0,N87<>\"\"),formatMMSSHHtime(N87),\"\")","v":""}]
["","",{"$f":"IF(AND(ISNUMBER(B88),B88>0),DATEDIF(INDEX(swimmers_data,B88,3),$C$8,\"Y\"),\"\")","v":""},{"$f":"IF(AND(ISNUMBER(B88),B88>0),INDEX(swimmers_data,B88,5),\"\")","v":""},null,null,null,null,null,null,null,null,null,null,null,null,null,null,{"$f":"IF(AND(ISNUMBER($B88),$B88>0,E88<>\"\"),INDEX(swimmers_data,$B88,5)&\",\"&INDEX(swimmers_data,$B88,1)&\",\"&INDEX(swimmers_data,$B88,2)&\",\"&INDEX(swimmers_data,$B88,4)&\",\"&TEXT(INDEX(swimmers_data,$B88,3),\"ddmmYy\")&\",\"&LEFT(\"000000\",6-LEN(E88))&E88&\",\"&S$11&\",\"&\"F\",\"\")","v":""},{"$f":"IF(AND(ISNUMBER($B88),$B88>0,F88<>\"\"),INDEX(swimmers_data,$B88,5)&\",\"&INDEX(swimmers_data,$B88,1)&\",\"&INDEX(swimmers_data,$B88,2)&\",\"&INDEX(swimmers_data,$B88,4)&\",\"&TEXT(INDEX(swimmers_data,$B88,3),\"ddmmYy\")&\",\"&LEFT(\"000000\",6-LEN(F88))&F88&\",\"&T$11&\",\"&\"F\",\"\")","v":""},{"$f":"IF(AND(ISNUMBER($B88),$B88>0,G88<>\"\"),INDEX(swimmers_data,$B88,5)&\",\"&INDEX(swimmers_data,$B88,1)&\",\"&INDEX(swimmers_data,$B88,2)&\",\"&INDEX(swimmers_data,$B88,4)&\",\"&TEXT(INDEX(swimmers_data,$B88,3),\"ddmmYy\")&\",\"&LEFT(\"000000\",6-LEN(G88))&G88&\",\"&U$11&\",\"&\"F\",\"\")","v":""},{"$f":"IF(AND(ISNUMBER($B88),$B88>0,H88<>\"\"),INDEX(swimmers_data,$B88,5)&\",\"&INDEX(swimmers_data,$B88,1)&\",\"&INDEX(swimmers_data,$B88,2)&\",\"&INDEX(swimmers_data,$B88,4)&\",\"&TEXT(INDEX(swimmers_data,$B88,3),\"ddmmYy\")&\",\"&LEFT(\"000000\",6-LEN(H88))&H88&\",\"&V$11&\",\"&\"F\",\"\")","v":""},{"$f":"IF(AND(ISNUMBER($B88),$B88>0,I88<>\"\"),INDEX(swimmers_data,$B88,5)&\",\"&INDEX(swimmers_data,$B88,1)&\",\"&INDEX(swimmers_data,$B88,2)&\",\"&INDEX(swimmers_data,$B88,4)&\",\"&TEXT(INDEX(swimmers_data,$B88,3),\"ddmmYy\")&\",\"&LEFT(\"000000\",6-LEN(I88))&I88&\",\"&W$11&\",\"&\"F\",\"\")","v":""},{"$f":"IF(AND(ISNUMBER($B88),$B88>0,J88<>\"\"),INDEX(swimmers_data,$B88,5)&\",\"&INDEX(swimmers_data,$B88,1)&\",\"&INDEX(swimmers_data,$B88,2)&\",\"&INDEX(swimmers_data,$B88,4)&\",\"&TEXT(INDEX(swimmers_data,$B88,3),\"ddmmYy\")&\",\"&LEFT(\"000000\",6-LEN(J88))&J88&\",\"&X$11&\",\"&\"F\",\"\")","v":""},{"$f":"IF(AND(ISNUMBER($B88),$B88>0,K88<>\"\"),INDEX(swimmers_data,$B88,5)&\",\"&INDEX(swimmers_data,$B88,1)&\",\"&INDEX(swimmers_data,$B88,2)&\",\"&INDEX(swimmers_data,$B88,4)&\",\"&TEXT(INDEX(swimmers_data,$B88,3),\"ddmmYy\")&\",\"&LEFT(\"000000\",6-LEN(K88))&K88&\",\"&Y$11&\",\"&\"F\",\"\")","v":""},{"$f":"IF(AND(ISNUMBER($B88),$B88>0,L88<>\"\"),INDEX(swimmers_data,$B88,5)&\",\"&INDEX(swimmers_data,$B88,1)&\",\"&INDEX(swimmers_data,$B88,2)&\",\"&INDEX(swimmers_data,$B88,4)&\",\"&TEXT(INDEX(swimmers_data,$B88,3),\"ddmmYy\")&\",\"&LEFT(\"000000\",6-LEN(L88))&L88&\",\"&Z$11&\",\"&\"F\",\"\")","v":""},{"$f":"IF(AND(ISNUMBER($B88),$B88>0,M88<>\"\"),INDEX(swimmers_data,$B88,5)&\",\"&INDEX(swimmers_data,$B88,1)&\",\"&INDEX(swimmers_data,$B88,2)&\",\"&INDEX(swimmers_data,$B88,4)&\",\"&TEXT(INDEX(swimmers_data,$B88,3),\"ddmmYy\")&\",\"&LEFT(\"000000\",6-LEN(M88))&M88&\",\"&AA$11&\",\"&\"F\",\"\")","v":""},{"$f":"IF(AND(ISNUMBER($B88),$B88>0,N88<>\"\"),INDEX(swimmers_data,$B88,5)&\",\"&INDEX(swimmers_data,$B88,1)&\",\"&INDEX(swimmers_data,$B88,2)&\",\"&INDEX(swimmers_data,$B88,4)&\",\"&TEXT(INDEX(swimmers_data,$B88,3),\"ddmmYy\")&\",\"&LEFT(\"000000\",6-LEN(N88))&N88&\",\"&AB$11&\",\"&\"F\",\"\")","v":""},null,null,"","","",{"$f":"IF(AND(ISNUMBER($B88),$B88>0,E88<>\"\"),formatMMSSHHtime(E88),\"\")","v":""},{"$f":"IF(AND(ISNUMBER($B88),$B88>0,F88<>\"\"),formatMMSSHHtime(F88),\"\")","v":""},{"$f":"IF(AND(ISNUMBER($B88),$B88>0,G88<>\"\"),formatMMSSHHtime(G88),\"\")","v":""},{"$f":"IF(AND(ISNUMBER($B88),$B88>0,H88<>\"\"),formatMMSSHHtime(H88),\"\")","v":""},{"$f":"IF(AND(ISNUMBER($B88),$B88>0,I88<>\"\"),formatMMSSHHtime(I88),\"\")","v":""},{"$f":"IF(AND(ISNUMBER($B88),$B88>0,J88<>\"\"),formatMMSSHHtime(J88),\"\")","v":""},{"$f":"IF(AND(ISNUMBER($B88),$B88>0,K88<>\"\"),formatMMSSHHtime(K88),\"\")","v":""},{"$f":"IF(AND(ISNUMBER($B88),$B88>0,L88<>\"\"),formatMMSSHHtime(L88),\"\")","v":""},{"$f":"IF(AND(ISNUMBER($B88),$B88>0,M88<>\"\"),formatMMSSHHtime(M88),\"\")","v":""},{"$f":"IF(AND(ISNUMBER($B88),$B88>0,N88<>\"\"),formatMMSSHHtime(N88),\"\")","v":""}]
["","",{"$f":"IF(AND(ISNUMBER(B89),B89>0),DATEDIF(INDEX(swimmers_data,B89,3),$C$8,\"Y\"),\"\")","v":""},{"$f":"IF(AND(ISNUMBER(B89),B89>0),INDEX(swimmers_data,B89,5),\"\")","v":""},null,null,null,null,null,null,null,null,null,null,null,null,null,null,{"$f":"IF(AND(ISNUMBER($B89),$B89>0,E89<>\"\"),INDEX(swimmers_data,$B89,5)&\",\"&INDEX(swimmers_data,$B89,1)&\",\"&INDEX(swimmers_data,$B89,2)&\",\"&INDEX(swimmers_data,$B89,4)&\",\"&TEXT(INDEX(swimmers_data,$B89,3),\"ddmmYy\")&\",\"&LEFT(\"000000\",6-LEN(E89))&E89&\",\"&S$11&\",\"&\"F\",\"\")","v":""},{"$f":"IF(AND(ISNUMBER($B89),$B89>0,F89<>\"\"),INDEX(swimmers_data,$B89,5)&\",\"&INDEX(swimmers_data,$B89,1)&\",\"&INDEX(swimmers_data,$B89,2)&\",\"&INDEX(swimmers_data,$B89,4)&\",\"&TEXT(INDEX(swimmers_data,$B89,3),\"ddmmYy\")&\",\"&LEFT(\"000000\",6-LEN(F89))&F89&\",\"&T$11&\",\"&\"F\",\"\")","v":""},{"$f":"IF(AND(ISNUMBER($B89),$B89>0,G89<>\"\"),INDEX(swimmers_data,$B89,5)&\",\"&INDEX(swimmers_data,$B89,1)&\",\"&INDEX(swimmers_data,$B89,2)&\",\"&INDEX(swimmers_data,$B89,4)&\",\"&TEXT(INDEX(swimmers_data,$B89,3),\"ddmmYy\")&\",\"&LEFT(\"000000\",6-LEN(G89))&G89&\",\"&U$11&\",\"&\"F\",\"\")","v":""},{"$f":"IF(AND(ISNUMBER($B89),$B89>0,H89<>\"\"),INDEX(swimmers_data,$B89,5)&\",\"&INDEX(swimmers_data,$B89,1)&\",\"&INDEX(swimmers_data,$B89,2)&\",\"&INDEX(swimmers_data,$B89,4)&\",\"&TEXT(INDEX(swimmers_data,$B89,3),\"ddmmYy\")&\",\"&LEFT(\"000000\",6-LEN(H89))&H89&\",\"&V$11&\",\"&\"F\",\"\")","v":""},{"$f":"IF(AND(ISNUMBER($B89),$B89>0,I89<>\"\"),INDEX(swimmers_data,$B89,5)&\",\"&INDEX(swimmers_data,$B89,1)&\",\"&INDEX(swimmers_data,$B89,2)&\",\"&INDEX(swimmers_data,$B89,4)&\",\"&TEXT(INDEX(swimmers_data,$B89,3),\"ddmmYy\")&\",\"&LEFT(\"000000\",6-LEN(I89))&I89&\",\"&W$11&\",\"&\"F\",\"\")","v":""},{"$f":"IF(AND(ISNUMBER($B89),$B89>0,J89<>\"\"),INDEX(swimmers_data,$B89,5)&\",\"&INDEX(swimmers_data,$B89,1)&\",\"&INDEX(swimmers_data,$B89,2)&\",\"&INDEX(swimmers_data,$B89,4)&\",\"&TEXT(INDEX(swimmers_data,$B89,3),\"ddmmYy\")&\",\"&LEFT(\"000000\",6-LEN(J89))&J89&\",\"&X$11&\",\"&\"F\",\"\")","v":""},{"$f":"IF(AND(ISNUMBER($B89),$B89>0,K89<>\"\"),INDEX(swimmers_data,$B89,5)&\",\"&INDEX(swimmers_data,$B89,1)&\",\"&INDEX(swimmers_data,$B89,2)&\",\"&INDEX(swimmers_data,$B89,4)&\",\"&TEXT(INDEX(swimmers_data,$B89,3),\"ddmmYy\")&\",\"&LEFT(\"000000\",6-LEN(K89))&K89&\",\"&Y$11&\",\"&\"F\",\"\")","v":""},{"$f":"IF(AND(ISNUMBER($B89),$B89>0,L89<>\"\"),INDEX(swimmers_data,$B89,5)&\",\"&INDEX(swimmers_data,$B89,1)&\",\"&INDEX(swimmers_data,$B89,2)&\",\"&INDEX(swimmers_data,$B89,4)&\",\"&TEXT(INDEX(swimmers_data,$B89,3),\"ddmmYy\")&\",\"&LEFT(\"000000\",6-LEN(L89))&L89&\",\"&Z$11&\",\"&\"F\",\"\")","v":""},{"$f":"IF(AND(ISNUMBER($B89),$B89>0,M89<>\"\"),INDEX(swimmers_data,$B89,5)&\",\"&INDEX(swimmers_data,$B89,1)&\",\"&INDEX(swimmers_data,$B89,2)&\",\"&INDEX(swimmers_data,$B89,4)&\",\"&TEXT(INDEX(swimmers_data,$B89,3),\"ddmmYy\")&\",\"&LEFT(\"000000\",6-LEN(M89))&M89&\",\"&AA$11&\",\"&\"F\",\"\")","v":""},{"$f":"IF(AND(ISNUMBER($B89),$B89>0,N89<>\"\"),INDEX(swimmers_data,$B89,5)&\",\"&INDEX(swimmers_data,$B89,1)&\",\"&INDEX(swimmers_data,$B89,2)&\",\"&INDEX(swimmers_data,$B89,4)&\",\"&TEXT(INDEX(swimmers_data,$B89,3),\"ddmmYy\")&\",\"&LEFT(\"000000\",6-LEN(N89))&N89&\",\"&AB$11&\",\"&\"F\",\"\")","v":""},null,null,"","","",{"$f":"IF(AND(ISNUMBER($B89),$B89>0,E89<>\"\"),formatMMSSHHtime(E89),\"\")","v":""},{"$f":"IF(AND(ISNUMBER($B89),$B89>0,F89<>\"\"),formatMMSSHHtime(F89),\"\")","v":""},{"$f":"IF(AND(ISNUMBER($B89),$B89>0,G89<>\"\"),formatMMSSHHtime(G89),\"\")","v":""},{"$f":"IF(AND(ISNUMBER($B89),$B89>0,H89<>\"\"),formatMMSSHHtime(H89),\"\")","v":""},{"$f":"IF(AND(ISNUMBER($B89),$B89>0,I89<>\"\"),formatMMSSHHtime(I89),\"\")","v":""},{"$f":"IF(AND(ISNUMBER($B89),$B89>0,J89<>\"\"),formatMMSSHHtime(J89),\"\")","v":""},{"$f":"IF(AND(ISNUMBER($B89),$B89>0,K89<>\"\"),formatMMSSHHtime(K89),\"\")","v":""},{"$f":"IF(AND(ISNUMBER($B89),$B89>0,L89<>\"\"),formatMMSSHHtime(L89),\"\")","v":""},{"$f":"IF(AND(ISNUMBER($B89),$B89>0,M89<>\"\"),formatMMSSHHtime(M89),\"\")","v":""},{"$f":"IF(AND(ISNUMBER($B89),$B89>0,N89<>\"\"),formatMMSSHHtime(N89),\"\")","v":""}]
["","",{"$f":"IF(AND(ISNUMBER(B90),B90>0),DATEDIF(INDEX(swimmers_data,B90,3),$C$8,\"Y\"),\"\")","v":""},{"$f":"IF(AND(ISNUMBER(B90),B90>0),INDEX(swimmers_data,B90,5),\"\")","v":""},null,null,null,null,null,null,null,null,null,null,null,null,null,null,{"$f":"IF(AND(ISNUMBER($B90),$B90>0,E90<>\"\"),INDEX(swimmers_data,$B90,5)&\",\"&INDEX(swimmers_data,$B90,1)&\",\"&INDEX(swimmers_data,$B90,2)&\",\"&INDEX(swimmers_data,$B90,4)&\",\"&TEXT(INDEX(swimmers_data,$B90,3),\"ddmmYy\")&\",\"&LEFT(\"000000\",6-LEN(E90))&E90&\",\"&S$11&\",\"&\"F\",\"\")","v":""},{"$f":"IF(AND(ISNUMBER($B90),$B90>0,F90<>\"\"),INDEX(swimmers_data,$B90,5)&\",\"&INDEX(swimmers_data,$B90,1)&\",\"&INDEX(swimmers_data,$B90,2)&\",\"&INDEX(swimmers_data,$B90,4)&\",\"&TEXT(INDEX(swimmers_data,$B90,3),\"ddmmYy\")&\",\"&LEFT(\"000000\",6-LEN(F90))&F90&\",\"&T$11&\",\"&\"F\",\"\")","v":""},{"$f":"IF(AND(ISNUMBER($B90),$B90>0,G90<>\"\"),INDEX(swimmers_data,$B90,5)&\",\"&INDEX(swimmers_data,$B90,1)&\",\"&INDEX(swimmers_data,$B90,2)&\",\"&INDEX(swimmers_data,$B90,4)&\",\"&TEXT(INDEX(swimmers_data,$B90,3),\"ddmmYy\")&\",\"&LEFT(\"000000\",6-LEN(G90))&G90&\",\"&U$11&\",\"&\"F\",\"\")","v":""},{"$f":"IF(AND(ISNUMBER($B90),$B90>0,H90<>\"\"),INDEX(swimmers_data,$B90,5)&\",\"&INDEX(swimmers_data,$B90,1)&\",\"&INDEX(swimmers_data,$B90,2)&\",\"&INDEX(swimmers_data,$B90,4)&\",\"&TEXT(INDEX(swimmers_data,$B90,3),\"ddmmYy\")&\",\"&LEFT(\"000000\",6-LEN(H90))&H90&\",\"&V$11&\",\"&\"F\",\"\")","v":""},{"$f":"IF(AND(ISNUMBER($B90),$B90>0,I90<>\"\"),INDEX(swimmers_data,$B90,5)&\",\"&INDEX(swimmers_data,$B90,1)&\",\"&INDEX(swimmers_data,$B90,2)&\",\"&INDEX(swimmers_data,$B90,4)&\",\"&TEXT(INDEX(swimmers_data,$B90,3),\"ddmmYy\")&\",\"&LEFT(\"000000\",6-LEN(I90))&I90&\",\"&W$11&\",\"&\"F\",\"\")","v":""},{"$f":"IF(AND(ISNUMBER($B90),$B90>0,J90<>\"\"),INDEX(swimmers_data,$B90,5)&\",\"&INDEX(swimmers_data,$B90,1)&\",\"&INDEX(swimmers_data,$B90,2)&\",\"&INDEX(swimmers_data,$B90,4)&\",\"&TEXT(INDEX(swimmers_data,$B90,3),\"ddmmYy\")&\",\"&LEFT(\"000000\",6-LEN(J90))&J90&\",\"&X$11&\",\"&\"F\",\"\")","v":""},{"$f":"IF(AND(ISNUMBER($B90),$B90>0,K90<>\"\"),INDEX(swimmers_data,$B90,5)&\",\"&INDEX(swimmers_data,$B90,1)&\",\"&INDEX(swimmers_data,$B90,2)&\",\"&INDEX(swimmers_data,$B90,4)&\",\"&TEXT(INDEX(swimmers_data,$B90,3),\"ddmmYy\")&\",\"&LEFT(\"000000\",6-LEN(K90))&K90&\",\"&Y$11&\",\"&\"F\",\"\")","v":""},{"$f":"IF(AND(ISNUMBER($B90),$B90>0,L90<>\"\"),INDEX(swimmers_data,$B90,5)&\",\"&INDEX(swimmers_data,$B90,1)&\",\"&INDEX(swimmers_data,$B90,2)&\",\"&INDEX(swimmers_data,$B90,4)&\",\"&TEXT(INDEX(swimmers_data,$B90,3),\"ddmmYy\")&\",\"&LEFT(\"000000\",6-LEN(L90))&L90&\",\"&Z$11&\",\"&\"F\",\"\")","v":""},{"$f":"IF(AND(ISNUMBER($B90),$B90>0,M90<>\"\"),INDEX(swimmers_data,$B90,5)&\",\"&INDEX(swimmers_data,$B90,1)&\",\"&INDEX(swimmers_data,$B90,2)&\",\"&INDEX(swimmers_data,$B90,4)&\",\"&TEXT(INDEX(swimmers_data,$B90,3),\"ddmmYy\")&\",\"&LEFT(\"000000\",6-LEN(M90))&M90&\",\"&AA$11&\",\"&\"F\",\"\")","v":""},{"$f":"IF(AND(ISNUMBER($B90),$B90>0,N90<>\"\"),INDEX(swimmers_data,$B90,5)&\",\"&INDEX(swimmers_data,$B90,1)&\",\"&INDEX(swimmers_data,$B90,2)&\",\"&INDEX(swimmers_data,$B90,4)&\",\"&TEXT(INDEX(swimmers_data,$B90,3),\"ddmmYy\")&\",\"&LEFT(\"000000\",6-LEN(N90))&N90&\",\"&AB$11&\",\"&\"F\",\"\")","v":""},null,null,"","","",{"$f":"IF(AND(ISNUMBER($B90),$B90>0,E90<>\"\"),formatMMSSHHtime(E90),\"\")","v":""},{"$f":"IF(AND(ISNUMBER($B90),$B90>0,F90<>\"\"),formatMMSSHHtime(F90),\"\")","v":""},{"$f":"IF(AND(ISNUMBER($B90),$B90>0,G90<>\"\"),formatMMSSHHtime(G90),\"\")","v":""},{"$f":"IF(AND(ISNUMBER($B90),$B90>0,H90<>\"\"),formatMMSSHHtime(H90),\"\")","v":""},{"$f":"IF(AND(ISNUMBER($B90),$B90>0,I90<>\"\"),formatMMSSHHtime(I90),\"\")","v":""},{"$f":"IF(AND(ISNUMBER($B90),$B90>0,J90<>\"\"),formatMMSSHHtime(J90),\"\")","v":""},{"$f":"IF(AND(ISNUMBER($B90),$B90>0,K90<>\"\"),formatMMSSHHtime(K90),\"\")","v":""},{"$f":"IF(AND(ISNUMBER($B90),$B90>0,L90<>\"\"),formatMMSSHHtime(L90),\"\")","v":""},{"$f":"IF(AND(ISNUMBER($B90),$B90>0,M90<>\"\"),formatMMSSHHtime(M90),\"\")","v":""},{"$f":"IF(AND(ISNUMBER($B90),$B90>0,N90<>\"\"),formatMMSSHHtime(N90),\"\")","v":""}]
["","",{"$f":"IF(AND(ISNUMBER(B91),B91>0),DATEDIF(INDEX(swimmers_data,B91,3),$C$8,\"Y\"),\"\")","v":""},{"$f":"IF(AND(ISNUMBER(B91),B91>0),INDEX(swimmers_data,B91,5),\"\")","v":""},null,null,null,null,null,null,null,null,null,null,null,null,null,null,{"$f":"IF(AND(ISNUMBER($B91),$B91>0,E91<>\"\"),INDEX(swimmers_data,$B91,5)&\",\"&INDEX(swimmers_data,$B91,1)&\",\"&INDEX(swimmers_data,$B91,2)&\",\"&INDEX(swimmers_data,$B91,4)&\",\"&TEXT(INDEX(swimmers_data,$B91,3),\"ddmmYy\")&\",\"&LEFT(\"000000\",6-LEN(E91))&E91&\",\"&S$11&\",\"&\"F\",\"\")","v":""},{"$f":"IF(AND(ISNUMBER($B91),$B91>0,F91<>\"\"),INDEX(swimmers_data,$B91,5)&\",\"&INDEX(swimmers_data,$B91,1)&\",\"&INDEX(swimmers_data,$B91,2)&\",\"&INDEX(swimmers_data,$B91,4)&\",\"&TEXT(INDEX(swimmers_data,$B91,3),\"ddmmYy\")&\",\"&LEFT(\"000000\",6-LEN(F91))&F91&\",\"&T$11&\",\"&\"F\",\"\")","v":""},{"$f":"IF(AND(ISNUMBER($B91),$B91>0,G91<>\"\"),INDEX(swimmers_data,$B91,5)&\",\"&INDEX(swimmers_data,$B91,1)&\",\"&INDEX(swimmers_data,$B91,2)&\",\"&INDEX(swimmers_data,$B91,4)&\",\"&TEXT(INDEX(swimmers_data,$B91,3),\"ddmmYy\")&\",\"&LEFT(\"000000\",6-LEN(G91))&G91&\",\"&U$11&\",\"&\"F\",\"\")","v":""},{"$f":"IF(AND(ISNUMBER($B91),$B91>0,H91<>\"\"),INDEX(swimmers_data,$B91,5)&\",\"&INDEX(swimmers_data,$B91,1)&\",\"&INDEX(swimmers_data,$B91,2)&\",\"&INDEX(swimmers_data,$B91,4)&\",\"&TEXT(INDEX(swimmers_data,$B91,3),\"ddmmYy\")&\",\"&LEFT(\"000000\",6-LEN(H91))&H91&\",\"&V$11&\",\"&\"F\",\"\")","v":""},{"$f":"IF(AND(ISNUMBER($B91),$B91>0,I91<>\"\"),INDEX(swimmers_data,$B91,5)&\",\"&INDEX(swimmers_data,$B91,1)&\",\"&INDEX(swimmers_data,$B91,2)&\",\"&INDEX(swimmers_data,$B91,4)&\",\"&TEXT(INDEX(swimmers_data,$B91,3),\"ddmmYy\")&\",\"&LEFT(\"000000\",6-LEN(I91))&I91&\",\"&W$11&\",\"&\"F\",\"\")","v":""},{"$f":"IF(AND(ISNUMBER($B91),$B91>0,J91<>\"\"),INDEX(swimmers_data,$B91,5)&\",\"&INDEX(swimmers_data,$B91,1)&\",\"&INDEX(swimmers_data,$B91,2)&\",\"&INDEX(swimmers_data,$B91,4)&\",\"&TEXT(INDEX(swimmers_data,$B91,3),\"ddmmYy\")&\",\"&LEFT(\"000000\",6-LEN(J91))&J91&\",\"&X$11&\",\"&\"F\",\"\")","v":""},{"$f":"IF(AND(ISNUMBER($B91),$B91>0,K91<>\"\"),INDEX(swimmers_data,$B91,5)&\",\"&INDEX(swimmers_data,$B91,1)&\",\"&INDEX(swimmers_data,$B91,2)&\",\"&INDEX(swimmers_data,$B91,4)&\",\"&TEXT(INDEX(swimmers_data,$B91,3),\"ddmmYy\")&\",\"&LEFT(\"000000\",6-LEN(K91))&K91&\",\"&Y$11&\",\"&\"F\",\"\")","v":""},{"$f":"IF(AND(ISNUMBER($B91),$B91>0,L91<>\"\"),INDEX(swimmers_data,$B91,5)&\",\"&INDEX(swimmers_data,$B91,1)&\",\"&INDEX(swimmers_data,$B91,2)&\",\"&INDEX(swimmers_data,$B91,4)&\",\"&TEXT(INDEX(swimmers_data,$B91,3),\"ddmmYy\")&\",\"&LEFT(\"000000\",6-LEN(L91))&L91&\",\"&Z$11&\",\"&\"F\",\"\")","v":""},{"$f":"IF(AND(ISNUMBER($B91),$B91>0,M91<>\"\"),INDEX(swimmers_data,$B91,5)&\",\"&INDEX(swimmers_data,$B91,1)&\",\"&INDEX(swimmers_data,$B91,2)&\",\"&INDEX(swimmers_data,$B91,4)&\",\"&TEXT(INDEX(swimmers_data,$B91,3),\"ddmmYy\")&\",\"&LEFT(\"000000\",6-LEN(M91))&M91&\",\"&AA$11&\",\"&\"F\",\"\")","v":""},{"$f":"IF(AND(ISNUMBER($B91),$B91>0,N91<>\"\"),INDEX(swimmers_data,$B91,5)&\",\"&INDEX(swimmers_data,$B91,1)&\",\"&INDEX(swimmers_data,$B91,2)&\",\"&INDEX(swimmers_data,$B91,4)&\",\"&TEXT(INDEX(swimmers_data,$B91,3),\"ddmmYy\")&\",\"&LEFT(\"000000\",6-LEN(N91))&N91&\",\"&AB$11&\",\"&\"F\",\"\")","v":""},null,null,"","","",{"$f":"IF(AND(ISNUMBER($B91),$B91>0,E91<>\"\"),formatMMSSHHtime(E91),\"\")","v":""},{"$f":"IF(AND(ISNUMBER($B91),$B91>0,F91<>\"\"),formatMMSSHHtime(F91),\"\")","v":""},{"$f":"IF(AND(ISNUMBER($B91),$B91>0,G91<>\"\"),formatMMSSHHtime(G91),\"\")","v":""},{"$f":"IF(AND(ISNUMBER($B91),$B91>0,H91<>\"\"),formatMMSSHHtime(H91),\"\")","v":""},{"$f":"IF(AND(ISNUMBER($B91),$B91>0,I91<>\"\"),formatMMSSHHtime(I91),\"\")","v":""},{"$f":"IF(AND(ISNUMBER($B91),$B91>0,J91<>\"\"),formatMMSSHHtime(J91),\"\")","v":""},{"$f":"IF(AND(ISNUMBER($B91),$B91>0,K91<>\"\"),formatMMSSHHtime(K91),\"\")","v":""},{"$f":"IF(AND(ISNUMBER($B91),$B91>0,L91<>\"\"),formatMMSSHHtime(L91),\"\")","v":""},{"$f":"IF(AND(ISNUMBER($B91),$B91>0,M91<>\"\"),formatMMSSHHtime(M91),\"\")","v":""},{"$f":"IF(AND(ISNUMBER($B91),$B91>0,N91<>\"\"),formatMMSSHHtime(N91),\"\")","v":""}]
["","",{"$f":"IF(AND(ISNUMBER(B92),B92>0),DATEDIF(INDEX(swimmers_data,B92,3),$C$8,\"Y\"),\"\")","v":""},{"$f":"IF(AND(ISNUMBER(B92),B92>0),INDEX(swimmers_data,B92,5),\"\")","v":""},null,null,null,null,null,null,null,null,null,null,null,null,null,null,{"$f":"IF(AND(ISNUMBER($B92),$B92>0,E92<>\"\"),INDEX(swimmers_data,$B92,5)&\",\"&INDEX(swimmers_data,$B92,1)&\",\"&INDEX(swimmers_data,$B92,2)&\",\"&INDEX(swimmers_data,$B92,4)&\",\"&TEXT(INDEX(swimmers_data,$B92,3),\"ddmmYy\")&\",\"&LEFT(\"000000\",6-LEN(E92))&E92&\",\"&S$11&\",\"&\"F\",\"\")","v":""},{"$f":"IF(AND(ISNUMBER($B92),$B92>0,F92<>\"\"),INDEX(swimmers_data,$B92,5)&\",\"&INDEX(swimmers_data,$B92,1)&\",\"&INDEX(swimmers_data,$B92,2)&\",\"&INDEX(swimmers_data,$B92,4)&\",\"&TEXT(INDEX(swimmers_data,$B92,3),\"ddmmYy\")&\",\"&LEFT(\"000000\",6-LEN(F92))&F92&\",\"&T$11&\",\"&\"F\",\"\")","v":""},{"$f":"IF(AND(ISNUMBER($B92),$B92>0,G92<>\"\"),INDEX(swimmers_data,$B92,5)&\",\"&INDEX(swimmers_data,$B92,1)&\",\"&INDEX(swimmers_data,$B92,2)&\",\"&INDEX(swimmers_data,$B92,4)&\",\"&TEXT(INDEX(swimmers_data,$B92,3),\"ddmmYy\")&\",\"&LEFT(\"000000\",6-LEN(G92))&G92&\",\"&U$11&\",\"&\"F\",\"\")","v":""},{"$f":"IF(AND(ISNUMBER($B92),$B92>0,H92<>\"\"),INDEX(swimmers_data,$B92,5)&\",\"&INDEX(swimmers_data,$B92,1)&\",\"&INDEX(swimmers_data,$B92,2)&\",\"&INDEX(swimmers_data,$B92,4)&\",\"&TEXT(INDEX(swimmers_data,$B92,3),\"ddmmYy\")&\",\"&LEFT(\"000000\",6-LEN(H92))&H92&\",\"&V$11&\",\"&\"F\",\"\")","v":""},{"$f":"IF(AND(ISNUMBER($B92),$B92>0,I92<>\"\"),INDEX(swimmers_data,$B92,5)&\",\"&INDEX(swimmers_data,$B92,1)&\",\"&INDEX(swimmers_data,$B92,2)&\",\"&INDEX(swimmers_data,$B92,4)&\",\"&TEXT(INDEX(swimmers_data,$B92,3),\"ddmmYy\")&\",\"&LEFT(\"000000\",6-LEN(I92))&I92&\",\"&W$11&\",\"&\"F\",\"\")","v":""},{"$f":"IF(AND(ISNUMBER($B92),$B92>0,J92<>\"\"),INDEX(swimmers_data,$B92,5)&\",\"&INDEX(swimmers_data,$B92,1)&\",\"&INDEX(swimmers_data,$B92,2)&\",\"&INDEX(swimmers_data,$B92,4)&\",\"&TEXT(INDEX(swimmers_data,$B92,3),\"ddmmYy\")&\",\"&LEFT(\"000000\",6-LEN(J92))&J92&\",\"&X$11&\",\"&\"F\",\"\")","v":""},{"$f":"IF(AND(ISNUMBER($B92),$B92>0,K92<>\"\"),INDEX(swimmers_data,$B92,5)&\",\"&INDEX(swimmers_data,$B92,1)&\",\"&INDEX(swimmers_data,$B92,2)&\",\"&INDEX(swimmers_data,$B92,4)&\",\"&TEXT(INDEX(swimmers_data,$B92,3),\"ddmmYy\")&\",\"&LEFT(\"000000\",6-LEN(K92))&K92&\",\"&Y$11&\",\"&\"F\",\"\")","v":""},{"$f":"IF(AND(ISNUMBER($B92),$B92>0,L92<>\"\"),INDEX(swimmers_data,$B92,5)&\",\"&INDEX(swimmers_data,$B92,1)&\",\"&INDEX(swimmers_data,$B92,2)&\",\"&INDEX(swimmers_data,$B92,4)&\",\"&TEXT(INDEX(swimmers_data,$B92,3),\"ddmmYy\")&\",\"&LEFT(\"000000\",6-LEN(L92))&L92&\",\"&Z$11&\",\"&\"F\",\"\")","v":""},{"$f":"IF(AND(ISNUMBER($B92),$B92>0,M92<>\"\"),INDEX(swimmers_data,$B92,5)&\",\"&INDEX(swimmers_data,$B92,1)&\",\"&INDEX(swimmers_data,$B92,2)&\",\"&INDEX(swimmers_data,$B92,4)&\",\"&TEXT(INDEX(swimmers_data,$B92,3),\"ddmmYy\")&\",\"&LEFT(\"000000\",6-LEN(M92))&M92&\",\"&AA$11&\",\"&\"F\",\"\")","v":""},{"$f":"IF(AND(ISNUMBER($B92),$B92>0,N92<>\"\"),INDEX(swimmers_data,$B92,5)&\",\"&INDEX(swimmers_data,$B92,1)&\",\"&INDEX(swimmers_data,$B92,2)&\",\"&INDEX(swimmers_data,$B92,4)&\",\"&TEXT(INDEX(swimmers_data,$B92,3),\"ddmmYy\")&\",\"&LEFT(\"000000\",6-LEN(N92))&N92&\",\"&AB$11&\",\"&\"F\",\"\")","v":""},null,null,"","","",{"$f":"IF(AND(ISNUMBER($B92),$B92>0,E92<>\"\"),formatMMSSHHtime(E92),\"\")","v":""},{"$f":"IF(AND(ISNUMBER($B92),$B92>0,F92<>\"\"),formatMMSSHHtime(F92),\"\")","v":""},{"$f":"IF(AND(ISNUMBER($B92),$B92>0,G92<>\"\"),formatMMSSHHtime(G92),\"\")","v":""},{"$f":"IF(AND(ISNUMBER($B92),$B92>0,H92<>\"\"),formatMMSSHHtime(H92),\"\")","v":""},{"$f":"IF(AND(ISNUMBER($B92),$B92>0,I92<>\"\"),formatMMSSHHtime(I92),\"\")","v":""},{"$f":"IF(AND(ISNUMBER($B92),$B92>0,J92<>\"\"),formatMMSSHHtime(J92),\"\")","v":""},{"$f":"IF(AND(ISNUMBER($B92),$B92>0,K92<>\"\"),formatMMSSHHtime(K92),\"\")","v":""},{"$f":"IF(AND(ISNUMBER($B92),$B92>0,L92<>\"\"),formatMMSSHHtime(L92),\"\")","v":""},{"$f":"IF(AND(ISNUMBER($B92),$B92>0,M92<>\"\"),formatMMSSHHtime(M92),\"\")","v":""},{"$f":"IF(AND(ISNUMBER($B92),$B92>0,N92<>\"\"),formatMMSSHHtime(N92),\"\")","v":""}]
["","",{"$f":"IF(AND(ISNUMBER(B93),B93>0),DATEDIF(INDEX(swimmers_data,B93,3),$C$8,\"Y\"),\"\")","v":""},{"$f":"IF(AND(ISNUMBER(B93),B93>0),INDEX(swimmers_data,B93,5),\"\")","v":""},null,null,null,null,null,null,null,null,null,null,null,null,null,null,{"$f":"IF(AND(ISNUMBER($B93),$B93>0,E93<>\"\"),INDEX(swimmers_data,$B93,5)&\",\"&INDEX(swimmers_data,$B93,1)&\",\"&INDEX(swimmers_data,$B93,2)&\",\"&INDEX(swimmers_data,$B93,4)&\",\"&TEXT(INDEX(swimmers_data,$B93,3),\"ddmmYy\")&\",\"&LEFT(\"000000\",6-LEN(E93))&E93&\",\"&S$11&\",\"&\"F\",\"\")","v":""},{"$f":"IF(AND(ISNUMBER($B93),$B93>0,F93<>\"\"),INDEX(swimmers_data,$B93,5)&\",\"&INDEX(swimmers_data,$B93,1)&\",\"&INDEX(swimmers_data,$B93,2)&\",\"&INDEX(swimmers_data,$B93,4)&\",\"&TEXT(INDEX(swimmers_data,$B93,3),\"ddmmYy\")&\",\"&LEFT(\"000000\",6-LEN(F93))&F93&\",\"&T$11&\",\"&\"F\",\"\")","v":""},{"$f":"IF(AND(ISNUMBER($B93),$B93>0,G93<>\"\"),INDEX(swimmers_data,$B93,5)&\",\"&INDEX(swimmers_data,$B93,1)&\",\"&INDEX(swimmers_data,$B93,2)&\",\"&INDEX(swimmers_data,$B93,4)&\",\"&TEXT(INDEX(swimmers_data,$B93,3),\"ddmmYy\")&\",\"&LEFT(\"000000\",6-LEN(G93))&G93&\",\"&U$11&\",\"&\"F\",\"\")","v":""},{"$f":"IF(AND(ISNUMBER($B93),$B93>0,H93<>\"\"),INDEX(swimmers_data,$B93,5)&\",\"&INDEX(swimmers_data,$B93,1)&\",\"&INDEX(swimmers_data,$B93,2)&\",\"&INDEX(swimmers_data,$B93,4)&\",\"&TEXT(INDEX(swimmers_data,$B93,3),\"ddmmYy\")&\",\"&LEFT(\"000000\",6-LEN(H93))&H93&\",\"&V$11&\",\"&\"F\",\"\")","v":""},{"$f":"IF(AND(ISNUMBER($B93),$B93>0,I93<>\"\"),INDEX(swimmers_data,$B93,5)&\",\"&INDEX(swimmers_data,$B93,1)&\",\"&INDEX(swimmers_data,$B93,2)&\",\"&INDEX(swimmers_data,$B93,4)&\",\"&TEXT(INDEX(swimmers_data,$B93,3),\"ddmmYy\")&\",\"&LEFT(\"000000\",6-LEN(I93))&I93&\",\"&W$11&\",\"&\"F\",\"\")","v":""},{"$f":"IF(AND(ISNUMBER($B93),$B93>0,J93<>\"\"),INDEX(swimmers_data,$B93,5)&\",\"&INDEX(swimmers_data,$B93,1)&\",\"&INDEX(swimmers_data,$B93,2)&\",\"&INDEX(swimmers_data,$B93,4)&\",\"&TEXT(INDEX(swimmers_data,$B93,3),\"ddmmYy\")&\",\"&LEFT(\"000000\",6-LEN(J93))&J93&\",\"&X$11&\",\"&\"F\",\"\")","v":""},{"$f":"IF(AND(ISNUMBER($B93),$B93>0,K93<>\"\"),INDEX(swimmers_data,$B93,5)&\",\"&INDEX(swimmers_data,$B93,1)&\",\"&INDEX(swimmers_data,$B93,2)&\",\"&INDEX(swimmers_data,$B93,4)&\",\"&TEXT(INDEX(swimmers_data,$B93,3),\"ddmmYy\")&\",\"&LEFT(\"000000\",6-LEN(K93))&K93&\",\"&Y$11&\",\"&\"F\",\"\")","v":""},{"$f":"IF(AND(ISNUMBER($B93),$B93>0,L93<>\"\"),INDEX(swimmers_data,$B93,5)&\",\"&INDEX(swimmers_data,$B93,1)&\",\"&INDEX(swimmers_data,$B93,2)&\",\"&INDEX(swimmers_data,$B93,4)&\",\"&TEXT(INDEX(swimmers_data,$B93,3),\"ddmmYy\")&\",\"&LEFT(\"000000\",6-LEN(L93))&L93&\",\"&Z$11&\",\"&\"F\",\"\")","v":""},{"$f":"IF(AND(ISNUMBER($B93),$B93>0,M93<>\"\"),INDEX(swimmers_data,$B93,5)&\",\"&INDEX(swimmers_data,$B93,1)&\",\"&INDEX(swimmers_data,$B93,2)&\",\"&INDEX(swimmers_data,$B93,4)&\",\"&TEXT(INDEX(swimmers_data,$B93,3),\"ddmmYy\")&\",\"&LEFT(\"000000\",6-LEN(M93))&M93&\",\"&AA$11&\",\"&\"F\",\"\")","v":""},{"$f":"IF(AND(ISNUMBER($B93),$B93>0,N93<>\"\"),INDEX(swimmers_data,$B93,5)&\",\"&INDEX(swimmers_data,$B93,1)&\",\"&INDEX(swimmers_data,$B93,2)&\",\"&INDEX(swimmers_data,$B93,4)&\",\"&TEXT(INDEX(swimmers_data,$B93,3),\"ddmmYy\")&\",\"&LEFT(\"000000\",6-LEN(N93))&N93&\",\"&AB$11&\",\"&\"F\",\"\")","v":""},null,null,"","","",{"$f":"IF(AND(ISNUMBER($B93),$B93>0,E93<>\"\"),formatMMSSHHtime(E93),\"\")","v":""},{"$f":"IF(AND(ISNUMBER($B93),$B93>0,F93<>\"\"),formatMMSSHHtime(F93),\"\")","v":""},{"$f":"IF(AND(ISNUMBER($B93),$B93>0,G93<>\"\"),formatMMSSHHtime(G93),\"\")","v":""},{"$f":"IF(AND(ISNUMBER($B93),$B93>0,H93<>\"\"),formatMMSSHHtime(H93),\"\")","v":""},{"$f":"IF(AND(ISNUMBER($B93),$B93>0,I93<>\"\"),formatMMSSHHtime(I93),\"\")","v":""},{"$f":"IF(AND(ISNUMBER($B93),$B93>0,J93<>\"\"),formatMMSSHHtime(J93),\"\")","v":""},{"$f":"IF(AND(ISNUMBER($B93),$B93>0,K93<>\"\"),formatMMSSHHtime(K93),\"\")","v":""},{"$f":"IF(AND(ISNUMBER($B93),$B93>0,L93<>\"\"),formatMMSSHHtime(L93),\"\")","v":""},{"$f":"IF(AND(ISNUMBER($B93),$B93>0,M93<>\"\"),formatMMSSHHtime(M93),\"\")","v":""},{"$f":"IF(AND(ISNUMBER($B93),$B93>0,N93<>\"\"),formatMMSSHHtime(N93),\"\")","v":""}]
["","",{"$f":"IF(AND(ISNUMBER(B94),B94>0),DATEDIF(INDEX(swimmers_data,B94,3),$C$8,\"Y\"),\"\")","v":""},{"$f":"IF(AND(ISNUMBER(B94),B94>0),INDEX(swimmers_data,B94,5),\"\")","v":""},null,null,null,null,null,null,null,null,null,null,null,null,null,null,{"$f":"IF(AND(ISNUMBER($B94),$B94>0,E94<>\"\"),INDEX(swimmers_data,$B94,5)&\",\"&INDEX(swimmers_data,$B94,1)&\",\"&INDEX(swimmers_data,$B94,2)&\",\"&INDEX(swimmers_data,$B94,4)&\",\"&TEXT(INDEX(swimmers_data,$B94,3),\"ddmmYy\")&\",\"&LEFT(\"000000\",6-LEN(E94))&E94&\",\"&S$11&\",\"&\"F\",\"\")","v":""},{"$f":"IF(AND(ISNUMBER($B94),$B94>0,F94<>\"\"),INDEX(swimmers_data,$B94,5)&\",\"&INDEX(swimmers_data,$B94,1)&\",\"&INDEX(swimmers_data,$B94,2)&\",\"&INDEX(swimmers_data,$B94,4)&\",\"&TEXT(INDEX(swimmers_data,$B94,3),\"ddmmYy\")&\",\"&LEFT(\"000000\",6-LEN(F94))&F94&\",\"&T$11&\",\"&\"F\",\"\")","v":""},{"$f":"IF(AND(ISNUMBER($B94),$B94>0,G94<>\"\"),INDEX(swimmers_data,$B94,5)&\",\"&INDEX(swimmers_data,$B94,1)&\",\"&INDEX(swimmers_data,$B94,2)&\",\"&INDEX(swimmers_data,$B94,4)&\",\"&TEXT(INDEX(swimmers_data,$B94,3),\"ddmmYy\")&\",\"&LEFT(\"000000\",6-LEN(G94))&G94&\",\"&U$11&\",\"&\"F\",\"\")","v":""},{"$f":"IF(AND(ISNUMBER($B94),$B94>0,H94<>\"\"),INDEX(swimmers_data,$B94,5)&\",\"&INDEX(swimmers_data,$B94,1)&\",\"&INDEX(swimmers_data,$B94,2)&\",\"&INDEX(swimmers_data,$B94,4)&\",\"&TEXT(INDEX(swimmers_data,$B94,3),\"ddmmYy\")&\",\"&LEFT(\"000000\",6-LEN(H94))&H94&\",\"&V$11&\",\"&\"F\",\"\")","v":""},{"$f":"IF(AND(ISNUMBER($B94),$B94>0,I94<>\"\"),INDEX(swimmers_data,$B94,5)&\",\"&INDEX(swimmers_data,$B94,1)&\",\"&INDEX(swimmers_data,$B94,2)&\",\"&INDEX(swimmers_data,$B94,4)&\",\"&TEXT(INDEX(swimmers_data,$B94,3),\"ddmmYy\")&\",\"&LEFT(\"000000\",6-LEN(I94))&I94&\",\"&W$11&\",\"&\"F\",\"\")","v":""},{"$f":"IF(AND(ISNUMBER($B94),$B94>0,J94<>\"\"),INDEX(swimmers_data,$B94,5)&\",\"&INDEX(swimmers_data,$B94,1)&\",\"&INDEX(swimmers_data,$B94,2)&\",\"&INDEX(swimmers_data,$B94,4)&\",\"&TEXT(INDEX(swimmers_data,$B94,3),\"ddmmYy\")&\",\"&LEFT(\"000000\",6-LEN(J94))&J94&\",\"&X$11&\",\"&\"F\",\"\")","v":""},{"$f":"IF(AND(ISNUMBER($B94),$B94>0,K94<>\"\"),INDEX(swimmers_data,$B94,5)&\",\"&INDEX(swimmers_data,$B94,1)&\",\"&INDEX(swimmers_data,$B94,2)&\",\"&INDEX(swimmers_data,$B94,4)&\",\"&TEXT(INDEX(swimmers_data,$B94,3),\"ddmmYy\")&\",\"&LEFT(\"000000\",6-LEN(K94))&K94&\",\"&Y$11&\",\"&\"F\",\"\")","v":""},{"$f":"IF(AND(ISNUMBER($B94),$B94>0,L94<>\"\"),INDEX(swimmers_data,$B94,5)&\",\"&INDEX(swimmers_data,$B94,1)&\",\"&INDEX(swimmers_data,$B94,2)&\",\"&INDEX(swimmers_data,$B94,4)&\",\"&TEXT(INDEX(swimmers_data,$B94,3),\"ddmmYy\")&\",\"&LEFT(\"000000\",6-LEN(L94))&L94&\",\"&Z$11&\",\"&\"F\",\"\")","v":""},{"$f":"IF(AND(ISNUMBER($B94),$B94>0,M94<>\"\"),INDEX(swimmers_data,$B94,5)&\",\"&INDEX(swimmers_data,$B94,1)&\",\"&INDEX(swimmers_data,$B94,2)&\",\"&INDEX(swimmers_data,$B94,4)&\",\"&TEXT(INDEX(swimmers_data,$B94,3),\"ddmmYy\")&\",\"&LEFT(\"000000\",6-LEN(M94))&M94&\",\"&AA$11&\",\"&\"F\",\"\")","v":""},{"$f":"IF(AND(ISNUMBER($B94),$B94>0,N94<>\"\"),INDEX(swimmers_data,$B94,5)&\",\"&INDEX(swimmers_data,$B94,1)&\",\"&INDEX(swimmers_data,$B94,2)&\",\"&INDEX(swimmers_data,$B94,4)&\",\"&TEXT(INDEX(swimmers_data,$B94,3),\"ddmmYy\")&\",\"&LEFT(\"000000\",6-LEN(N94))&N94&\",\"&AB$11&\",\"&\"F\",\"\")","v":""},null,null,"","","",{"$f":"IF(AND(ISNUMBER($B94),$B94>0,E94<>\"\"),formatMMSSHHtime(E94),\"\")","v":""},{"$f":"IF(AND(ISNUMBER($B94),$B94>0,F94<>\"\"),formatMMSSHHtime(F94),\"\")","v":""},{"$f":"IF(AND(ISNUMBER($B94),$B94>0,G94<>\"\"),formatMMSSHHtime(G94),\"\")","v":""},{"$f":"IF(AND(ISNUMBER($B94),$B94>0,H94<>\"\"),formatMMSSHHtime(H94),\"\")","v":""},{"$f":"IF(AND(ISNUMBER($B94),$B94>0,I94<>\"\"),formatMMSSHHtime(I94),\"\")","v":""},{"$f":"IF(AND(ISNUMBER($B94),$B94>0,J94<>\"\"),formatMMSSHHtime(J94),\"\")","v":""},{"$f":"IF(AND(ISNUMBER($B94),$B94>0,K94<>\"\"),formatMMSSHHtime(K94),\"\")","v":""},{"$f":"IF(AND(ISNUMBER($B94),$B94>0,L94<>\"\"),formatMMSSHHtime(L94),\"\")","v":""},{"$f":"IF(AND(ISNUMBER($B94),$B94>0,M94<>\"\"),formatMMSSHHtime(M94),\"\")","v":""},{"$f":"IF(AND(ISNUMBER($B94),$B94>0,N94<>\"\"),formatMMSSHHtime(N94),\"\")","v":""}]
["","",{"$f":"IF(AND(ISNUMBER(B95),B95>0),DATEDIF(INDEX(swimmers_data,B95,3),$C$8,\"Y\"),\"\")","v":""},{"$f":"IF(AND(ISNUMBER(B95),B95>0),INDEX(swimmers_data,B95,5),\"\")","v":""},null,null,null,null,null,null,null,null,null,null,null,null,null,null,{"$f":"IF(AND(ISNUMBER($B95),$B95>0,E95<>\"\"),INDEX(swimmers_data,$B95,5)&\",\"&INDEX(swimmers_data,$B95,1)&\",\"&INDEX(swimmers_data,$B95,2)&\",\"&INDEX(swimmers_data,$B95,4)&\",\"&TEXT(INDEX(swimmers_data,$B95,3),\"ddmmYy\")&\",\"&LEFT(\"000000\",6-LEN(E95))&E95&\",\"&S$11&\",\"&\"F\",\"\")","v":""},{"$f":"IF(AND(ISNUMBER($B95),$B95>0,F95<>\"\"),INDEX(swimmers_data,$B95,5)&\",\"&INDEX(swimmers_data,$B95,1)&\",\"&INDEX(swimmers_data,$B95,2)&\",\"&INDEX(swimmers_data,$B95,4)&\",\"&TEXT(INDEX(swimmers_data,$B95,3),\"ddmmYy\")&\",\"&LEFT(\"000000\",6-LEN(F95))&F95&\",\"&T$11&\",\"&\"F\",\"\")","v":""},{"$f":"IF(AND(ISNUMBER($B95),$B95>0,G95<>\"\"),INDEX(swimmers_data,$B95,5)&\",\"&INDEX(swimmers_data,$B95,1)&\",\"&INDEX(swimmers_data,$B95,2)&\",\"&INDEX(swimmers_data,$B95,4)&\",\"&TEXT(INDEX(swimmers_data,$B95,3),\"ddmmYy\")&\",\"&LEFT(\"000000\",6-LEN(G95))&G95&\",\"&U$11&\",\"&\"F\",\"\")","v":""},{"$f":"IF(AND(ISNUMBER($B95),$B95>0,H95<>\"\"),INDEX(swimmers_data,$B95,5)&\",\"&INDEX(swimmers_data,$B95,1)&\",\"&INDEX(swimmers_data,$B95,2)&\",\"&INDEX(swimmers_data,$B95,4)&\",\"&TEXT(INDEX(swimmers_data,$B95,3),\"ddmmYy\")&\",\"&LEFT(\"000000\",6-LEN(H95))&H95&\",\"&V$11&\",\"&\"F\",\"\")","v":""},{"$f":"IF(AND(ISNUMBER($B95),$B95>0,I95<>\"\"),INDEX(swimmers_data,$B95,5)&\",\"&INDEX(swimmers_data,$B95,1)&\",\"&INDEX(swimmers_data,$B95,2)&\",\"&INDEX(swimmers_data,$B95,4)&\",\"&TEXT(INDEX(swimmers_data,$B95,3),\"ddmmYy\")&\",\"&LEFT(\"000000\",6-LEN(I95))&I95&\",\"&W$11&\",\"&\"F\",\"\")","v":""},{"$f":"IF(AND(ISNUMBER($B95),$B95>0,J95<>\"\"),INDEX(swimmers_data,$B95,5)&\",\"&INDEX(swimmers_data,$B95,1)&\",\"&INDEX(swimmers_data,$B95,2)&\",\"&INDEX(swimmers_data,$B95,4)&\",\"&TEXT(INDEX(swimmers_data,$B95,3),\"ddmmYy\")&\",\"&LEFT(\"000000\",6-LEN(J95))&J95&\",\"&X$11&\",\"&\"F\",\"\")","v":""},{"$f":"IF(AND(ISNUMBER($B95),$B95>0,K95<>\"\"),INDEX(swimmers_data,$B95,5)&\",\"&INDEX(swimmers_data,$B95,1)&\",\"&INDEX(swimmers_data,$B95,2)&\",\"&INDEX(swimmers_data,$B95,4)&\",\"&TEXT(INDEX(swimmers_data,$B95,3),\"ddmmYy\")&\",\"&LEFT(\"000000\",6-LEN(K95))&K95&\",\"&Y$11&\",\"&\"F\",\"\")","v":""},{"$f":"IF(AND(ISNUMBER($B95),$B95>0,L95<>\"\"),INDEX(swimmers_data,$B95,5)&\",\"&INDEX(swimmers_data,$B95,1)&\",\"&INDEX(swimmers_data,$B95,2)&\",\"&INDEX(swimmers_data,$B95,4)&\",\"&TEXT(INDEX(swimmers_data,$B95,3),\"ddmmYy\")&\",\"&LEFT(\"000000\",6-LEN(L95))&L95&\",\"&Z$11&\",\"&\"F\",\"\")","v":""},{"$f":"IF(AND(ISNUMBER($B95),$B95>0,M95<>\"\"),INDEX(swimmers_data,$B95,5)&\",\"&INDEX(swimmers_data,$B95,1)&\",\"&INDEX(swimmers_data,$B95,2)&\",\"&INDEX(swimmers_data,$B95,4)&\",\"&TEXT(INDEX(swimmers_data,$B95,3),\"ddmmYy\")&\",\"&LEFT(\"000000\",6-LEN(M95))&M95&\",\"&AA$11&\",\"&\"F\",\"\")","v":""},{"$f":"IF(AND(ISNUMBER($B95),$B95>0,N95<>\"\"),INDEX(swimmers_data,$B95,5)&\",\"&INDEX(swimmers_data,$B95,1)&\",\"&INDEX(swimmers_data,$B95,2)&\",\"&INDEX(swimmers_data,$B95,4)&\",\"&TEXT(INDEX(swimmers_data,$B95,3),\"ddmmYy\")&\",\"&LEFT(\"000000\",6-LEN(N95))&N95&\",\"&AB$11&\",\"&\"F\",\"\")","v":""},null,null,"","","",{"$f":"IF(AND(ISNUMBER($B95),$B95>0,E95<>\"\"),formatMMSSHHtime(E95),\"\")","v":""},{"$f":"IF(AND(ISNUMBER($B95),$B95>0,F95<>\"\"),formatMMSSHHtime(F95),\"\")","v":""},{"$f":"IF(AND(ISNUMBER($B95),$B95>0,G95<>\"\"),formatMMSSHHtime(G95),\"\")","v":""},{"$f":"IF(AND(ISNUMBER($B95),$B95>0,H95<>\"\"),formatMMSSHHtime(H95),\"\")","v":""},{"$f":"IF(AND(ISNUMBER($B95),$B95>0,I95<>\"\"),formatMMSSHHtime(I95),\"\")","v":""},{"$f":"IF(AND(ISNUMBER($B95),$B95>0,J95<>\"\"),formatMMSSHHtime(J95),\"\")","v":""},{"$f":"IF(AND(ISNUMBER($B95),$B95>0,K95<>\"\"),formatMMSSHHtime(K95),\"\")","v":""},{"$f":"IF(AND(ISNUMBER($B95),$B95>0,L95<>\"\"),formatMMSSHHtime(L95),\"\")","v":""},{"$f":"IF(AND(ISNUMBER($B95),$B95>0,M95<>\"\"),formatMMSSHHtime(M95),\"\")","v":""},{"$f":"IF(AND(ISNUMBER($B95),$B95>0,N95<>\"\"),formatMMSSHHtime(N95),\"\")","v":""}]
["","",{"$f":"IF(AND(ISNUMBER(B96),B96>0),DATEDIF(INDEX(swimmers_data,B96,3),$C$8,\"Y\"),\"\")","v":""},{"$f":"IF(AND(ISNUMBER(B96),B96>0),INDEX(swimmers_data,B96,5),\"\")","v":""},null,null,null,null,null,null,null,null,null,null,null,null,null,null,{"$f":"IF(AND(ISNUMBER($B96),$B96>0,E96<>\"\"),INDEX(swimmers_data,$B96,5)&\",\"&INDEX(swimmers_data,$B96,1)&\",\"&INDEX(swimmers_data,$B96,2)&\",\"&INDEX(swimmers_data,$B96,4)&\",\"&TEXT(INDEX(swimmers_data,$B96,3),\"ddmmYy\")&\",\"&LEFT(\"000000\",6-LEN(E96))&E96&\",\"&S$11&\",\"&\"F\",\"\")","v":""},{"$f":"IF(AND(ISNUMBER($B96),$B96>0,F96<>\"\"),INDEX(swimmers_data,$B96,5)&\",\"&INDEX(swimmers_data,$B96,1)&\",\"&INDEX(swimmers_data,$B96,2)&\",\"&INDEX(swimmers_data,$B96,4)&\",\"&TEXT(INDEX(swimmers_data,$B96,3),\"ddmmYy\")&\",\"&LEFT(\"000000\",6-LEN(F96))&F96&\",\"&T$11&\",\"&\"F\",\"\")","v":""},{"$f":"IF(AND(ISNUMBER($B96),$B96>0,G96<>\"\"),INDEX(swimmers_data,$B96,5)&\",\"&INDEX(swimmers_data,$B96,1)&\",\"&INDEX(swimmers_data,$B96,2)&\",\"&INDEX(swimmers_data,$B96,4)&\",\"&TEXT(INDEX(swimmers_data,$B96,3),\"ddmmYy\")&\",\"&LEFT(\"000000\",6-LEN(G96))&G96&\",\"&U$11&\",\"&\"F\",\"\")","v":""},{"$f":"IF(AND(ISNUMBER($B96),$B96>0,H96<>\"\"),INDEX(swimmers_data,$B96,5)&\",\"&INDEX(swimmers_data,$B96,1)&\",\"&INDEX(swimmers_data,$B96,2)&\",\"&INDEX(swimmers_data,$B96,4)&\",\"&TEXT(INDEX(swimmers_data,$B96,3),\"ddmmYy\")&\",\"&LEFT(\"000000\",6-LEN(H96))&H96&\",\"&V$11&\",\"&\"F\",\"\")","v":""},{"$f":"IF(AND(ISNUMBER($B96),$B96>0,I96<>\"\"),INDEX(swimmers_data,$B96,5)&\",\"&INDEX(swimmers_data,$B96,1)&\",\"&INDEX(swimmers_data,$B96,2)&\",\"&INDEX(swimmers_data,$B96,4)&\",\"&TEXT(INDEX(swimmers_data,$B96,3),\"ddmmYy\")&\",\"&LEFT(\"000000\",6-LEN(I96))&I96&\",\"&W$11&\",\"&\"F\",\"\")","v":""},{"$f":"IF(AND(ISNUMBER($B96),$B96>0,J96<>\"\"),INDEX(swimmers_data,$B96,5)&\",\"&INDEX(swimmers_data,$B96,1)&\",\"&INDEX(swimmers_data,$B96,2)&\",\"&INDEX(swimmers_data,$B96,4)&\",\"&TEXT(INDEX(swimmers_data,$B96,3),\"ddmmYy\")&\",\"&LEFT(\"000000\",6-LEN(J96))&J96&\",\"&X$11&\",\"&\"F\",\"\")","v":""},{"$f":"IF(AND(ISNUMBER($B96),$B96>0,K96<>\"\"),INDEX(swimmers_data,$B96,5)&\",\"&INDEX(swimmers_data,$B96,1)&\",\"&INDEX(swimmers_data,$B96,2)&\",\"&INDEX(swimmers_data,$B96,4)&\",\"&TEXT(INDEX(swimmers_data,$B96,3),\"ddmmYy\")&\",\"&LEFT(\"000000\",6-LEN(K96))&K96&\",\"&Y$11&\",\"&\"F\",\"\")","v":""},{"$f":"IF(AND(ISNUMBER($B96),$B96>0,L96<>\"\"),INDEX(swimmers_data,$B96,5)&\",\"&INDEX(swimmers_data,$B96,1)&\",\"&INDEX(swimmers_data,$B96,2)&\",\"&INDEX(swimmers_data,$B96,4)&\",\"&TEXT(INDEX(swimmers_data,$B96,3),\"ddmmYy\")&\",\"&LEFT(\"000000\",6-LEN(L96))&L96&\",\"&Z$11&\",\"&\"F\",\"\")","v":""},{"$f":"IF(AND(ISNUMBER($B96),$B96>0,M96<>\"\"),INDEX(swimmers_data,$B96,5)&\",\"&INDEX(swimmers_data,$B96,1)&\",\"&INDEX(swimmers_data,$B96,2)&\",\"&INDEX(swimmers_data,$B96,4)&\",\"&TEXT(INDEX(swimmers_data,$B96,3),\"ddmmYy\")&\",\"&LEFT(\"000000\",6-LEN(M96))&M96&\",\"&AA$11&\",\"&\"F\",\"\")","v":""},{"$f":"IF(AND(ISNUMBER($B96),$B96>0,N96<>\"\"),INDEX(swimmers_data,$B96,5)&\",\"&INDEX(swimmers_data,$B96,1)&\",\"&INDEX(swimmers_data,$B96,2)&\",\"&INDEX(swimmers_data,$B96,4)&\",\"&TEXT(INDEX(swimmers_data,$B96,3),\"ddmmYy\")&\",\"&LEFT(\"000000\",6-LEN(N96))&N96&\",\"&AB$11&\",\"&\"F\",\"\")","v":""},null,null,"","","",{"$f":"IF(AND(ISNUMBER($B96),$B96>0,E96<>\"\"),formatMMSSHHtime(E96),\"\")","v":""},{"$f":"IF(AND(ISNUMBER($B96),$B96>0,F96<>\"\"),formatMMSSHHtime(F96),\"\")","v":""},{"$f":"IF(AND(ISNUMBER($B96),$B96>0,G96<>\"\"),formatMMSSHHtime(G96),\"\")","v":""},{"$f":"IF(AND(ISNUMBER($B96),$B96>0,H96<>\"\"),formatMMSSHHtime(H96),\"\")","v":""},{"$f":"IF(AND(ISNUMBER($B96),$B96>0,I96<>\"\"),formatMMSSHHtime(I96),\"\")","v":""},{"$f":"IF(AND(ISNUMBER($B96),$B96>0,J96<>\"\"),formatMMSSHHtime(J96),\"\")","v":""},{"$f":"IF(AND(ISNUMBER($B96),$B96>0,K96<>\"\"),formatMMSSHHtime(K96),\"\")","v":""},{"$f":"IF(AND(ISNUMBER($B96),$B96>0,L96<>\"\"),formatMMSSHHtime(L96),\"\")","v":""},{"$f":"IF(AND(ISNUMBER($B96),$B96>0,M96<>\"\"),formatMMSSHHtime(M96),\"\")","v":""},{"$f":"IF(AND(ISNUMBER($B96),$B96>0,N96<>\"\"),formatMMSSHHtime(N96),\"\")","v":""}]
["","",{"$f":"IF(AND(ISNUMBER(B97),B97>0),DATEDIF(INDEX(swimmers_data,B97,3),$C$8,\"Y\"),\"\")","v":""},{"$f":"IF(AND(ISNUMBER(B97),B97>0),INDEX(swimmers_data,B97,5),\"\")","v":""},null,null,null,null,null,null,null,null,null,null,null,null,null,null,{"$f":"IF(AND(ISNUMBER($B97),$B97>0,E97<>\"\"),INDEX(swimmers_data,$B97,5)&\",\"&INDEX(swimmers_data,$B97,1)&\",\"&INDEX(swimmers_data,$B97,2)&\",\"&INDEX(swimmers_data,$B97,4)&\",\"&TEXT(INDEX(swimmers_data,$B97,3),\"ddmmYy\")&\",\"&LEFT(\"000000\",6-LEN(E97))&E97&\",\"&S$11&\",\"&\"F\",\"\")","v":""},{"$f":"IF(AND(ISNUMBER($B97),$B97>0,F97<>\"\"),INDEX(swimmers_data,$B97,5)&\",\"&INDEX(swimmers_data,$B97,1)&\",\"&INDEX(swimmers_data,$B97,2)&\",\"&INDEX(swimmers_data,$B97,4)&\",\"&TEXT(INDEX(swimmers_data,$B97,3),\"ddmmYy\")&\",\"&LEFT(\"000000\",6-LEN(F97))&F97&\",\"&T$11&\",\"&\"F\",\"\")","v":""},{"$f":"IF(AND(ISNUMBER($B97),$B97>0,G97<>\"\"),INDEX(swimmers_data,$B97,5)&\",\"&INDEX(swimmers_data,$B97,1)&\",\"&INDEX(swimmers_data,$B97,2)&\",\"&INDEX(swimmers_data,$B97,4)&\",\"&TEXT(INDEX(swimmers_data,$B97,3),\"ddmmYy\")&\",\"&LEFT(\"000000\",6-LEN(G97))&G97&\",\"&U$11&\",\"&\"F\",\"\")","v":""},{"$f":"IF(AND(ISNUMBER($B97),$B97>0,H97<>\"\"),INDEX(swimmers_data,$B97,5)&\",\"&INDEX(swimmers_data,$B97,1)&\",\"&INDEX(swimmers_data,$B97,2)&\",\"&INDEX(swimmers_data,$B97,4)&\",\"&TEXT(INDEX(swimmers_data,$B97,3),\"ddmmYy\")&\",\"&LEFT(\"000000\",6-LEN(H97))&H97&\",\"&V$11&\",\"&\"F\",\"\")","v":""},{"$f":"IF(AND(ISNUMBER($B97),$B97>0,I97<>\"\"),INDEX(swimmers_data,$B97,5)&\",\"&INDEX(swimmers_data,$B97,1)&\",\"&INDEX(swimmers_data,$B97,2)&\",\"&INDEX(swimmers_data,$B97,4)&\",\"&TEXT(INDEX(swimmers_data,$B97,3),\"ddmmYy\")&\",\"&LEFT(\"000000\",6-LEN(I97))&I97&\",\"&W$11&\",\"&\"F\",\"\")","v":""},{"$f":"IF(AND(ISNUMBER($B97),$B97>0,J97<>\"\"),INDEX(swimmers_data,$B97,5)&\",\"&INDEX(swimmers_data,$B97,1)&\",\"&INDEX(swimmers_data,$B97,2)&\",\"&INDEX(swimmers_data,$B97,4)&\",\"&TEXT(INDEX(swimmers_data,$B97,3),\"ddmmYy\")&\",\"&LEFT(\"000000\",6-LEN(J97))&J97&\",\"&X$11&\",\"&\"F\",\"\")","v":""},{"$f":"IF(AND(ISNUMBER($B97),$B97>0,K97<>\"\"),INDEX(swimmers_data,$B97,5)&\",\"&INDEX(swimmers_data,$B97,1)&\",\"&INDEX(swimmers_data,$B97,2)&\",\"&INDEX(swimmers_data,$B97,4)&\",\"&TEXT(INDEX(swimmers_data,$B97,3),\"ddmmYy\")&\",\"&LEFT(\"000000\",6-LEN(K97))&K97&\",\"&Y$11&\",\"&\"F\",\"\")","v":""},{"$f":"IF(AND(ISNUMBER($B97),$B97>0,L97<>\"\"),INDEX(swimmers_data,$B97,5)&\",\"&INDEX(swimmers_data,$B97,1)&\",\"&INDEX(swimmers_data,$B97,2)&\",\"&INDEX(swimmers_data,$B97,4)&\",\"&TEXT(INDEX(swimmers_data,$B97,3),\"ddmmYy\")&\",\"&LEFT(\"000000\",6-LEN(L97))&L97&\",\"&Z$11&\",\"&\"F\",\"\")","v":""},{"$f":"IF(AND(ISNUMBER($B97),$B97>0,M97<>\"\"),INDEX(swimmers_data,$B97,5)&\",\"&INDEX(swimmers_data,$B97,1)&\",\"&INDEX(swimmers_data,$B97,2)&\",\"&INDEX(swimmers_data,$B97,4)&\",\"&TEXT(INDEX(swimmers_data,$B97,3),\"ddmmYy\")&\",\"&LEFT(\"000000\",6-LEN(M97))&M97&\",\"&AA$11&\",\"&\"F\",\"\")","v":""},{"$f":"IF(AND(ISNUMBER($B97),$B97>0,N97<>\"\"),INDEX(swimmers_data,$B97,5)&\",\"&INDEX(swimmers_data,$B97,1)&\",\"&INDEX(swimmers_data,$B97,2)&\",\"&INDEX(swimmers_data,$B97,4)&\",\"&TEXT(INDEX(swimmers_data,$B97,3),\"ddmmYy\")&\",\"&LEFT(\"000000\",6-LEN(N97))&N97&\",\"&AB$11&\",\"&\"F\",\"\")","v":""},null,null,"","","",{"$f":"IF(AND(ISNUMBER($B97),$B97>0,E97<>\"\"),formatMMSSHHtime(E97),\"\")","v":""},{"$f":"IF(AND(ISNUMBER($B97),$B97>0,F97<>\"\"),formatMMSSHHtime(F97),\"\")","v":""},{"$f":"IF(AND(ISNUMBER($B97),$B97>0,G97<>\"\"),formatMMSSHHtime(G97),\"\")","v":""},{"$f":"IF(AND(ISNUMBER($B97),$B97>0,H97<>\"\"),formatMMSSHHtime(H97),\"\")","v":""},{"$f":"IF(AND(ISNUMBER($B97),$B97>0,I97<>\"\"),formatMMSSHHtime(I97),\"\")","v":""},{"$f":"IF(AND(ISNUMBER($B97),$B97>0,J97<>\"\"),formatMMSSHHtime(J97),\"\")","v":""},{"$f":"IF(AND(ISNUMBER($B97),$B97>0,K97<>\"\"),formatMMSSHHtime(K97),\"\")","v":""},{"$f":"IF(AND(ISNUMBER($B97),$B97>0,L97<>\"\"),formatMMSSHHtime(L97),\"\")","v":""},{"$f":"IF(AND(ISNUMBER($B97),$B97>0,M97<>\"\"),formatMMSSHHtime(M97),\"\")","v":""},{"$f":"IF(AND(ISNUMBER($B97),$B97>0,N97<>\"\"),formatMMSSHHtime(N97),\"\")","v":""}]
["","",{"$f":"IF(AND(ISNUMBER(B98),B98>0),DATEDIF(INDEX(swimmers_data,B98,3),$C$8,\"Y\"),\"\")","v":""},{"$f":"IF(AND(ISNUMBER(B98),B98>0),INDEX(swimmers_data,B98,5),\"\")","v":""},null,null,null,null,null,null,null,null,null,null,null,null,null,null,{"$f":"IF(AND(ISNUMBER($B98),$B98>0,E98<>\"\"),INDEX(swimmers_data,$B98,5)&\",\"&INDEX(swimmers_data,$B98,1)&\",\"&INDEX(swimmers_data,$B98,2)&\",\"&INDEX(swimmers_data,$B98,4)&\",\"&TEXT(INDEX(swimmers_data,$B98,3),\"ddmmYy\")&\",\"&LEFT(\"000000\",6-LEN(E98))&E98&\",\"&S$11&\",\"&\"F\",\"\")","v":""},{"$f":"IF(AND(ISNUMBER($B98),$B98>0,F98<>\"\"),INDEX(swimmers_data,$B98,5)&\",\"&INDEX(swimmers_data,$B98,1)&\",\"&INDEX(swimmers_data,$B98,2)&\",\"&INDEX(swimmers_data,$B98,4)&\",\"&TEXT(INDEX(swimmers_data,$B98,3),\"ddmmYy\")&\",\"&LEFT(\"000000\",6-LEN(F98))&F98&\",\"&T$11&\",\"&\"F\",\"\")","v":""},{"$f":"IF(AND(ISNUMBER($B98),$B98>0,G98<>\"\"),INDEX(swimmers_data,$B98,5)&\",\"&INDEX(swimmers_data,$B98,1)&\",\"&INDEX(swimmers_data,$B98,2)&\",\"&INDEX(swimmers_data,$B98,4)&\",\"&TEXT(INDEX(swimmers_data,$B98,3),\"ddmmYy\")&\",\"&LEFT(\"000000\",6-LEN(G98))&G98&\",\"&U$11&\",\"&\"F\",\"\")","v":""},{"$f":"IF(AND(ISNUMBER($B98),$B98>0,H98<>\"\"),INDEX(swimmers_data,$B98,5)&\",\"&INDEX(swimmers_data,$B98,1)&\",\"&INDEX(swimmers_data,$B98,2)&\",\"&INDEX(swimmers_data,$B98,4)&\",\"&TEXT(INDEX(swimmers_data,$B98,3),\"ddmmYy\")&\",\"&LEFT(\"000000\",6-LEN(H98))&H98&\",\"&V$11&\",\"&\"F\",\"\")","v":""},{"$f":"IF(AND(ISNUMBER($B98),$B98>0,I98<>\"\"),INDEX(swimmers_data,$B98,5)&\",\"&INDEX(swimmers_data,$B98,1)&\",\"&INDEX(swimmers_data,$B98,2)&\",\"&INDEX(swimmers_data,$B98,4)&\",\"&TEXT(INDEX(swimmers_data,$B98,3),\"ddmmYy\")&\",\"&LEFT(\"000000\",6-LEN(I98))&I98&\",\"&W$11&\",\"&\"F\",\"\")","v":""},{"$f":"IF(AND(ISNUMBER($B98),$B98>0,J98<>\"\"),INDEX(swimmers_data,$B98,5)&\",\"&INDEX(swimmers_data,$B98,1)&\",\"&INDEX(swimmers_data,$B98,2)&\",\"&INDEX(swimmers_data,$B98,4)&\",\"&TEXT(INDEX(swimmers_data,$B98,3),\"ddmmYy\")&\",\"&LEFT(\"000000\",6-LEN(J98))&J98&\",\"&X$11&\",\"&\"F\",\"\")","v":""},{"$f":"IF(AND(ISNUMBER($B98),$B98>0,K98<>\"\"),INDEX(swimmers_data,$B98,5)&\",\"&INDEX(swimmers_data,$B98,1)&\",\"&INDEX(swimmers_data,$B98,2)&\",\"&INDEX(swimmers_data,$B98,4)&\",\"&TEXT(INDEX(swimmers_data,$B98,3),\"ddmmYy\")&\",\"&LEFT(\"000000\",6-LEN(K98))&K98&\",\"&Y$11&\",\"&\"F\",\"\")","v":""},{"$f":"IF(AND(ISNUMBER($B98),$B98>0,L98<>\"\"),INDEX(swimmers_data,$B98,5)&\",\"&INDEX(swimmers_data,$B98,1)&\",\"&INDEX(swimmers_data,$B98,2)&\",\"&INDEX(swimmers_data,$B98,4)&\",\"&TEXT(INDEX(swimmers_data,$B98,3),\"ddmmYy\")&\",\"&LEFT(\"000000\",6-LEN(L98))&L98&\",\"&Z$11&\",\"&\"F\",\"\")","v":""},{"$f":"IF(AND(ISNUMBER($B98),$B98>0,M98<>\"\"),INDEX(swimmers_data,$B98,5)&\",\"&INDEX(swimmers_data,$B98,1)&\",\"&INDEX(swimmers_data,$B98,2)&\",\"&INDEX(swimmers_data,$B98,4)&\",\"&TEXT(INDEX(swimmers_data,$B98,3),\"ddmmYy\")&\",\"&LEFT(\"000000\",6-LEN(M98))&M98&\",\"&AA$11&\",\"&\"F\",\"\")","v":""},{"$f":"IF(AND(ISNUMBER($B98),$B98>0,N98<>\"\"),INDEX(swimmers_data,$B98,5)&\",\"&INDEX(swimmers_data,$B98,1)&\",\"&INDEX(swimmers_data,$B98,2)&\",\"&INDEX(swimmers_data,$B98,4)&\",\"&TEXT(INDEX(swimmers_data,$B98,3),\"ddmmYy\")&\",\"&LEFT(\"000000\",6-LEN(N98))&N98&\",\"&AB$11&\",\"&\"F\",\"\")","v":""},null,null,"","","",{"$f":"IF(AND(ISNUMBER($B98),$B98>0,E98<>\"\"),formatMMSSHHtime(E98),\"\")","v":""},{"$f":"IF(AND(ISNUMBER($B98),$B98>0,F98<>\"\"),formatMMSSHHtime(F98),\"\")","v":""},{"$f":"IF(AND(ISNUMBER($B98),$B98>0,G98<>\"\"),formatMMSSHHtime(G98),\"\")","v":""},{"$f":"IF(AND(ISNUMBER($B98),$B98>0,H98<>\"\"),formatMMSSHHtime(H98),\"\")","v":""},{"$f":"IF(AND(ISNUMBER($B98),$B98>0,I98<>\"\"),formatMMSSHHtime(I98),\"\")","v":""},{"$f":"IF(AND(ISNUMBER($B98),$B98>0,J98<>\"\"),formatMMSSHHtime(J98),\"\")","v":""},{"$f":"IF(AND(ISNUMBER($B98),$B98>0,K98<>\"\"),formatMMSSHHtime(K98),\"\")","v":""},{"$f":"IF(AND(ISNUMBER($B98),$B98>0,L98<>\"\"),formatMMSSHHtime(L98),\"\")","v":""},{"$f":"IF(AND(ISNUMBER($B98),$B98>0,M98<>\"\"),formatMMSSHHtime(M98),\"\")","v":""},{"$f":"IF(AND(ISNUMBER($B98),$B98>0,N98<>\"\"),formatMMSSHHtime(N98),\"\")","v":""}]
["","",{"$f":"IF(AND(ISNUMBER(B99),B99>0),DATEDIF(INDEX(swimmers_data,B99,3),$C$8,\"Y\"),\"\")","v":""},{"$f":"IF(AND(ISNUMBER(B99),B99>0),INDEX(swimmers_data,B99,5),\"\")","v":""},null,null,null,null,null,null,null,null,null,null,null,null,null,null,{"$f":"IF(AND(ISNUMBER($B99),$B99>0,E99<>\"\"),INDEX(swimmers_data,$B99,5)&\",\"&INDEX(swimmers_data,$B99,1)&\",\"&INDEX(swimmers_data,$B99,2)&\",\"&INDEX(swimmers_data,$B99,4)&\",\"&TEXT(INDEX(swimmers_data,$B99,3),\"ddmmYy\")&\",\"&LEFT(\"000000\",6-LEN(E99))&E99&\",\"&S$11&\",\"&\"F\",\"\")","v":""},{"$f":"IF(AND(ISNUMBER($B99),$B99>0,F99<>\"\"),INDEX(swimmers_data,$B99,5)&\",\"&INDEX(swimmers_data,$B99,1)&\",\"&INDEX(swimmers_data,$B99,2)&\",\"&INDEX(swimmers_data,$B99,4)&\",\"&TEXT(INDEX(swimmers_data,$B99,3),\"ddmmYy\")&\",\"&LEFT(\"000000\",6-LEN(F99))&F99&\",\"&T$11&\",\"&\"F\",\"\")","v":""},{"$f":"IF(AND(ISNUMBER($B99),$B99>0,G99<>\"\"),INDEX(swimmers_data,$B99,5)&\",\"&INDEX(swimmers_data,$B99,1)&\",\"&INDEX(swimmers_data,$B99,2)&\",\"&INDEX(swimmers_data,$B99,4)&\",\"&TEXT(INDEX(swimmers_data,$B99,3),\"ddmmYy\")&\",\"&LEFT(\"000000\",6-LEN(G99))&G99&\",\"&U$11&\",\"&\"F\",\"\")","v":""},{"$f":"IF(AND(ISNUMBER($B99),$B99>0,H99<>\"\"),INDEX(swimmers_data,$B99,5)&\",\"&INDEX(swimmers_data,$B99,1)&\",\"&INDEX(swimmers_data,$B99,2)&\",\"&INDEX(swimmers_data,$B99,4)&\",\"&TEXT(INDEX(swimmers_data,$B99,3),\"ddmmYy\")&\",\"&LEFT(\"000000\",6-LEN(H99))&H99&\",\"&V$11&\",\"&\"F\",\"\")","v":""},{"$f":"IF(AND(ISNUMBER($B99),$B99>0,I99<>\"\"),INDEX(swimmers_data,$B99,5)&\",\"&INDEX(swimmers_data,$B99,1)&\",\"&INDEX(swimmers_data,$B99,2)&\",\"&INDEX(swimmers_data,$B99,4)&\",\"&TEXT(INDEX(swimmers_data,$B99,3),\"ddmmYy\")&\",\"&LEFT(\"000000\",6-LEN(I99))&I99&\",\"&W$11&\",\"&\"F\",\"\")","v":""},{"$f":"IF(AND(ISNUMBER($B99),$B99>0,J99<>\"\"),INDEX(swimmers_data,$B99,5)&\",\"&INDEX(swimmers_data,$B99,1)&\",\"&INDEX(swimmers_data,$B99,2)&\",\"&INDEX(swimmers_data,$B99,4)&\",\"&TEXT(INDEX(swimmers_data,$B99,3),\"ddmmYy\")&\",\"&LEFT(\"000000\",6-LEN(J99))&J99&\",\"&X$11&\",\"&\"F\",\"\")","v":""},{"$f":"IF(AND(ISNUMBER($B99),$B99>0,K99<>\"\"),INDEX(swimmers_data,$B99,5)&\",\"&INDEX(swimmers_data,$B99,1)&\",\"&INDEX(swimmers_data,$B99,2)&\",\"&INDEX(swimmers_data,$B99,4)&\",\"&TEXT(INDEX(swimmers_data,$B99,3),\"ddmmYy\")&\",\"&LEFT(\"000000\",6-LEN(K99))&K99&\",\"&Y$11&\",\"&\"F\",\"\")","v":""},{"$f":"IF(AND(ISNUMBER($B99),$B99>0,L99<>\"\"),INDEX(swimmers_data,$B99,5)&\",\"&INDEX(swimmers_data,$B99,1)&\",\"&INDEX(swimmers_data,$B99,2)&\",\"&INDEX(swimmers_data,$B99,4)&\",\"&TEXT(INDEX(swimmers_data,$B99,3),\"ddmmYy\")&\",\"&LEFT(\"000000\",6-LEN(L99))&L99&\",\"&Z$11&\",\"&\"F\",\"\")","v":""},{"$f":"IF(AND(ISNUMBER($B99),$B99>0,M99<>\"\"),INDEX(swimmers_data,$B99,5)&\",\"&INDEX(swimmers_data,$B99,1)&\",\"&INDEX(swimmers_data,$B99,2)&\",\"&INDEX(swimmers_data,$B99,4)&\",\"&TEXT(INDEX(swimmers_data,$B99,3),\"ddmmYy\")&\",\"&LEFT(\"000000\",6-LEN(M99))&M99&\",\"&AA$11&\",\"&\"F\",\"\")","v":""},{"$f":"IF(AND(ISNUMBER($B99),$B99>0,N99<>\"\"),INDEX(swimmers_data,$B99,5)&\",\"&INDEX(swimmers_data,$B99,1)&\",\"&INDEX(swimmers_data,$B99,2)&\",\"&INDEX(swimmers_data,$B99,4)&\",\"&TEXT(INDEX(swimmers_data,$B99,3),\"ddmmYy\")&\",\"&LEFT(\"000000\",6-LEN(N99))&N99&\",\"&AB$11&\",\"&\"F\",\"\")","v":""},null,null,"","","",{"$f":"IF(AND(ISNUMBER($B99),$B99>0,E99<>\"\"),formatMMSSHHtime(E99),\"\")","v":""},{"$f":"IF(AND(ISNUMBER($B99),$B99>0,F99<>\"\"),formatMMSSHHtime(F99),\"\")","v":""},{"$f":"IF(AND(ISNUMBER($B99),$B99>0,G99<>\"\"),formatMMSSHHtime(G99),\"\")","v":""},{"$f":"IF(AND(ISNUMBER($B99),$B99>0,H99<>\"\"),formatMMSSHHtime(H99),\"\")","v":""},{"$f":"IF(AND(ISNUMBER($B99),$B99>0,I99<>\"\"),formatMMSSHHtime(I99),\"\")","v":""},{"$f":"IF(AND(ISNUMBER($B99),$B99>0,J99<>\"\"),formatMMSSHHtime(J99),\"\")","v":""},{"$f":"IF(AND(ISNUMBER($B99),$B99>0,K99<>\"\"),formatMMSSHHtime(K99),\"\")","v":""},{"$f":"IF(AND(ISNUMBER($B99),$B99>0,L99<>\"\"),formatMMSSHHtime(L99),\"\")","v":""},{"$f":"IF(AND(ISNUMBER($B99),$B99>0,M99<>\"\"),formatMMSSHHtime(M99),\"\")","v":""},{"$f":"IF(AND(ISNUMBER($B99),$B99>0,N99<>\"\"),formatMMSSHHtime(N99),\"\")","v":""}]
["","",{"$f":"IF(AND(ISNUMBER(B100),B100>0),DATEDIF(INDEX(swimmers_data,B100,3),$C$8,\"Y\"),\"\")","v":""},{"$f":"IF(AND(ISNUMBER(B100),B100>0),INDEX(swimmers_data,B100,5),\"\")","v":""},null,null,null,null,null,null,null,null,null,null,null,null,null,null,{"$f":"IF(AND(ISNUMBER($B100),$B100>0,E100<>\"\"),INDEX(swimmers_data,$B100,5)&\",\"&INDEX(swimmers_data,$B100,1)&\",\"&INDEX(swimmers_data,$B100,2)&\",\"&INDEX(swimmers_data,$B100,4)&\",\"&TEXT(INDEX(swimmers_data,$B100,3),\"ddmmYy\")&\",\"&LEFT(\"000000\",6-LEN(E100))&E100&\",\"&S$11&\",\"&\"F\",\"\")","v":""},{"$f":"IF(AND(ISNUMBER($B100),$B100>0,F100<>\"\"),INDEX(swimmers_data,$B100,5)&\",\"&INDEX(swimmers_data,$B100,1)&\",\"&INDEX(swimmers_data,$B100,2)&\",\"&INDEX(swimmers_data,$B100,4)&\",\"&TEXT(INDEX(swimmers_data,$B100,3),\"ddmmYy\")&\",\"&LEFT(\"000000\",6-LEN(F100))&F100&\",\"&T$11&\",\"&\"F\",\"\")","v":""},{"$f":"IF(AND(ISNUMBER($B100),$B100>0,G100<>\"\"),INDEX(swimmers_data,$B100,5)&\",\"&INDEX(swimmers_data,$B100,1)&\",\"&INDEX(swimmers_data,$B100,2)&\",\"&INDEX(swimmers_data,$B100,4)&\",\"&TEXT(INDEX(swimmers_data,$B100,3),\"ddmmYy\")&\",\"&LEFT(\"000000\",6-LEN(G100))&G100&\",\"&U$11&\",\"&\"F\",\"\")","v":""},{"$f":"IF(AND(ISNUMBER($B100),$B100>0,H100<>\"\"),INDEX(swimmers_data,$B100,5)&\",\"&INDEX(swimmers_data,$B100,1)&\",\"&INDEX(swimmers_data,$B100,2)&\",\"&INDEX(swimmers_data,$B100,4)&\",\"&TEXT(INDEX(swimmers_data,$B100,3),\"ddmmYy\")&\",\"&LEFT(\"000000\",6-LEN(H100))&H100&\",\"&V$11&\",\"&\"F\",\"\")","v":""},{"$f":"IF(AND(ISNUMBER($B100),$B100>0,I100<>\"\"),INDEX(swimmers_data,$B100,5)&\",\"&INDEX(swimmers_data,$B100,1)&\",\"&INDEX(swimmers_data,$B100,2)&\",\"&INDEX(swimmers_data,$B100,4)&\",\"&TEXT(INDEX(swimmers_data,$B100,3),\"ddmmYy\")&\",\"&LEFT(\"000000\",6-LEN(I100))&I100&\",\"&W$11&\",\"&\"F\",\"\")","v":""},{"$f":"IF(AND(ISNUMBER($B100),$B100>0,J100<>\"\"),INDEX(swimmers_data,$B100,5)&\",\"&INDEX(swimmers_data,$B100,1)&\",\"&INDEX(swimmers_data,$B100,2)&\",\"&INDEX(swimmers_data,$B100,4)&\",\"&TEXT(INDEX(swimmers_data,$B100,3),\"ddmmYy\")&\",\"&LEFT(\"000000\",6-LEN(J100))&J100&\",\"&X$11&\",\"&\"F\",\"\")","v":""},{"$f":"IF(AND(ISNUMBER($B100),$B100>0,K100<>\"\"),INDEX(swimmers_data,$B100,5)&\",\"&INDEX(swimmers_data,$B100,1)&\",\"&INDEX(swimmers_data,$B100,2)&\",\"&INDEX(swimmers_data,$B100,4)&\",\"&TEXT(INDEX(swimmers_data,$B100,3),\"ddmmYy\")&\",\"&LEFT(\"000000\",6-LEN(K100))&K100&\",\"&Y$11&\",\"&\"F\",\"\")","v":""},{"$f":"IF(AND(ISNUMBER($B100),$B100>0,L100<>\"\"),INDEX(swimmers_data,$B100,5)&\",\"&INDEX(swimmers_data,$B100,1)&\",\"&INDEX(swimmers_data,$B100,2)&\",\"&INDEX(swimmers_data,$B100,4)&\",\"&TEXT(INDEX(swimmers_data,$B100,3),\"ddmmYy\")&\",\"&LEFT(\"000000\",6-LEN(L100))&L100&\",\"&Z$11&\",\"&\"F\",\"\")","v":""},{"$f":"IF(AND(ISNUMBER($B100),$B100>0,M100<>\"\"),INDEX(swimmers_data,$B100,5)&\",\"&INDEX(swimmers_data,$B100,1)&\",\"&INDEX(swimmers_data,$B100,2)&\",\"&INDEX(swimmers_data,$B100,4)&\",\"&TEXT(INDEX(swimmers_data,$B100,3),\"ddmmYy\")&\",\"&LEFT(\"000000\",6-LEN(M100))&M100&\",\"&AA$11&\",\"&\"F\",\"\")","v":""},{"$f":"IF(AND(ISNUMBER($B100),$B100>0,N100<>\"\"),INDEX(swimmers_data,$B100,5)&\",\"&INDEX(swimmers_data,$B100,1)&\",\"&INDEX(swimmers_data,$B100,2)&\",\"&INDEX(swimmers_data,$B100,4)&\",\"&TEXT(INDEX(swimmers_data,$B100,3),\"ddmmYy\")&\",\"&LEFT(\"000000\",6-LEN(N100))&N100&\",\"&AB$11&\",\"&\"F\",\"\")","v":""},null,null,"","","",{"$f":"IF(AND(ISNUMBER($B100),$B100>0,E100<>\"\"),formatMMSSHHtime(E100),\"\")","v":""},{"$f":"IF(AND(ISNUMBER($B100),$B100>0,F100<>\"\"),formatMMSSHHtime(F100),\"\")","v":""},{"$f":"IF(AND(ISNUMBER($B100),$B100>0,G100<>\"\"),formatMMSSHHtime(G100),\"\")","v":""},{"$f":"IF(AND(ISNUMBER($B100),$B100>0,H100<>\"\"),formatMMSSHHtime(H100),\"\")","v":""},{"$f":"IF(AND(ISNUMBER($B100),$B100>0,I100<>\"\"),formatMMSSHHtime(I100),\"\")","v":""},{"$f":"IF(AND(ISNUMBER($B100),$B100>0,J100<>\"\"),formatMMSSHHtime(J100),\"\")","v":""},{"$f":"IF(AND(ISNUMBER($B100),$B100>0,K100<>\"\"),formatMMSSHHtime(K100),\"\")","v":""},{"$f":"IF(AND(ISNUMBER($B100),$B100>0,L100<>\"\"),formatMMSSHHtime(L100),\"\")","v":""},{"$f":"IF(AND(ISNUMBER($B100),$B100>0,M100<>\"\"),formatMMSSHHtime(M100),\"\")","v":""},{"$f":"IF(AND(ISNUMBER($B100),$B100>0,N100<>\"\"),formatMMSSHHtime(N100),\"\")","v":""}]
["","",{"$f":"IF(AND(ISNUMBER(B101),B101>0),DATEDIF(INDEX(swimmers_data,B101,3),$C$8,\"Y\"),\"\")","v":""},{"$f":"IF(AND(ISNUMBER(B101),B101>0),INDEX(swimmers_data,B101,5),\"\")","v":""},null,null,null,null,null,null,null,null,null,null,null,null,null,null,{"$f":"IF(AND(ISNUMBER($B101),$B101>0,E101<>\"\"),INDEX(swimmers_data,$B101,5)&\",\"&INDEX(swimmers_data,$B101,1)&\",\"&INDEX(swimmers_data,$B101,2)&\",\"&INDEX(swimmers_data,$B101,4)&\",\"&TEXT(INDEX(swimmers_data,$B101,3),\"ddmmYy\")&\",\"&LEFT(\"000000\",6-LEN(E101))&E101&\",\"&S$11&\",\"&\"F\",\"\")","v":""},{"$f":"IF(AND(ISNUMBER($B101),$B101>0,F101<>\"\"),INDEX(swimmers_data,$B101,5)&\",\"&INDEX(swimmers_data,$B101,1)&\",\"&INDEX(swimmers_data,$B101,2)&\",\"&INDEX(swimmers_data,$B101,4)&\",\"&TEXT(INDEX(swimmers_data,$B101,3),\"ddmmYy\")&\",\"&LEFT(\"000000\",6-LEN(F101))&F101&\",\"&T$11&\",\"&\"F\",\"\")","v":""},{"$f":"IF(AND(ISNUMBER($B101),$B101>0,G101<>\"\"),INDEX(swimmers_data,$B101,5)&\",\"&INDEX(swimmers_data,$B101,1)&\",\"&INDEX(swimmers_data,$B101,2)&\",\"&INDEX(swimmers_data,$B101,4)&\",\"&TEXT(INDEX(swimmers_data,$B101,3),\"ddmmYy\")&\",\"&LEFT(\"000000\",6-LEN(G101))&G101&\",\"&U$11&\",\"&\"F\",\"\")","v":""},{"$f":"IF(AND(ISNUMBER($B101),$B101>0,H101<>\"\"),INDEX(swimmers_data,$B101,5)&\",\"&INDEX(swimmers_data,$B101,1)&\",\"&INDEX(swimmers_data,$B101,2)&\",\"&INDEX(swimmers_data,$B101,4)&\",\"&TEXT(INDEX(swimmers_data,$B101,3),\"ddmmYy\")&\",\"&LEFT(\"000000\",6-LEN(H101))&H101&\",\"&V$11&\",\"&\"F\",\"\")","v":""},{"$f":"IF(AND(ISNUMBER($B101),$B101>0,I101<>\"\"),INDEX(swimmers_data,$B101,5)&\",\"&INDEX(swimmers_data,$B101,1)&\",\"&INDEX(swimmers_data,$B101,2)&\",\"&INDEX(swimmers_data,$B101,4)&\",\"&TEXT(INDEX(swimmers_data,$B101,3),\"ddmmYy\")&\",\"&LEFT(\"000000\",6-LEN(I101))&I101&\",\"&W$11&\",\"&\"F\",\"\")","v":""},{"$f":"IF(AND(ISNUMBER($B101),$B101>0,J101<>\"\"),INDEX(swimmers_data,$B101,5)&\",\"&INDEX(swimmers_data,$B101,1)&\",\"&INDEX(swimmers_data,$B101,2)&\",\"&INDEX(swimmers_data,$B101,4)&\",\"&TEXT(INDEX(swimmers_data,$B101,3),\"ddmmYy\")&\",\"&LEFT(\"000000\",6-LEN(J101))&J101&\",\"&X$11&\",\"&\"F\",\"\")","v":""},{"$f":"IF(AND(ISNUMBER($B101),$B101>0,K101<>\"\"),INDEX(swimmers_data,$B101,5)&\",\"&INDEX(swimmers_data,$B101,1)&\",\"&INDEX(swimmers_data,$B101,2)&\",\"&INDEX(swimmers_data,$B101,4)&\",\"&TEXT(INDEX(swimmers_data,$B101,3),\"ddmmYy\")&\",\"&LEFT(\"000000\",6-LEN(K101))&K101&\",\"&Y$11&\",\"&\"F\",\"\")","v":""},{"$f":"IF(AND(ISNUMBER($B101),$B101>0,L101<>\"\"),INDEX(swimmers_data,$B101,5)&\",\"&INDEX(swimmers_data,$B101,1)&\",\"&INDEX(swimmers_data,$B101,2)&\",\"&INDEX(swimmers_data,$B101,4)&\",\"&TEXT(INDEX(swimmers_data,$B101,3),\"ddmmYy\")&\",\"&LEFT(\"000000\",6-LEN(L101))&L101&\",\"&Z$11&\",\"&\"F\",\"\")","v":""},{"$f":"IF(AND(ISNUMBER($B101),$B101>0,M101<>\"\"),INDEX(swimmers_data,$B101,5)&\",\"&INDEX(swimmers_data,$B101,1)&\",\"&INDEX(swimmers_data,$B101,2)&\",\"&INDEX(swimmers_data,$B101,4)&\",\"&TEXT(INDEX(swimmers_data,$B101,3),\"ddmmYy\")&\",\"&LEFT(\"000000\",6-LEN(M101))&M101&\",\"&AA$11&\",\"&\"F\",\"\")","v":""},{"$f":"IF(AND(ISNUMBER($B101),$B101>0,N101<>\"\"),INDEX(swimmers_data,$B101,5)&\",\"&INDEX(swimmers_data,$B101,1)&\",\"&INDEX(swimmers_data,$B101,2)&\",\"&INDEX(swimmers_data,$B101,4)&\",\"&TEXT(INDEX(swimmers_data,$B101,3),\"ddmmYy\")&\",\"&LEFT(\"000000\",6-LEN(N101))&N101&\",\"&AB$11&\",\"&\"F\",\"\")","v":""},null,null,"","","",{"$f":"IF(AND(ISNUMBER($B101),$B101>0,E101<>\"\"),formatMMSSHHtime(E101),\"\")","v":""},{"$f":"IF(AND(ISNUMBER($B101),$B101>0,F101<>\"\"),formatMMSSHHtime(F101),\"\")","v":""},{"$f":"IF(AND(ISNUMBER($B101),$B101>0,G101<>\"\"),formatMMSSHHtime(G101),\"\")","v":""},{"$f":"IF(AND(ISNUMBER($B101),$B101>0,H101<>\"\"),formatMMSSHHtime(H101),\"\")","v":""},{"$f":"IF(AND(ISNUMBER($B101),$B101>0,I101<>\"\"),formatMMSSHHtime(I101),\"\")","v":""},{"$f":"IF(AND(ISNUMBER($B101),$B101>0,J101<>\"\"),formatMMSSHHtime(J101),\"\")","v":""},{"$f":"IF(AND(ISNUMBER($B101),$B101>0,K101<>\"\"),formatMMSSHHtime(K101),\"\")","v":""},{"$f":"IF(AND(ISNUMBER($B101),$B101>0,L101<>\"\"),formatMMSSHHtime(L101),\"\")","v":""},{"$f":"IF(AND(ISNUMBER($B101),$B101>0,M101<>\"\"),formatMMSSHHtime(M101),\"\")","v":""},{"$f":"IF(AND(ISNUMBER($B101),$B101>0,N101<>\"\"),formatMMSSHHtime(N101),\"\")","v":""}]
["","",{"$f":"IF(AND(ISNUMBER(B102),B102>0),DATEDIF(INDEX(swimmers_data,B102,3),$C$8,\"Y\"),\"\")","v":""},{"$f":"IF(AND(ISNUMBER(B102),B102>0),INDEX(swimmers_data,B102,5),\"\")","v":""},null,null,null,null,null,null,null,null,null,null,null,null,null,null,{"$f":"IF(AND(ISNUMBER($B102),$B102>0,E102<>\"\"),INDEX(swimmers_data,$B102,5)&\",\"&INDEX(swimmers_data,$B102,1)&\",\"&INDEX(swimmers_data,$B102,2)&\",\"&INDEX(swimmers_data,$B102,4)&\",\"&TEXT(INDEX(swimmers_data,$B102,3),\"ddmmYy\")&\",\"&LEFT(\"000000\",6-LEN(E102))&E102&\",\"&S$11&\",\"&\"F\",\"\")","v":""},{"$f":"IF(AND(ISNUMBER($B102),$B102>0,F102<>\"\"),INDEX(swimmers_data,$B102,5)&\",\"&INDEX(swimmers_data,$B102,1)&\",\"&INDEX(swimmers_data,$B102,2)&\",\"&INDEX(swimmers_data,$B102,4)&\",\"&TEXT(INDEX(swimmers_data,$B102,3),\"ddmmYy\")&\",\"&LEFT(\"000000\",6-LEN(F102))&F102&\",\"&T$11&\",\"&\"F\",\"\")","v":""},{"$f":"IF(AND(ISNUMBER($B102),$B102>0,G102<>\"\"),INDEX(swimmers_data,$B102,5)&\",\"&INDEX(swimmers_data,$B102,1)&\",\"&INDEX(swimmers_data,$B102,2)&\",\"&INDEX(swimmers_data,$B102,4)&\",\"&TEXT(INDEX(swimmers_data,$B102,3),\"ddmmYy\")&\",\"&LEFT(\"000000\",6-LEN(G102))&G102&\",\"&U$11&\",\"&\"F\",\"\")","v":""},{"$f":"IF(AND(ISNUMBER($B102),$B102>0,H102<>\"\"),INDEX(swimmers_data,$B102,5)&\",\"&INDEX(swimmers_data,$B102,1)&\",\"&INDEX(swimmers_data,$B102,2)&\",\"&INDEX(swimmers_data,$B102,4)&\",\"&TEXT(INDEX(swimmers_data,$B102,3),\"ddmmYy\")&\",\"&LEFT(\"000000\",6-LEN(H102))&H102&\",\"&V$11&\",\"&\"F\",\"\")","v":""},{"$f":"IF(AND(ISNUMBER($B102),$B102>0,I102<>\"\"),INDEX(swimmers_data,$B102,5)&\",\"&INDEX(swimmers_data,$B102,1)&\",\"&INDEX(swimmers_data,$B102,2)&\",\"&INDEX(swimmers_data,$B102,4)&\",\"&TEXT(INDEX(swimmers_data,$B102,3),\"ddmmYy\")&\",\"&LEFT(\"000000\",6-LEN(I102))&I102&\",\"&W$11&\",\"&\"F\",\"\")","v":""},{"$f":"IF(AND(ISNUMBER($B102),$B102>0,J102<>\"\"),INDEX(swimmers_data,$B102,5)&\",\"&INDEX(swimmers_data,$B102,1)&\",\"&INDEX(swimmers_data,$B102,2)&\",\"&INDEX(swimmers_data,$B102,4)&\",\"&TEXT(INDEX(swimmers_data,$B102,3),\"ddmmYy\")&\",\"&LEFT(\"000000\",6-LEN(J102))&J102&\",\"&X$11&\",\"&\"F\",\"\")","v":""},{"$f":"IF(AND(ISNUMBER($B102),$B102>0,K102<>\"\"),INDEX(swimmers_data,$B102,5)&\",\"&INDEX(swimmers_data,$B102,1)&\",\"&INDEX(swimmers_data,$B102,2)&\",\"&INDEX(swimmers_data,$B102,4)&\",\"&TEXT(INDEX(swimmers_data,$B102,3),\"ddmmYy\")&\",\"&LEFT(\"000000\",6-LEN(K102))&K102&\",\"&Y$11&\",\"&\"F\",\"\")","v":""},{"$f":"IF(AND(ISNUMBER($B102),$B102>0,L102<>\"\"),INDEX(swimmers_data,$B102,5)&\",\"&INDEX(swimmers_data,$B102,1)&\",\"&INDEX(swimmers_data,$B102,2)&\",\"&INDEX(swimmers_data,$B102,4)&\",\"&TEXT(INDEX(swimmers_data,$B102,3),\"ddmmYy\")&\",\"&LEFT(\"000000\",6-LEN(L102))&L102&\",\"&Z$11&\",\"&\"F\",\"\")","v":""},{"$f":"IF(AND(ISNUMBER($B102),$B102>0,M102<>\"\"),INDEX(swimmers_data,$B102,5)&\",\"&INDEX(swimmers_data,$B102,1)&\",\"&INDEX(swimmers_data,$B102,2)&\",\"&INDEX(swimmers_data,$B102,4)&\",\"&TEXT(INDEX(swimmers_data,$B102,3),\"ddmmYy\")&\",\"&LEFT(\"000000\",6-LEN(M102))&M102&\",\"&AA$11&\",\"&\"F\",\"\")","v":""},{"$f":"IF(AND(ISNUMBER($B102),$B102>0,N102<>\"\"),INDEX(swimmers_data,$B102,5)&\",\"&INDEX(swimmers_data,$B102,1)&\",\"&INDEX(swimmers_data,$B102,2)&\",\"&INDEX(swimmers_data,$B102,4)&\",\"&TEXT(INDEX(swimmers_data,$B102,3),\"ddmmYy\")&\",\"&LEFT(\"000000\",6-LEN(N102))&N102&\",\"&AB$11&\",\"&\"F\",\"\")","v":""},null,null,"","","",{"$f":"IF(AND(ISNUMBER($B102),$B102>0,E102<>\"\"),formatMMSSHHtime(E102),\"\")","v":""},{"$f":"IF(AND(ISNUMBER($B102),$B102>0,F102<>\"\"),formatMMSSHHtime(F102),\"\")","v":""},{"$f":"IF(AND(ISNUMBER($B102),$B102>0,G102<>\"\"),formatMMSSHHtime(G102),\"\")","v":""},{"$f":"IF(AND(ISNUMBER($B102),$B102>0,H102<>\"\"),formatMMSSHHtime(H102),\"\")","v":""},{"$f":"IF(AND(ISNUMBER($B102),$B102>0,I102<>\"\"),formatMMSSHHtime(I102),\"\")","v":""},{"$f":"IF(AND(ISNUMBER($B102),$B102>0,J102<>\"\"),formatMMSSHHtime(J102),\"\")","v":""},{"$f":"IF(AND(ISNUMBER($B102),$B102>0,K102<>\"\"),formatMMSSHHtime(K102),\"\")","v":""},{"$f":"IF(AND(ISNUMBER($B102),$B102>0,L102<>\"\"),formatMMSSHHtime(L102),\"\")","v":""},{"$f":"IF(AND(ISNUMBER($B102),$B102>0,M102<>\"\"),formatMMSSHHtime(M102),\"\")","v":""},{"$f":"IF(AND(ISNUMBER($B102),$B102>0,N102<>\"\"),formatMMSSHHtime(N102),\"\")","v":""}]
["","",{"$f":"IF(AND(ISNUMBER(B103),B103>0),DATEDIF(INDEX(swimmers_data,B103,3),$C$8,\"Y\"),\"\")","v":""},{"$f":"IF(AND(ISNUMBER(B103),B103>0),INDEX(swimmers_data,B103,5),\"\")","v":""},null,null,null,null,null,null,null,null,null,null,null,null,null,null,{"$f":"IF(AND(ISNUMBER($B103),$B103>0,E103<>\"\"),INDEX(swimmers_data,$B103,5)&\",\"&INDEX(swimmers_data,$B103,1)&\",\"&INDEX(swimmers_data,$B103,2)&\",\"&INDEX(swimmers_data,$B103,4)&\",\"&TEXT(INDEX(swimmers_data,$B103,3),\"ddmmYy\")&\",\"&LEFT(\"000000\",6-LEN(E103))&E103&\",\"&S$11&\",\"&\"F\",\"\")","v":""},{"$f":"IF(AND(ISNUMBER($B103),$B103>0,F103<>\"\"),INDEX(swimmers_data,$B103,5)&\",\"&INDEX(swimmers_data,$B103,1)&\",\"&INDEX(swimmers_data,$B103,2)&\",\"&INDEX(swimmers_data,$B103,4)&\",\"&TEXT(INDEX(swimmers_data,$B103,3),\"ddmmYy\")&\",\"&LEFT(\"000000\",6-LEN(F103))&F103&\",\"&T$11&\",\"&\"F\",\"\")","v":""},{"$f":"IF(AND(ISNUMBER($B103),$B103>0,G103<>\"\"),INDEX(swimmers_data,$B103,5)&\",\"&INDEX(swimmers_data,$B103,1)&\",\"&INDEX(swimmers_data,$B103,2)&\",\"&INDEX(swimmers_data,$B103,4)&\",\"&TEXT(INDEX(swimmers_data,$B103,3),\"ddmmYy\")&\",\"&LEFT(\"000000\",6-LEN(G103))&G103&\",\"&U$11&\",\"&\"F\",\"\")","v":""},{"$f":"IF(AND(ISNUMBER($B103),$B103>0,H103<>\"\"),INDEX(swimmers_data,$B103,5)&\",\"&INDEX(swimmers_data,$B103,1)&\",\"&INDEX(swimmers_data,$B103,2)&\",\"&INDEX(swimmers_data,$B103,4)&\",\"&TEXT(INDEX(swimmers_data,$B103,3),\"ddmmYy\")&\",\"&LEFT(\"000000\",6-LEN(H103))&H103&\",\"&V$11&\",\"&\"F\",\"\")","v":""},{"$f":"IF(AND(ISNUMBER($B103),$B103>0,I103<>\"\"),INDEX(swimmers_data,$B103,5)&\",\"&INDEX(swimmers_data,$B103,1)&\",\"&INDEX(swimmers_data,$B103,2)&\",\"&INDEX(swimmers_data,$B103,4)&\",\"&TEXT(INDEX(swimmers_data,$B103,3),\"ddmmYy\")&\",\"&LEFT(\"000000\",6-LEN(I103))&I103&\",\"&W$11&\",\"&\"F\",\"\")","v":""},{"$f":"IF(AND(ISNUMBER($B103),$B103>0,J103<>\"\"),INDEX(swimmers_data,$B103,5)&\",\"&INDEX(swimmers_data,$B103,1)&\",\"&INDEX(swimmers_data,$B103,2)&\",\"&INDEX(swimmers_data,$B103,4)&\",\"&TEXT(INDEX(swimmers_data,$B103,3),\"ddmmYy\")&\",\"&LEFT(\"000000\",6-LEN(J103))&J103&\",\"&X$11&\",\"&\"F\",\"\")","v":""},{"$f":"IF(AND(ISNUMBER($B103),$B103>0,K103<>\"\"),INDEX(swimmers_data,$B103,5)&\",\"&INDEX(swimmers_data,$B103,1)&\",\"&INDEX(swimmers_data,$B103,2)&\",\"&INDEX(swimmers_data,$B103,4)&\",\"&TEXT(INDEX(swimmers_data,$B103,3),\"ddmmYy\")&\",\"&LEFT(\"000000\",6-LEN(K103))&K103&\",\"&Y$11&\",\"&\"F\",\"\")","v":""},{"$f":"IF(AND(ISNUMBER($B103),$B103>0,L103<>\"\"),INDEX(swimmers_data,$B103,5)&\",\"&INDEX(swimmers_data,$B103,1)&\",\"&INDEX(swimmers_data,$B103,2)&\",\"&INDEX(swimmers_data,$B103,4)&\",\"&TEXT(INDEX(swimmers_data,$B103,3),\"ddmmYy\")&\",\"&LEFT(\"000000\",6-LEN(L103))&L103&\",\"&Z$11&\",\"&\"F\",\"\")","v":""},{"$f":"IF(AND(ISNUMBER($B103),$B103>0,M103<>\"\"),INDEX(swimmers_data,$B103,5)&\",\"&INDEX(swimmers_data,$B103,1)&\",\"&INDEX(swimmers_data,$B103,2)&\",\"&INDEX(swimmers_data,$B103,4)&\",\"&TEXT(INDEX(swimmers_data,$B103,3),\"ddmmYy\")&\",\"&LEFT(\"000000\",6-LEN(M103))&M103&\",\"&AA$11&\",\"&\"F\",\"\")","v":""},{"$f":"IF(AND(ISNUMBER($B103),$B103>0,N103<>\"\"),INDEX(swimmers_data,$B103,5)&\",\"&INDEX(swimmers_data,$B103,1)&\",\"&INDEX(swimmers_data,$B103,2)&\",\"&INDEX(swimmers_data,$B103,4)&\",\"&TEXT(INDEX(swimmers_data,$B103,3),\"ddmmYy\")&\",\"&LEFT(\"000000\",6-LEN(N103))&N103&\",\"&AB$11&\",\"&\"F\",\"\")","v":""},null,null,"","","",{"$f":"IF(AND(ISNUMBER($B103),$B103>0,E103<>\"\"),formatMMSSHHtime(E103),\"\")","v":""},{"$f":"IF(AND(ISNUMBER($B103),$B103>0,F103<>\"\"),formatMMSSHHtime(F103),\"\")","v":""},{"$f":"IF(AND(ISNUMBER($B103),$B103>0,G103<>\"\"),formatMMSSHHtime(G103),\"\")","v":""},{"$f":"IF(AND(ISNUMBER($B103),$B103>0,H103<>\"\"),formatMMSSHHtime(H103),\"\")","v":""},{"$f":"IF(AND(ISNUMBER($B103),$B103>0,I103<>\"\"),formatMMSSHHtime(I103),\"\")","v":""},{"$f":"IF(AND(ISNUMBER($B103),$B103>0,J103<>\"\"),formatMMSSHHtime(J103),\"\")","v":""},{"$f":"IF(AND(ISNUMBER($B103),$B103>0,K103<>\"\"),formatMMSSHHtime(K103),\"\")","v":""},{"$f":"IF(AND(ISNUMBER($B103),$B103>0,L103<>\"\"),formatMMSSHHtime(L103),\"\")","v":""},{"$f":"IF(AND(ISNUMBER($B103),$B103>0,M103<>\"\"),formatMMSSHHtime(M103),\"\")","v":""},{"$f":"IF(AND(ISNUMBER($B103),$B103>0,N103<>\"\"),formatMMSSHHtime(N103),\"\")","v":""}]
["","",{"$f":"IF(AND(ISNUMBER(B104),B104>0),DATEDIF(INDEX(swimmers_data,B104,3),$C$8,\"Y\"),\"\")","v":""},{"$f":"IF(AND(ISNUMBER(B104),B104>0),INDEX(swimmers_data,B104,5),\"\")","v":""},null,null,null,null,null,null,null,null,null,null,null,null,null,null,{"$f":"IF(AND(ISNUMBER($B104),$B104>0,E104<>\"\"),INDEX(swimmers_data,$B104,5)&\",\"&INDEX(swimmers_data,$B104,1)&\",\"&INDEX(swimmers_data,$B104,2)&\",\"&INDEX(swimmers_data,$B104,4)&\",\"&TEXT(INDEX(swimmers_data,$B104,3),\"ddmmYy\")&\",\"&LEFT(\"000000\",6-LEN(E104))&E104&\",\"&S$11&\",\"&\"F\",\"\")","v":""},{"$f":"IF(AND(ISNUMBER($B104),$B104>0,F104<>\"\"),INDEX(swimmers_data,$B104,5)&\",\"&INDEX(swimmers_data,$B104,1)&\",\"&INDEX(swimmers_data,$B104,2)&\",\"&INDEX(swimmers_data,$B104,4)&\",\"&TEXT(INDEX(swimmers_data,$B104,3),\"ddmmYy\")&\",\"&LEFT(\"000000\",6-LEN(F104))&F104&\",\"&T$11&\",\"&\"F\",\"\")","v":""},{"$f":"IF(AND(ISNUMBER($B104),$B104>0,G104<>\"\"),INDEX(swimmers_data,$B104,5)&\",\"&INDEX(swimmers_data,$B104,1)&\",\"&INDEX(swimmers_data,$B104,2)&\",\"&INDEX(swimmers_data,$B104,4)&\",\"&TEXT(INDEX(swimmers_data,$B104,3),\"ddmmYy\")&\",\"&LEFT(\"000000\",6-LEN(G104))&G104&\",\"&U$11&\",\"&\"F\",\"\")","v":""},{"$f":"IF(AND(ISNUMBER($B104),$B104>0,H104<>\"\"),INDEX(swimmers_data,$B104,5)&\",\"&INDEX(swimmers_data,$B104,1)&\",\"&INDEX(swimmers_data,$B104,2)&\",\"&INDEX(swimmers_data,$B104,4)&\",\"&TEXT(INDEX(swimmers_data,$B104,3),\"ddmmYy\")&\",\"&LEFT(\"000000\",6-LEN(H104))&H104&\",\"&V$11&\",\"&\"F\",\"\")","v":""},{"$f":"IF(AND(ISNUMBER($B104),$B104>0,I104<>\"\"),INDEX(swimmers_data,$B104,5)&\",\"&INDEX(swimmers_data,$B104,1)&\",\"&INDEX(swimmers_data,$B104,2)&\",\"&INDEX(swimmers_data,$B104,4)&\",\"&TEXT(INDEX(swimmers_data,$B104,3),\"ddmmYy\")&\",\"&LEFT(\"000000\",6-LEN(I104))&I104&\",\"&W$11&\",\"&\"F\",\"\")","v":""},{"$f":"IF(AND(ISNUMBER($B104),$B104>0,J104<>\"\"),INDEX(swimmers_data,$B104,5)&\",\"&INDEX(swimmers_data,$B104,1)&\",\"&INDEX(swimmers_data,$B104,2)&\",\"&INDEX(swimmers_data,$B104,4)&\",\"&TEXT(INDEX(swimmers_data,$B104,3),\"ddmmYy\")&\",\"&LEFT(\"000000\",6-LEN(J104))&J104&\",\"&X$11&\",\"&\"F\",\"\")","v":""},{"$f":"IF(AND(ISNUMBER($B104),$B104>0,K104<>\"\"),INDEX(swimmers_data,$B104,5)&\",\"&INDEX(swimmers_data,$B104,1)&\",\"&INDEX(swimmers_data,$B104,2)&\",\"&INDEX(swimmers_data,$B104,4)&\",\"&TEXT(INDEX(swimmers_data,$B104,3),\"ddmmYy\")&\",\"&LEFT(\"000000\",6-LEN(K104))&K104&\",\"&Y$11&\",\"&\"F\",\"\")","v":""},{"$f":"IF(AND(ISNUMBER($B104),$B104>0,L104<>\"\"),INDEX(swimmers_data,$B104,5)&\",\"&INDEX(swimmers_data,$B104,1)&\",\"&INDEX(swimmers_data,$B104,2)&\",\"&INDEX(swimmers_data,$B104,4)&\",\"&TEXT(INDEX(swimmers_data,$B104,3),\"ddmmYy\")&\",\"&LEFT(\"000000\",6-LEN(L104))&L104&\",\"&Z$11&\",\"&\"F\",\"\")","v":""},{"$f":"IF(AND(ISNUMBER($B104),$B104>0,M104<>\"\"),INDEX(swimmers_data,$B104,5)&\",\"&INDEX(swimmers_data,$B104,1)&\",\"&INDEX(swimmers_data,$B104,2)&\",\"&INDEX(swimmers_data,$B104,4)&\",\"&TEXT(INDEX(swimmers_data,$B104,3),\"ddmmYy\")&\",\"&LEFT(\"000000\",6-LEN(M104))&M104&\",\"&AA$11&\",\"&\"F\",\"\")","v":""},{"$f":"IF(AND(ISNUMBER($B104),$B104>0,N104<>\"\"),INDEX(swimmers_data,$B104,5)&\",\"&INDEX(swimmers_data,$B104,1)&\",\"&INDEX(swimmers_data,$B104,2)&\",\"&INDEX(swimmers_data,$B104,4)&\",\"&TEXT(INDEX(swimmers_data,$B104,3),\"ddmmYy\")&\",\"&LEFT(\"000000\",6-LEN(N104))&N104&\",\"&AB$11&\",\"&\"F\",\"\")","v":""},null,null,"","","",{"$f":"IF(AND(ISNUMBER($B104),$B104>0,E104<>\"\"),formatMMSSHHtime(E104),\"\")","v":""},{"$f":"IF(AND(ISNUMBER($B104),$B104>0,F104<>\"\"),formatMMSSHHtime(F104),\"\")","v":""},{"$f":"IF(AND(ISNUMBER($B104),$B104>0,G104<>\"\"),formatMMSSHHtime(G104),\"\")","v":""},{"$f":"IF(AND(ISNUMBER($B104),$B104>0,H104<>\"\"),formatMMSSHHtime(H104),\"\")","v":""},{"$f":"IF(AND(ISNUMBER($B104),$B104>0,I104<>\"\"),formatMMSSHHtime(I104),\"\")","v":""},{"$f":"IF(AND(ISNUMBER($B104),$B104>0,J104<>\"\"),formatMMSSHHtime(J104),\"\")","v":""},{"$f":"IF(AND(ISNUMBER($B104),$B104>0,K104<>\"\"),formatMMSSHHtime(K104),\"\")","v":""},{"$f":"IF(AND(ISNUMBER($B104),$B104>0,L104<>\"\"),formatMMSSHHtime(L104),\"\")","v":""},{"$f":"IF(AND(ISNUMBER($B104),$B104>0,M104<>\"\"),formatMMSSHHtime(M104),\"\")","v":""},{"$f":"IF(AND(ISNUMBER($B104),$B104>0,N104<>\"\"),formatMMSSHHtime(N104),\"\")","v":""}]
["","",{"$f":"IF(AND(ISNUMBER(B105),B105>0),DATEDIF(INDEX(swimmers_data,B105,3),$C$8,\"Y\"),\"\")","v":""},{"$f":"IF(AND(ISNUMBER(B105),B105>0),INDEX(swimmers_data,B105,5),\"\")","v":""},null,null,null,null,null,null,null,null,null,null,null,null,null,null,{"$f":"IF(AND(ISNUMBER($B105),$B105>0,E105<>\"\"),INDEX(swimmers_data,$B105,5)&\",\"&INDEX(swimmers_data,$B105,1)&\",\"&INDEX(swimmers_data,$B105,2)&\",\"&INDEX(swimmers_data,$B105,4)&\",\"&TEXT(INDEX(swimmers_data,$B105,3),\"ddmmYy\")&\",\"&LEFT(\"000000\",6-LEN(E105))&E105&\",\"&S$11&\",\"&\"F\",\"\")","v":""},{"$f":"IF(AND(ISNUMBER($B105),$B105>0,F105<>\"\"),INDEX(swimmers_data,$B105,5)&\",\"&INDEX(swimmers_data,$B105,1)&\",\"&INDEX(swimmers_data,$B105,2)&\",\"&INDEX(swimmers_data,$B105,4)&\",\"&TEXT(INDEX(swimmers_data,$B105,3),\"ddmmYy\")&\",\"&LEFT(\"000000\",6-LEN(F105))&F105&\",\"&T$11&\",\"&\"F\",\"\")","v":""},{"$f":"IF(AND(ISNUMBER($B105),$B105>0,G105<>\"\"),INDEX(swimmers_data,$B105,5)&\",\"&INDEX(swimmers_data,$B105,1)&\",\"&INDEX(swimmers_data,$B105,2)&\",\"&INDEX(swimmers_data,$B105,4)&\",\"&TEXT(INDEX(swimmers_data,$B105,3),\"ddmmYy\")&\",\"&LEFT(\"000000\",6-LEN(G105))&G105&\",\"&U$11&\",\"&\"F\",\"\")","v":""},{"$f":"IF(AND(ISNUMBER($B105),$B105>0,H105<>\"\"),INDEX(swimmers_data,$B105,5)&\",\"&INDEX(swimmers_data,$B105,1)&\",\"&INDEX(swimmers_data,$B105,2)&\",\"&INDEX(swimmers_data,$B105,4)&\",\"&TEXT(INDEX(swimmers_data,$B105,3),\"ddmmYy\")&\",\"&LEFT(\"000000\",6-LEN(H105))&H105&\",\"&V$11&\",\"&\"F\",\"\")","v":""},{"$f":"IF(AND(ISNUMBER($B105),$B105>0,I105<>\"\"),INDEX(swimmers_data,$B105,5)&\",\"&INDEX(swimmers_data,$B105,1)&\",\"&INDEX(swimmers_data,$B105,2)&\",\"&INDEX(swimmers_data,$B105,4)&\",\"&TEXT(INDEX(swimmers_data,$B105,3),\"ddmmYy\")&\",\"&LEFT(\"000000\",6-LEN(I105))&I105&\",\"&W$11&\",\"&\"F\",\"\")","v":""},{"$f":"IF(AND(ISNUMBER($B105),$B105>0,J105<>\"\"),INDEX(swimmers_data,$B105,5)&\",\"&INDEX(swimmers_data,$B105,1)&\",\"&INDEX(swimmers_data,$B105,2)&\",\"&INDEX(swimmers_data,$B105,4)&\",\"&TEXT(INDEX(swimmers_data,$B105,3),\"ddmmYy\")&\",\"&LEFT(\"000000\",6-LEN(J105))&J105&\",\"&X$11&\",\"&\"F\",\"\")","v":""},{"$f":"IF(AND(ISNUMBER($B105),$B105>0,K105<>\"\"),INDEX(swimmers_data,$B105,5)&\",\"&INDEX(swimmers_data,$B105,1)&\",\"&INDEX(swimmers_data,$B105,2)&\",\"&INDEX(swimmers_data,$B105,4)&\",\"&TEXT(INDEX(swimmers_data,$B105,3),\"ddmmYy\")&\",\"&LEFT(\"000000\",6-LEN(K105))&K105&\",\"&Y$11&\",\"&\"F\",\"\")","v":""},{"$f":"IF(AND(ISNUMBER($B105),$B105>0,L105<>\"\"),INDEX(swimmers_data,$B105,5)&\",\"&INDEX(swimmers_data,$B105,1)&\",\"&INDEX(swimmers_data,$B105,2)&\",\"&INDEX(swimmers_data,$B105,4)&\",\"&TEXT(INDEX(swimmers_data,$B105,3),\"ddmmYy\")&\",\"&LEFT(\"000000\",6-LEN(L105))&L105&\",\"&Z$11&\",\"&\"F\",\"\")","v":""},{"$f":"IF(AND(ISNUMBER($B105),$B105>0,M105<>\"\"),INDEX(swimmers_data,$B105,5)&\",\"&INDEX(swimmers_data,$B105,1)&\",\"&INDEX(swimmers_data,$B105,2)&\",\"&INDEX(swimmers_data,$B105,4)&\",\"&TEXT(INDEX(swimmers_data,$B105,3),\"ddmmYy\")&\",\"&LEFT(\"000000\",6-LEN(M105))&M105&\",\"&AA$11&\",\"&\"F\",\"\")","v":""},{"$f":"IF(AND(ISNUMBER($B105),$B105>0,N105<>\"\"),INDEX(swimmers_data,$B105,5)&\",\"&INDEX(swimmers_data,$B105,1)&\",\"&INDEX(swimmers_data,$B105,2)&\",\"&INDEX(swimmers_data,$B105,4)&\",\"&TEXT(INDEX(swimmers_data,$B105,3),\"ddmmYy\")&\",\"&LEFT(\"000000\",6-LEN(N105))&N105&\",\"&AB$11&\",\"&\"F\",\"\")","v":""},null,null,"","","",{"$f":"IF(AND(ISNUMBER($B105),$B105>0,E105<>\"\"),formatMMSSHHtime(E105),\"\")","v":""},{"$f":"IF(AND(ISNUMBER($B105),$B105>0,F105<>\"\"),formatMMSSHHtime(F105),\"\")","v":""},{"$f":"IF(AND(ISNUMBER($B105),$B105>0,G105<>\"\"),formatMMSSHHtime(G105),\"\")","v":""},{"$f":"IF(AND(ISNUMBER($B105),$B105>0,H105<>\"\"),formatMMSSHHtime(H105),\"\")","v":""},{"$f":"IF(AND(ISNUMBER($B105),$B105>0,I105<>\"\"),formatMMSSHHtime(I105),\"\")","v":""},{"$f":"IF(AND(ISNUMBER($B105),$B105>0,J105<>\"\"),formatMMSSHHtime(J105),\"\")","v":""},{"$f":"IF(AND(ISNUMBER($B105),$B105>0,K105<>\"\"),formatMMSSHHtime(K105),\"\")","v":""},{"$f":"IF(AND(ISNUMBER($B105),$B105>0,L105<>\"\"),formatMMSSHHtime(L105),\"\")","v":""},{"$f":"IF(AND(ISNUMBER($B105),$B105>0,M105<>\"\"),formatMMSSHHtime(M105),\"\")","v":""},{"$f":"IF(AND(ISNUMBER($B105),$B105>0,N105<>\"\"),formatMMSSHHtime(N105),\"\")","v":""}]
["","",{"$f":"IF(AND(ISNUMBER(B106),B106>0),DATEDIF(INDEX(swimmers_data,B106,3),$C$8,\"Y\"),\"\")","v":""},{"$f":"IF(AND(ISNUMBER(B106),B106>0),INDEX(swimmers_data,B106,5),\"\")","v":""},null,null,null,null,null,null,null,null,null,null,null,null,null,null,{"$f":"IF(AND(ISNUMBER($B106),$B106>0,E106<>\"\"),INDEX(swimmers_data,$B106,5)&\",\"&INDEX(swimmers_data,$B106,1)&\",\"&INDEX(swimmers_data,$B106,2)&\",\"&INDEX(swimmers_data,$B106,4)&\",\"&TEXT(INDEX(swimmers_data,$B106,3),\"ddmmYy\")&\",\"&LEFT(\"000000\",6-LEN(E106))&E106&\",\"&S$11&\",\"&\"F\",\"\")","v":""},{"$f":"IF(AND(ISNUMBER($B106),$B106>0,F106<>\"\"),INDEX(swimmers_data,$B106,5)&\",\"&INDEX(swimmers_data,$B106,1)&\",\"&INDEX(swimmers_data,$B106,2)&\",\"&INDEX(swimmers_data,$B106,4)&\",\"&TEXT(INDEX(swimmers_data,$B106,3),\"ddmmYy\")&\",\"&LEFT(\"000000\",6-LEN(F106))&F106&\",\"&T$11&\",\"&\"F\",\"\")","v":""},{"$f":"IF(AND(ISNUMBER($B106),$B106>0,G106<>\"\"),INDEX(swimmers_data,$B106,5)&\",\"&INDEX(swimmers_data,$B106,1)&\",\"&INDEX(swimmers_data,$B106,2)&\",\"&INDEX(swimmers_data,$B106,4)&\",\"&TEXT(INDEX(swimmers_data,$B106,3),\"ddmmYy\")&\",\"&LEFT(\"000000\",6-LEN(G106))&G106&\",\"&U$11&\",\"&\"F\",\"\")","v":""},{"$f":"IF(AND(ISNUMBER($B106),$B106>0,H106<>\"\"),INDEX(swimmers_data,$B106,5)&\",\"&INDEX(swimmers_data,$B106,1)&\",\"&INDEX(swimmers_data,$B106,2)&\",\"&INDEX(swimmers_data,$B106,4)&\",\"&TEXT(INDEX(swimmers_data,$B106,3),\"ddmmYy\")&\",\"&LEFT(\"000000\",6-LEN(H106))&H106&\",\"&V$11&\",\"&\"F\",\"\")","v":""},{"$f":"IF(AND(ISNUMBER($B106),$B106>0,I106<>\"\"),INDEX(swimmers_data,$B106,5)&\",\"&INDEX(swimmers_data,$B106,1)&\",\"&INDEX(swimmers_data,$B106,2)&\",\"&INDEX(swimmers_data,$B106,4)&\",\"&TEXT(INDEX(swimmers_data,$B106,3),\"ddmmYy\")&\",\"&LEFT(\"000000\",6-LEN(I106))&I106&\",\"&W$11&\",\"&\"F\",\"\")","v":""},{"$f":"IF(AND(ISNUMBER($B106),$B106>0,J106<>\"\"),INDEX(swimmers_data,$B106,5)&\",\"&INDEX(swimmers_data,$B106,1)&\",\"&INDEX(swimmers_data,$B106,2)&\",\"&INDEX(swimmers_data,$B106,4)&\",\"&TEXT(INDEX(swimmers_data,$B106,3),\"ddmmYy\")&\",\"&LEFT(\"000000\",6-LEN(J106))&J106&\",\"&X$11&\",\"&\"F\",\"\")","v":""},{"$f":"IF(AND(ISNUMBER($B106),$B106>0,K106<>\"\"),INDEX(swimmers_data,$B106,5)&\",\"&INDEX(swimmers_data,$B106,1)&\",\"&INDEX(swimmers_data,$B106,2)&\",\"&INDEX(swimmers_data,$B106,4)&\",\"&TEXT(INDEX(swimmers_data,$B106,3),\"ddmmYy\")&\",\"&LEFT(\"000000\",6-LEN(K106))&K106&\",\"&Y$11&\",\"&\"F\",\"\")","v":""},{"$f":"IF(AND(ISNUMBER($B106),$B106>0,L106<>\"\"),INDEX(swimmers_data,$B106,5)&\",\"&INDEX(swimmers_data,$B106,1)&\",\"&INDEX(swimmers_data,$B106,2)&\",\"&INDEX(swimmers_data,$B106,4)&\",\"&TEXT(INDEX(swimmers_data,$B106,3),\"ddmmYy\")&\",\"&LEFT(\"000000\",6-LEN(L106))&L106&\",\"&Z$11&\",\"&\"F\",\"\")","v":""},{"$f":"IF(AND(ISNUMBER($B106),$B106>0,M106<>\"\"),INDEX(swimmers_data,$B106,5)&\",\"&INDEX(swimmers_data,$B106,1)&\",\"&INDEX(swimmers_data,$B106,2)&\",\"&INDEX(swimmers_data,$B106,4)&\",\"&TEXT(INDEX(swimmers_data,$B106,3),\"ddmmYy\")&\",\"&LEFT(\"000000\",6-LEN(M106))&M106&\",\"&AA$11&\",\"&\"F\",\"\")","v":""},{"$f":"IF(AND(ISNUMBER($B106),$B106>0,N106<>\"\"),INDEX(swimmers_data,$B106,5)&\",\"&INDEX(swimmers_data,$B106,1)&\",\"&INDEX(swimmers_data,$B106,2)&\",\"&INDEX(swimmers_data,$B106,4)&\",\"&TEXT(INDEX(swimmers_data,$B106,3),\"ddmmYy\")&\",\"&LEFT(\"000000\",6-LEN(N106))&N106&\",\"&AB$11&\",\"&\"F\",\"\")","v":""},null,null,"","","",{"$f":"IF(AND(ISNUMBER($B106),$B106>0,E106<>\"\"),formatMMSSHHtime(E106),\"\")","v":""},{"$f":"IF(AND(ISNUMBER($B106),$B106>0,F106<>\"\"),formatMMSSHHtime(F106),\"\")","v":""},{"$f":"IF(AND(ISNUMBER($B106),$B106>0,G106<>\"\"),formatMMSSHHtime(G106),\"\")","v":""},{"$f":"IF(AND(ISNUMBER($B106),$B106>0,H106<>\"\"),formatMMSSHHtime(H106),\"\")","v":""},{"$f":"IF(AND(ISNUMBER($B106),$B106>0,I106<>\"\"),formatMMSSHHtime(I106),\"\")","v":""},{"$f":"IF(AND(ISNUMBER($B106),$B106>0,J106<>\"\"),formatMMSSHHtime(J106),\"\")","v":""},{"$f":"IF(AND(ISNUMBER($B106),$B106>0,K106<>\"\"),formatMMSSHHtime(K106),\"\")","v":""},{"$f":"IF(AND(ISNUMBER($B106),$B106>0,L106<>\"\"),formatMMSSHHtime(L106),\"\")","v":""},{"$f":"IF(AND(ISNUMBER($B106),$B106>0,M106<>\"\"),formatMMSSHHtime(M106),\"\")","v":""},{"$f":"IF(AND(ISNUMBER($B106),$B106>0,N106<>\"\"),formatMMSSHHtime(N106),\"\")","v":""}]
["","",{"$f":"IF(AND(ISNUMBER(B107),B107>0),DATEDIF(INDEX(swimmers_data,B107,3),$C$8,\"Y\"),\"\")","v":""},{"$f":"IF(AND(ISNUMBER(B107),B107>0),INDEX(swimmers_data,B107,5),\"\")","v":""},null,null,null,null,null,null,null,null,null,null,null,null,null,null,{"$f":"IF(AND(ISNUMBER($B107),$B107>0,E107<>\"\"),INDEX(swimmers_data,$B107,5)&\",\"&INDEX(swimmers_data,$B107,1)&\",\"&INDEX(swimmers_data,$B107,2)&\",\"&INDEX(swimmers_data,$B107,4)&\",\"&TEXT(INDEX(swimmers_data,$B107,3),\"ddmmYy\")&\",\"&LEFT(\"000000\",6-LEN(E107))&E107&\",\"&S$11&\",\"&\"F\",\"\")","v":""},{"$f":"IF(AND(ISNUMBER($B107),$B107>0,F107<>\"\"),INDEX(swimmers_data,$B107,5)&\",\"&INDEX(swimmers_data,$B107,1)&\",\"&INDEX(swimmers_data,$B107,2)&\",\"&INDEX(swimmers_data,$B107,4)&\",\"&TEXT(INDEX(swimmers_data,$B107,3),\"ddmmYy\")&\",\"&LEFT(\"000000\",6-LEN(F107))&F107&\",\"&T$11&\",\"&\"F\",\"\")","v":""},{"$f":"IF(AND(ISNUMBER($B107),$B107>0,G107<>\"\"),INDEX(swimmers_data,$B107,5)&\",\"&INDEX(swimmers_data,$B107,1)&\",\"&INDEX(swimmers_data,$B107,2)&\",\"&INDEX(swimmers_data,$B107,4)&\",\"&TEXT(INDEX(swimmers_data,$B107,3),\"ddmmYy\")&\",\"&LEFT(\"000000\",6-LEN(G107))&G107&\",\"&U$11&\",\"&\"F\",\"\")","v":""},{"$f":"IF(AND(ISNUMBER($B107),$B107>0,H107<>\"\"),INDEX(swimmers_data,$B107,5)&\",\"&INDEX(swimmers_data,$B107,1)&\",\"&INDEX(swimmers_data,$B107,2)&\",\"&INDEX(swimmers_data,$B107,4)&\",\"&TEXT(INDEX(swimmers_data,$B107,3),\"ddmmYy\")&\",\"&LEFT(\"000000\",6-LEN(H107))&H107&\",\"&V$11&\",\"&\"F\",\"\")","v":""},{"$f":"IF(AND(ISNUMBER($B107),$B107>0,I107<>\"\"),INDEX(swimmers_data,$B107,5)&\",\"&INDEX(swimmers_data,$B107,1)&\",\"&INDEX(swimmers_data,$B107,2)&\",\"&INDEX(swimmers_data,$B107,4)&\",\"&TEXT(INDEX(swimmers_data,$B107,3),\"ddmmYy\")&\",\"&LEFT(\"000000\",6-LEN(I107))&I107&\",\"&W$11&\",\"&\"F\",\"\")","v":""},{"$f":"IF(AND(ISNUMBER($B107),$B107>0,J107<>\"\"),INDEX(swimmers_data,$B107,5)&\",\"&INDEX(swimmers_data,$B107,1)&\",\"&INDEX(swimmers_data,$B107,2)&\",\"&INDEX(swimmers_data,$B107,4)&\",\"&TEXT(INDEX(swimmers_data,$B107,3),\"ddmmYy\")&\",\"&LEFT(\"000000\",6-LEN(J107))&J107&\",\"&X$11&\",\"&\"F\",\"\")","v":""},{"$f":"IF(AND(ISNUMBER($B107),$B107>0,K107<>\"\"),INDEX(swimmers_data,$B107,5)&\",\"&INDEX(swimmers_data,$B107,1)&\",\"&INDEX(swimmers_data,$B107,2)&\",\"&INDEX(swimmers_data,$B107,4)&\",\"&TEXT(INDEX(swimmers_data,$B107,3),\"ddmmYy\")&\",\"&LEFT(\"000000\",6-LEN(K107))&K107&\",\"&Y$11&\",\"&\"F\",\"\")","v":""},{"$f":"IF(AND(ISNUMBER($B107),$B107>0,L107<>\"\"),INDEX(swimmers_data,$B107,5)&\",\"&INDEX(swimmers_data,$B107,1)&\",\"&INDEX(swimmers_data,$B107,2)&\",\"&INDEX(swimmers_data,$B107,4)&\",\"&TEXT(INDEX(swimmers_data,$B107,3),\"ddmmYy\")&\",\"&LEFT(\"000000\",6-LEN(L107))&L107&\",\"&Z$11&\",\"&\"F\",\"\")","v":""},{"$f":"IF(AND(ISNUMBER($B107),$B107>0,M107<>\"\"),INDEX(swimmers_data,$B107,5)&\",\"&INDEX(swimmers_data,$B107,1)&\",\"&INDEX(swimmers_data,$B107,2)&\",\"&INDEX(swimmers_data,$B107,4)&\",\"&TEXT(INDEX(swimmers_data,$B107,3),\"ddmmYy\")&\",\"&LEFT(\"000000\",6-LEN(M107))&M107&\",\"&AA$11&\",\"&\"F\",\"\")","v":""},{"$f":"IF(AND(ISNUMBER($B107),$B107>0,N107<>\"\"),INDEX(swimmers_data,$B107,5)&\",\"&INDEX(swimmers_data,$B107,1)&\",\"&INDEX(swimmers_data,$B107,2)&\",\"&INDEX(swimmers_data,$B107,4)&\",\"&TEXT(INDEX(swimmers_data,$B107,3),\"ddmmYy\")&\",\"&LEFT(\"000000\",6-LEN(N107))&N107&\",\"&AB$11&\",\"&\"F\",\"\")","v":""},null,null,"","","",{"$f":"IF(AND(ISNUMBER($B107),$B107>0,E107<>\"\"),formatMMSSHHtime(E107),\"\")","v":""},{"$f":"IF(AND(ISNUMBER($B107),$B107>0,F107<>\"\"),formatMMSSHHtime(F107),\"\")","v":""},{"$f":"IF(AND(ISNUMBER($B107),$B107>0,G107<>\"\"),formatMMSSHHtime(G107),\"\")","v":""},{"$f":"IF(AND(ISNUMBER($B107),$B107>0,H107<>\"\"),formatMMSSHHtime(H107),\"\")","v":""},{"$f":"IF(AND(ISNUMBER($B107),$B107>0,I107<>\"\"),formatMMSSHHtime(I107),\"\")","v":""},{"$f":"IF(AND(ISNUMBER($B107),$B107>0,J107<>\"\"),formatMMSSHHtime(J107),\"\")","v":""},{"$f":"IF(AND(ISNUMBER($B107),$B107>0,K107<>\"\"),formatMMSSHHtime(K107),\"\")","v":""},{"$f":"IF(AND(ISNUMBER($B107),$B107>0,L107<>\"\"),formatMMSSHHtime(L107),\"\")","v":""},{"$f":"IF(AND(ISNUMBER($B107),$B107>0,M107<>\"\"),formatMMSSHHtime(M107),\"\")","v":""},{"$f":"IF(AND(ISNUMBER($B107),$B107>0,N107<>\"\"),formatMMSSHHtime(N107),\"\")","v":""}]
["","",{"$f":"IF(AND(ISNUMBER(B108),B108>0),DATEDIF(INDEX(swimmers_data,B108,3),$C$8,\"Y\"),\"\")","v":""},{"$f":"IF(AND(ISNUMBER(B108),B108>0),INDEX(swimmers_data,B108,5),\"\")","v":""},null,null,null,null,null,null,null,null,null,null,null,null,null,null,{"$f":"IF(AND(ISNUMBER($B108),$B108>0,E108<>\"\"),INDEX(swimmers_data,$B108,5)&\",\"&INDEX(swimmers_data,$B108,1)&\",\"&INDEX(swimmers_data,$B108,2)&\",\"&INDEX(swimmers_data,$B108,4)&\",\"&TEXT(INDEX(swimmers_data,$B108,3),\"ddmmYy\")&\",\"&LEFT(\"000000\",6-LEN(E108))&E108&\",\"&S$11&\",\"&\"F\",\"\")","v":""},{"$f":"IF(AND(ISNUMBER($B108),$B108>0,F108<>\"\"),INDEX(swimmers_data,$B108,5)&\",\"&INDEX(swimmers_data,$B108,1)&\",\"&INDEX(swimmers_data,$B108,2)&\",\"&INDEX(swimmers_data,$B108,4)&\",\"&TEXT(INDEX(swimmers_data,$B108,3),\"ddmmYy\")&\",\"&LEFT(\"000000\",6-LEN(F108))&F108&\",\"&T$11&\",\"&\"F\",\"\")","v":""},{"$f":"IF(AND(ISNUMBER($B108),$B108>0,G108<>\"\"),INDEX(swimmers_data,$B108,5)&\",\"&INDEX(swimmers_data,$B108,1)&\",\"&INDEX(swimmers_data,$B108,2)&\",\"&INDEX(swimmers_data,$B108,4)&\",\"&TEXT(INDEX(swimmers_data,$B108,3),\"ddmmYy\")&\",\"&LEFT(\"000000\",6-LEN(G108))&G108&\",\"&U$11&\",\"&\"F\",\"\")","v":""},{"$f":"IF(AND(ISNUMBER($B108),$B108>0,H108<>\"\"),INDEX(swimmers_data,$B108,5)&\",\"&INDEX(swimmers_data,$B108,1)&\",\"&INDEX(swimmers_data,$B108,2)&\",\"&INDEX(swimmers_data,$B108,4)&\",\"&TEXT(INDEX(swimmers_data,$B108,3),\"ddmmYy\")&\",\"&LEFT(\"000000\",6-LEN(H108))&H108&\",\"&V$11&\",\"&\"F\",\"\")","v":""},{"$f":"IF(AND(ISNUMBER($B108),$B108>0,I108<>\"\"),INDEX(swimmers_data,$B108,5)&\",\"&INDEX(swimmers_data,$B108,1)&\",\"&INDEX(swimmers_data,$B108,2)&\",\"&INDEX(swimmers_data,$B108,4)&\",\"&TEXT(INDEX(swimmers_data,$B108,3),\"ddmmYy\")&\",\"&LEFT(\"000000\",6-LEN(I108))&I108&\",\"&W$11&\",\"&\"F\",\"\")","v":""},{"$f":"IF(AND(ISNUMBER($B108),$B108>0,J108<>\"\"),INDEX(swimmers_data,$B108,5)&\",\"&INDEX(swimmers_data,$B108,1)&\",\"&INDEX(swimmers_data,$B108,2)&\",\"&INDEX(swimmers_data,$B108,4)&\",\"&TEXT(INDEX(swimmers_data,$B108,3),\"ddmmYy\")&\",\"&LEFT(\"000000\",6-LEN(J108))&J108&\",\"&X$11&\",\"&\"F\",\"\")","v":""},{"$f":"IF(AND(ISNUMBER($B108),$B108>0,K108<>\"\"),INDEX(swimmers_data,$B108,5)&\",\"&INDEX(swimmers_data,$B108,1)&\",\"&INDEX(swimmers_data,$B108,2)&\",\"&INDEX(swimmers_data,$B108,4)&\",\"&TEXT(INDEX(swimmers_data,$B108,3),\"ddmmYy\")&\",\"&LEFT(\"000000\",6-LEN(K108))&K108&\",\"&Y$11&\",\"&\"F\",\"\")","v":""},{"$f":"IF(AND(ISNUMBER($B108),$B108>0,L108<>\"\"),INDEX(swimmers_data,$B108,5)&\",\"&INDEX(swimmers_data,$B108,1)&\",\"&INDEX(swimmers_data,$B108,2)&\",\"&INDEX(swimmers_data,$B108,4)&\",\"&TEXT(INDEX(swimmers_data,$B108,3),\"ddmmYy\")&\",\"&LEFT(\"000000\",6-LEN(L108))&L108&\",\"&Z$11&\",\"&\"F\",\"\")","v":""},{"$f":"IF(AND(ISNUMBER($B108),$B108>0,M108<>\"\"),INDEX(swimmers_data,$B108,5)&\",\"&INDEX(swimmers_data,$B108,1)&\",\"&INDEX(swimmers_data,$B108,2)&\",\"&INDEX(swimmers_data,$B108,4)&\",\"&TEXT(INDEX(swimmers_data,$B108,3),\"ddmmYy\")&\",\"&LEFT(\"000000\",6-LEN(M108))&M108&\",\"&AA$11&\",\"&\"F\",\"\")","v":""},{"$f":"IF(AND(ISNUMBER($B108),$B108>0,N108<>\"\"),INDEX(swimmers_data,$B108,5)&\",\"&INDEX(swimmers_data,$B108,1)&\",\"&INDEX(swimmers_data,$B108,2)&\",\"&INDEX(swimmers_data,$B108,4)&\",\"&TEXT(INDEX(swimmers_data,$B108,3),\"ddmmYy\")&\",\"&LEFT(\"000000\",6-LEN(N108))&N108&\",\"&AB$11&\",\"&\"F\",\"\")","v":""},null,null,"","","",{"$f":"IF(AND(ISNUMBER($B108),$B108>0,E108<>\"\"),formatMMSSHHtime(E108),\"\")","v":""},{"$f":"IF(AND(ISNUMBER($B108),$B108>0,F108<>\"\"),formatMMSSHHtime(F108),\"\")","v":""},{"$f":"IF(AND(ISNUMBER($B108),$B108>0,G108<>\"\"),formatMMSSHHtime(G108),\"\")","v":""},{"$f":"IF(AND(ISNUMBER($B108),$B108>0,H108<>\"\"),formatMMSSHHtime(H108),\"\")","v":""},{"$f":"IF(AND(ISNUMBER($B108),$B108>0,I108<>\"\"),formatMMSSHHtime(I108),\"\")","v":""},{"$f":"IF(AND(ISNUMBER($B108),$B108>0,J108<>\"\"),formatMMSSHHtime(J108),\"\")","v":""},{"$f":"IF(AND(ISNUMBER($B108),$B108>0,K108<>\"\"),formatMMSSHHtime(K108),\"\")","v":""},{"$f":"IF(AND(ISNUMBER($B108),$B108>0,L108<>\"\"),formatMMSSHHtime(L108),\"\")","v":""},{"$f":"IF(AND(ISNUMBER($B108),$B108>0,M108<>\"\"),formatMMSSHHtime(M108),\"\")","v":""},{"$f":"IF(AND(ISNUMBER($B108),$B108>0,N108<>\"\"),formatMMSSHHtime(N108),\"\")","v":""}]
["",{"$f":"IF(A109<>\"\",IFERROR(MATCH(A109,swimmers_fullname,0),0),\"\")","v":""},{"$f":"IF(AND(ISNUMBER(B109),B109>0),DATEDIF(INDEX(swimmers_data,B109,3),$C$8,\"Y\"),\"\")","v":""},{"$f":"IF(AND(ISNUMBER(B109),B109>0),INDEX(swimmers_data,B109,5),\"\")","v":""},null,null,null,null,null,null,null,null,null,null,null,null,null,null,{"$f":"IF(AND(ISNUMBER($B109),$B109>0,E109<>\"\"),INDEX(swimmers_data,$B109,5)&\",\"&INDEX(swimmers_data,$B109,1)&\",\"&INDEX(swimmers_data,$B109,2)&\",\"&INDEX(swimmers_data,$B109,4)&\",\"&TEXT(INDEX(swimmers_data,$B109,3),\"ddmmYy\")&\",\"&LEFT(\"000000\",6-LEN(E109))&E109&\",\"&S$11&\",\"&\"F\",\"\")","v":""},{"$f":"IF(AND(ISNUMBER($B109),$B109>0,F109<>\"\"),INDEX(swimmers_data,$B109,5)&\",\"&INDEX(swimmers_data,$B109,1)&\",\"&INDEX(swimmers_data,$B109,2)&\",\"&INDEX(swimmers_data,$B109,4)&\",\"&TEXT(INDEX(swimmers_data,$B109,3),\"ddmmYy\")&\",\"&LEFT(\"000000\",6-LEN(F109))&F109&\",\"&T$11&\",\"&\"F\",\"\")","v":""},{"$f":"IF(AND(ISNUMBER($B109),$B109>0,G109<>\"\"),INDEX(swimmers_data,$B109,5)&\",\"&INDEX(swimmers_data,$B109,1)&\",\"&INDEX(swimmers_data,$B109,2)&\",\"&INDEX(swimmers_data,$B109,4)&\",\"&TEXT(INDEX(swimmers_data,$B109,3),\"ddmmYy\")&\",\"&LEFT(\"000000\",6-LEN(G109))&G109&\",\"&U$11&\",\"&\"F\",\"\")","v":""},{"$f":"IF(AND(ISNUMBER($B109),$B109>0,H109<>\"\"),INDEX(swimmers_data,$B109,5)&\",\"&INDEX(swimmers_data,$B109,1)&\",\"&INDEX(swimmers_data,$B109,2)&\",\"&INDEX(swimmers_data,$B109,4)&\",\"&TEXT(INDEX(swimmers_data,$B109,3),\"ddmmYy\")&\",\"&LEFT(\"000000\",6-LEN(H109))&H109&\",\"&V$11&\",\"&\"F\",\"\")","v":""},{"$f":"IF(AND(ISNUMBER($B109),$B109>0,I109<>\"\"),INDEX(swimmers_data,$B109,5)&\",\"&INDEX(swimmers_data,$B109,1)&\",\"&INDEX(swimmers_data,$B109,2)&\",\"&INDEX(swimmers_data,$B109,4)&\",\"&TEXT(INDEX(swimmers_data,$B109,3),\"ddmmYy\")&\",\"&LEFT(\"000000\",6-LEN(I109))&I109&\",\"&W$11&\",\"&\"F\",\"\")","v":""},{"$f":"IF(AND(ISNUMBER($B109),$B109>0,J109<>\"\"),INDEX(swimmers_data,$B109,5)&\",\"&INDEX(swimmers_data,$B109,1)&\",\"&INDEX(swimmers_data,$B109,2)&\",\"&INDEX(swimmers_data,$B109,4)&\",\"&TEXT(INDEX(swimmers_data,$B109,3),\"ddmmYy\")&\",\"&LEFT(\"000000\",6-LEN(J109))&J109&\",\"&X$11&\",\"&\"F\",\"\")","v":""},{"$f":"IF(AND(ISNUMBER($B109),$B109>0,K109<>\"\"),INDEX(swimmers_data,$B109,5)&\",\"&INDEX(swimmers_data,$B109,1)&\",\"&INDEX(swimmers_data,$B109,2)&\",\"&INDEX(swimmers_data,$B109,4)&\",\"&TEXT(INDEX(swimmers_data,$B109,3),\"ddmmYy\")&\",\"&LEFT(\"000000\",6-LEN(K109))&K109&\",\"&Y$11&\",\"&\"F\",\"\")","v":""},{"$f":"IF(AND(ISNUMBER($B109),$B109>0,L109<>\"\"),INDEX(swimmers_data,$B109,5)&\",\"&INDEX(swimmers_data,$B109,1)&\",\"&INDEX(swimmers_data,$B109,2)&\",\"&INDEX(swimmers_data,$B109,4)&\",\"&TEXT(INDEX(swimmers_data,$B109,3),\"ddmmYy\")&\",\"&LEFT(\"000000\",6-LEN(L109))&L109&\",\"&Z$11&\",\"&\"F\",\"\")","v":""},{"$f":"IF(AND(ISNUMBER($B109),$B109>0,M109<>\"\"),INDEX(swimmers_data,$B109,5)&\",\"&INDEX(swimmers_data,$B109,1)&\",\"&INDEX(swimmers_data,$B109,2)&\",\"&INDEX(swimmers_data,$B109,4)&\",\"&TEXT(INDEX(swimmers_data,$B109,3),\"ddmmYy\")&\",\"&LEFT(\"000000\",6-LEN(M109))&M109&\",\"&AA$11&\",\"&\"F\",\"\")","v":""},{"$f":"IF(AND(ISNUMBER($B109),$B109>0,N109<>\"\"),INDEX(swimmers_data,$B109,5)&\",\"&INDEX(swimmers_data,$B109,1)&\",\"&INDEX(swimmers_data,$B109,2)&\",\"&INDEX(swimmers_data,$B109,4)&\",\"&TEXT(INDEX(swimmers_data,$B109,3),\"ddmmYy\")&\",\"&LEFT(\"000000\",6-LEN(N109))&N109&\",\"&AB$11&\",\"&\"F\",\"\")","v":""},null,null,"","","",{"$f":"IF(AND(ISNUMBER($B109),$B109>0,E109<>\"\"),formatMMSSHHtime(E109),\"\")","v":""},{"$f":"IF(AND(ISNUMBER($B109),$B109>0,F109<>\"\"),formatMMSSHHtime(F109),\"\")","v":""},{"$f":"IF(AND(ISNUMBER($B109),$B109>0,G109<>\"\"),formatMMSSHHtime(G109),\"\")","v":""},{"$f":"IF(AND(ISNUMBER($B109),$B109>0,H109<>\"\"),formatMMSSHHtime(H109),\"\")","v":""},{"$f":"IF(AND(ISNUMBER($B109),$B109>0,I109<>\"\"),formatMMSSHHtime(I109),\"\")","v":""},{"$f":"IF(AND(ISNUMBER($B109),$B109>0,J109<>\"\"),formatMMSSHHtime(J109),\"\")","v":""},{"$f":"IF(AND(ISNUMBER($B109),$B109>0,K109<>\"\"),formatMMSSHHtime(K109),\"\")","v":""},{"$f":"IF(AND(ISNUMBER($B109),$B109>0,L109<>\"\"),formatMMSSHHtime(L109),\"\")","v":""},{"$f":"IF(AND(ISNUMBER($B109),$B109>0,M109<>\"\"),formatMMSSHHtime(M109),\"\")","v":""},{"$f":"IF(AND(ISNUMBER($B109),$B109>0,N109<>\"\"),formatMMSSHHtime(N109),\"\")","v":""}]
["",{"$f":"IF(A110<>\"\",IFERROR(MATCH(A110,swimmers_fullname,0),0),\"\")","v":""},{"$f":"IF(AND(ISNUMBER(B110),B110>0),DATEDIF(INDEX(swimmers_data,B110,3),$C$8,\"Y\"),\"\")","v":""},{"$f":"IF(AND(ISNUMBER(B110),B110>0),INDEX(swimmers_data,B110,5),\"\")","v":""},null,null,null,null,null,null,null,null,null,null,null,null,null,null,{"$f":"IF(AND(ISNUMBER($B110),$B110>0,E110<>\"\"),INDEX(swimmers_data,$B110,5)&\",\"&INDEX(swimmers_data,$B110,1)&\",\"&INDEX(swimmers_data,$B110,2)&\",\"&INDEX(swimmers_data,$B110,4)&\",\"&TEXT(INDEX(swimmers_data,$B110,3),\"ddmmYy\")&\",\"&LEFT(\"000000\",6-LEN(E110))&E110&\",\"&S$11&\",\"&\"F\",\"\")","v":""},{"$f":"IF(AND(ISNUMBER($B110),$B110>0,F110<>\"\"),INDEX(swimmers_data,$B110,5)&\",\"&INDEX(swimmers_data,$B110,1)&\",\"&INDEX(swimmers_data,$B110,2)&\",\"&INDEX(swimmers_data,$B110,4)&\",\"&TEXT(INDEX(swimmers_data,$B110,3),\"ddmmYy\")&\",\"&LEFT(\"000000\",6-LEN(F110))&F110&\",\"&T$11&\",\"&\"F\",\"\")","v":""},{"$f":"IF(AND(ISNUMBER($B110),$B110>0,G110<>\"\"),INDEX(swimmers_data,$B110,5)&\",\"&INDEX(swimmers_data,$B110,1)&\",\"&INDEX(swimmers_data,$B110,2)&\",\"&INDEX(swimmers_data,$B110,4)&\",\"&TEXT(INDEX(swimmers_data,$B110,3),\"ddmmYy\")&\",\"&LEFT(\"000000\",6-LEN(G110))&G110&\",\"&U$11&\",\"&\"F\",\"\")","v":""},{"$f":"IF(AND(ISNUMBER($B110),$B110>0,H110<>\"\"),INDEX(swimmers_data,$B110,5)&\",\"&INDEX(swimmers_data,$B110,1)&\",\"&INDEX(swimmers_data,$B110,2)&\",\"&INDEX(swimmers_data,$B110,4)&\",\"&TEXT(INDEX(swimmers_data,$B110,3),\"ddmmYy\")&\",\"&LEFT(\"000000\",6-LEN(H110))&H110&\",\"&V$11&\",\"&\"F\",\"\")","v":""},{"$f":"IF(AND(ISNUMBER($B110),$B110>0,I110<>\"\"),INDEX(swimmers_data,$B110,5)&\",\"&INDEX(swimmers_data,$B110,1)&\",\"&INDEX(swimmers_data,$B110,2)&\",\"&INDEX(swimmers_data,$B110,4)&\",\"&TEXT(INDEX(swimmers_data,$B110,3),\"ddmmYy\")&\",\"&LEFT(\"000000\",6-LEN(I110))&I110&\",\"&W$11&\",\"&\"F\",\"\")","v":""},{"$f":"IF(AND(ISNUMBER($B110),$B110>0,J110<>\"\"),INDEX(swimmers_data,$B110,5)&\",\"&INDEX(swimmers_data,$B110,1)&\",\"&INDEX(swimmers_data,$B110,2)&\",\"&INDEX(swimmers_data,$B110,4)&\",\"&TEXT(INDEX(swimmers_data,$B110,3),\"ddmmYy\")&\",\"&LEFT(\"000000\",6-LEN(J110))&J110&\",\"&X$11&\",\"&\"F\",\"\")","v":""},{"$f":"IF(AND(ISNUMBER($B110),$B110>0,K110<>\"\"),INDEX(swimmers_data,$B110,5)&\",\"&INDEX(swimmers_data,$B110,1)&\",\"&INDEX(swimmers_data,$B110,2)&\",\"&INDEX(swimmers_data,$B110,4)&\",\"&TEXT(INDEX(swimmers_data,$B110,3),\"ddmmYy\")&\",\"&LEFT(\"000000\",6-LEN(K110))&K110&\",\"&Y$11&\",\"&\"F\",\"\")","v":""},{"$f":"IF(AND(ISNUMBER($B110),$B110>0,L110<>\"\"),INDEX(swimmers_data,$B110,5)&\",\"&INDEX(swimmers_data,$B110,1)&\",\"&INDEX(swimmers_data,$B110,2)&\",\"&INDEX(swimmers_data,$B110,4)&\",\"&TEXT(INDEX(swimmers_data,$B110,3),\"ddmmYy\")&\",\"&LEFT(\"000000\",6-LEN(L110))&L110&\",\"&Z$11&\",\"&\"F\",\"\")","v":""},{"$f":"IF(AND(ISNUMBER($B110),$B110>0,M110<>\"\"),INDEX(swimmers_data,$B110,5)&\",\"&INDEX(swimmers_data,$B110,1)&\",\"&INDEX(swimmers_data,$B110,2)&\",\"&INDEX(swimmers_data,$B110,4)&\",\"&TEXT(INDEX(swimmers_data,$B110,3),\"ddmmYy\")&\",\"&LEFT(\"000000\",6-LEN(M110))&M110&\",\"&AA$11&\",\"&\"F\",\"\")","v":""},{"$f":"IF(AND(ISNUMBER($B110),$B110>0,N110<>\"\"),INDEX(swimmers_data,$B110,5)&\",\"&INDEX(swimmers_data,$B110,1)&\",\"&INDEX(swimmers_data,$B110,2)&\",\"&INDEX(swimmers_data,$B110,4)&\",\"&TEXT(INDEX(swimmers_data,$B110,3),\"ddmmYy\")&\",\"&LEFT(\"000000\",6-LEN(N110))&N110&\",\"&AB$11&\",\"&\"F\",\"\")","v":""},null,null,"","","",{"$f":"IF(AND(ISNUMBER($B110),$B110>0,E110<>\"\"),formatMMSSHHtime(E110),\"\")","v":""},{"$f":"IF(AND(ISNUMBER($B110),$B110>0,F110<>\"\"),formatMMSSHHtime(F110),\"\")","v":""},{"$f":"IF(AND(ISNUMBER($B110),$B110>0,G110<>\"\"),formatMMSSHHtime(G110),\"\")","v":""},{"$f":"IF(AND(ISNUMBER($B110),$B110>0,H110<>\"\"),formatMMSSHHtime(H110),\"\")","v":""},{"$f":"IF(AND(ISNUMBER($B110),$B110>0,I110<>\"\"),formatMMSSHHtime(I110),\"\")","v":""},{"$f":"IF(AND(ISNUMBER($B110),$B110>0,J110<>\"\"),formatMMSSHHtime(J110),\"\")","v":""},{"$f":"IF(AND(ISNUMBER($B110),$B110>0,K110<>\"\"),formatMMSSHHtime(K110),\"\")","v":""},{"$f":"IF(AND(ISNUMBER($B110),$B110>0,L110<>\"\"),formatMMSSHHtime(L110),\"\")","v":""},{"$f":"IF(AND(ISNUMBER($B110),$B110>0,M110<>\"\"),formatMMSSHHtime(M110),\"\")","v":""},{"$f":"IF(AND(ISNUMBER($B110),$B110>0,N110<>\"\"),formatMMSSHHtime(N110),\"\")","v":""}]
["",{"$f":"IF(A111<>\"\",IFERROR(MATCH(A111,swimmers_fullname,0),0),\"\")","v":""},{"$f":"IF(AND(ISNUMBER(B111),B111>0),DATEDIF(INDEX(swimmers_data,B111,3),$C$8,\"Y\"),\"\")","v":""},{"$f":"IF(AND(ISNUMBER(B111),B111>0),INDEX(swimmers_data,B111,5),\"\")","v":""},null,null,null,null,null,null,null,null,null,null,null,null,null,null,{"$f":"IF(AND(ISNUMBER($B111),$B111>0,E111<>\"\"),INDEX(swimmers_data,$B111,5)&\",\"&INDEX(swimmers_data,$B111,1)&\",\"&INDEX(swimmers_data,$B111,2)&\",\"&INDEX(swimmers_data,$B111,4)&\",\"&TEXT(INDEX(swimmers_data,$B111,3),\"ddmmYy\")&\",\"&LEFT(\"000000\",6-LEN(E111))&E111&\",\"&S$11&\",\"&\"F\",\"\")","v":""},{"$f":"IF(AND(ISNUMBER($B111),$B111>0,F111<>\"\"),INDEX(swimmers_data,$B111,5)&\",\"&INDEX(swimmers_data,$B111,1)&\",\"&INDEX(swimmers_data,$B111,2)&\",\"&INDEX(swimmers_data,$B111,4)&\",\"&TEXT(INDEX(swimmers_data,$B111,3),\"ddmmYy\")&\",\"&LEFT(\"000000\",6-LEN(F111))&F111&\",\"&T$11&\",\"&\"F\",\"\")","v":""},{"$f":"IF(AND(ISNUMBER($B111),$B111>0,G111<>\"\"),INDEX(swimmers_data,$B111,5)&\",\"&INDEX(swimmers_data,$B111,1)&\",\"&INDEX(swimmers_data,$B111,2)&\",\"&INDEX(swimmers_data,$B111,4)&\",\"&TEXT(INDEX(swimmers_data,$B111,3),\"ddmmYy\")&\",\"&LEFT(\"000000\",6-LEN(G111))&G111&\",\"&U$11&\",\"&\"F\",\"\")","v":""},{"$f":"IF(AND(ISNUMBER($B111),$B111>0,H111<>\"\"),INDEX(swimmers_data,$B111,5)&\",\"&INDEX(swimmers_data,$B111,1)&\",\"&INDEX(swimmers_data,$B111,2)&\",\"&INDEX(swimmers_data,$B111,4)&\",\"&TEXT(INDEX(swimmers_data,$B111,3),\"ddmmYy\")&\",\"&LEFT(\"000000\",6-LEN(H111))&H111&\",\"&V$11&\",\"&\"F\",\"\")","v":""},{"$f":"IF(AND(ISNUMBER($B111),$B111>0,I111<>\"\"),INDEX(swimmers_data,$B111,5)&\",\"&INDEX(swimmers_data,$B111,1)&\",\"&INDEX(swimmers_data,$B111,2)&\",\"&INDEX(swimmers_data,$B111,4)&\",\"&TEXT(INDEX(swimmers_data,$B111,3),\"ddmmYy\")&\",\"&LEFT(\"000000\",6-LEN(I111))&I111&\",\"&W$11&\",\"&\"F\",\"\")","v":""},{"$f":"IF(AND(ISNUMBER($B111),$B111>0,J111<>\"\"),INDEX(swimmers_data,$B111,5)&\",\"&INDEX(swimmers_data,$B111,1)&\",\"&INDEX(swimmers_data,$B111,2)&\",\"&INDEX(swimmers_data,$B111,4)&\",\"&TEXT(INDEX(swimmers_data,$B111,3),\"ddmmYy\")&\",\"&LEFT(\"000000\",6-LEN(J111))&J111&\",\"&X$11&\",\"&\"F\",\"\")","v":""},{"$f":"IF(AND(ISNUMBER($B111),$B111>0,K111<>\"\"),INDEX(swimmers_data,$B111,5)&\",\"&INDEX(swimmers_data,$B111,1)&\",\"&INDEX(swimmers_data,$B111,2)&\",\"&INDEX(swimmers_data,$B111,4)&\",\"&TEXT(INDEX(swimmers_data,$B111,3),\"ddmmYy\")&\",\"&LEFT(\"000000\",6-LEN(K111))&K111&\",\"&Y$11&\",\"&\"F\",\"\")","v":""},{"$f":"IF(AND(ISNUMBER($B111),$B111>0,L111<>\"\"),INDEX(swimmers_data,$B111,5)&\",\"&INDEX(swimmers_data,$B111,1)&\",\"&INDEX(swimmers_data,$B111,2)&\",\"&INDEX(swimmers_data,$B111,4)&\",\"&TEXT(INDEX(swimmers_data,$B111,3),\"ddmmYy\")&\",\"&LEFT(\"000000\",6-LEN(L111))&L111&\",\"&Z$11&\",\"&\"F\",\"\")","v":""},{"$f":"IF(AND(ISNUMBER($B111),$B111>0,M111<>\"\"),INDEX(swimmers_data,$B111,5)&\",\"&INDEX(swimmers_data,$B111,1)&\",\"&INDEX(swimmers_data,$B111,2)&\",\"&INDEX(swimmers_data,$B111,4)&\",\"&TEXT(INDEX(swimmers_data,$B111,3),\"ddmmYy\")&\",\"&LEFT(\"000000\",6-LEN(M111))&M111&\",\"&AA$11&\",\"&\"F\",\"\")","v":""},{"$f":"IF(AND(ISNUMBER($B111),$B111>0,N111<>\"\"),INDEX(swimmers_data,$B111,5)&\",\"&INDEX(swimmers_data,$B111,1)&\",\"&INDEX(swimmers_data,$B111,2)&\",\"&INDEX(swimmers_data,$B111,4)&\",\"&TEXT(INDEX(swimmers_data,$B111,3),\"ddmmYy\")&\",\"&LEFT(\"000000\",6-LEN(N111))&N111&\",\"&AB$11&\",\"&\"F\",\"\")","v":""},null,null,"","","",{"$f":"IF(AND(ISNUMBER($B111),$B111>0,E111<>\"\"),formatMMSSHHtime(E111),\"\")","v":""},{"$f":"IF(AND(ISNUMBER($B111),$B111>0,F111<>\"\"),formatMMSSHHtime(F111),\"\")","v":""},{"$f":"IF(AND(ISNUMBER($B111),$B111>0,G111<>\"\"),formatMMSSHHtime(G111),\"\")","v":""},{"$f":"IF(AND(ISNUMBER($B111),$B111>0,H111<>\"\"),formatMMSSHHtime(H111),\"\")","v":""},{"$f":"IF(AND(ISNUMBER($B111),$B111>0,I111<>\"\"),formatMMSSHHtime(I111),\"\")","v":""},{"$f":"IF(AND(ISNUMBER($B111),$B111>0,J111<>\"\"),formatMMSSHHtime(J111),\"\")","v":""},{"$f":"IF(AND(ISNUMBER($B111),$B111>0,K111<>\"\"),formatMMSSHHtime(K111),\"\")","v":""},{"$f":"IF(AND(ISNUMBER($B111),$B111>0,L111<>\"\"),formatMMSSHHtime(L111),\"\")","v":""},{"$f":"IF(AND(ISNUMBER($B111),$B111>0,M111<>\"\"),formatMMSSHHtime(M111),\"\")","v":""},{"$f":"IF(AND(ISNUMBER($B111),$B111>0,N111<>\"\"),formatMMSSHHtime(N111),\"\")","v":""}]
["",{"$f":"IF(A112<>\"\",IFERROR(MATCH(A112,swimmers_fullname,0),0),\"\")","v":""},{"$f":"IF(AND(ISNUMBER(B112),B112>0),DATEDIF(INDEX(swimmers_data,B112,3),$C$8,\"Y\"),\"\")","v":""},{"$f":"IF(AND(ISNUMBER(B112),B112>0),INDEX(swimmers_data,B112,5),\"\")","v":""},null,null,null,null,null,null,null,null,null,null,null,null,null,null,{"$f":"IF(AND(ISNUMBER($B112),$B112>0,E112<>\"\"),INDEX(swimmers_data,$B112,5)&\",\"&INDEX(swimmers_data,$B112,1)&\",\"&INDEX(swimmers_data,$B112,2)&\",\"&INDEX(swimmers_data,$B112,4)&\",\"&TEXT(INDEX(swimmers_data,$B112,3),\"ddmmYy\")&\",\"&LEFT(\"000000\",6-LEN(E112))&E112&\",\"&S$11&\",\"&\"F\",\"\")","v":""},{"$f":"IF(AND(ISNUMBER($B112),$B112>0,F112<>\"\"),INDEX(swimmers_data,$B112,5)&\",\"&INDEX(swimmers_data,$B112,1)&\",\"&INDEX(swimmers_data,$B112,2)&\",\"&INDEX(swimmers_data,$B112,4)&\",\"&TEXT(INDEX(swimmers_data,$B112,3),\"ddmmYy\")&\",\"&LEFT(\"000000\",6-LEN(F112))&F112&\",\"&T$11&\",\"&\"F\",\"\")","v":""},{"$f":"IF(AND(ISNUMBER($B112),$B112>0,G112<>\"\"),INDEX(swimmers_data,$B112,5)&\",\"&INDEX(swimmers_data,$B112,1)&\",\"&INDEX(swimmers_data,$B112,2)&\",\"&INDEX(swimmers_data,$B112,4)&\",\"&TEXT(INDEX(swimmers_data,$B112,3),\"ddmmYy\")&\",\"&LEFT(\"000000\",6-LEN(G112))&G112&\",\"&U$11&\",\"&\"F\",\"\")","v":""},{"$f":"IF(AND(ISNUMBER($B112),$B112>0,H112<>\"\"),INDEX(swimmers_data,$B112,5)&\",\"&INDEX(swimmers_data,$B112,1)&\",\"&INDEX(swimmers_data,$B112,2)&\",\"&INDEX(swimmers_data,$B112,4)&\",\"&TEXT(INDEX(swimmers_data,$B112,3),\"ddmmYy\")&\",\"&LEFT(\"000000\",6-LEN(H112))&H112&\",\"&V$11&\",\"&\"F\",\"\")","v":""},{"$f":"IF(AND(ISNUMBER($B112),$B112>0,I112<>\"\"),INDEX(swimmers_data,$B112,5)&\",\"&INDEX(swimmers_data,$B112,1)&\",\"&INDEX(swimmers_data,$B112,2)&\",\"&INDEX(swimmers_data,$B112,4)&\",\"&TEXT(INDEX(swimmers_data,$B112,3),\"ddmmYy\")&\",\"&LEFT(\"000000\",6-LEN(I112))&I112&\",\"&W$11&\",\"&\"F\",\"\")","v":""},{"$f":"IF(AND(ISNUMBER($B112),$B112>0,J112<>\"\"),INDEX(swimmers_data,$B112,5)&\",\"&INDEX(swimmers_data,$B112,1)&\",\"&INDEX(swimmers_data,$B112,2)&\",\"&INDEX(swimmers_data,$B112,4)&\",\"&TEXT(INDEX(swimmers_data,$B112,3),\"ddmmYy\")&\",\"&LEFT(\"000000\",6-LEN(J112))&J112&\",\"&X$11&\",\"&\"F\",\"\")","v":""},{"$f":"IF(AND(ISNUMBER($B112),$B112>0,K112<>\"\"),INDEX(swimmers_data,$B112,5)&\",\"&INDEX(swimmers_data,$B112,1)&\",\"&INDEX(swimmers_data,$B112,2)&\",\"&INDEX(swimmers_data,$B112,4)&\",\"&TEXT(INDEX(swimmers_data,$B112,3),\"ddmmYy\")&\",\"&LEFT(\"000000\",6-LEN(K112))&K112&\",\"&Y$11&\",\"&\"F\",\"\")","v":""},{"$f":"IF(AND(ISNUMBER($B112),$B112>0,L112<>\"\"),INDEX(swimmers_data,$B112,5)&\",\"&INDEX(swimmers_data,$B112,1)&\",\"&INDEX(swimmers_data,$B112,2)&\",\"&INDEX(swimmers_data,$B112,4)&\",\"&TEXT(INDEX(swimmers_data,$B112,3),\"ddmmYy\")&\",\"&LEFT(\"000000\",6-LEN(L112))&L112&\",\"&Z$11&\",\"&\"F\",\"\")","v":""},{"$f":"IF(AND(ISNUMBER($B112),$B112>0,M112<>\"\"),INDEX(swimmers_data,$B112,5)&\",\"&INDEX(swimmers_data,$B112,1)&\",\"&INDEX(swimmers_data,$B112,2)&\",\"&INDEX(swimmers_data,$B112,4)&\",\"&TEXT(INDEX(swimmers_data,$B112,3),\"ddmmYy\")&\",\"&LEFT(\"000000\",6-LEN(M112))&M112&\",\"&AA$11&\",\"&\"F\",\"\")","v":""},{"$f":"IF(AND(ISNUMBER($B112),$B112>0,N112<>\"\"),INDEX(swimmers_data,$B112,5)&\",\"&INDEX(swimmers_data,$B112,1)&\",\"&INDEX(swimmers_data,$B112,2)&\",\"&INDEX(swimmers_data,$B112,4)&\",\"&TEXT(INDEX(swimmers_data,$B112,3),\"ddmmYy\")&\",\"&LEFT(\"000000\",6-LEN(N112))&N112&\",\"&AB$11&\",\"&\"F\",\"\")","v":""},null,null,"","","",{"$f":"IF(AND(ISNUMBER($B112),$B112>0,E112<>\"\"),formatMMSSHHtime(E112),\"\")","v":""},{"$f":"IF(AND(ISNUMBER($B112),$B112>0,F112<>\"\"),formatMMSSHHtime(F112),\"\")","v":""},{"$f":"IF(AND(ISNUMBER($B112),$B112>0,G112<>\"\"),formatMMSSHHtime(G112),\"\")","v":""},{"$f":"IF(AND(ISNUMBER($B112),$B112>0,H112<>\"\"),formatMMSSHHtime(H112),\"\")","v":""},{"$f":"IF(AND(ISNUMBER($B112),$B112>0,I112<>\"\"),formatMMSSHHtime(I112),\"\")","v":""},{"$f":"IF(AND(ISNUMBER($B112),$B112>0,J112<>\"\"),formatMMSSHHtime(J112),\"\")","v":""},{"$f":"IF(AND(ISNUMBER($B112),$B112>0,K112<>\"\"),formatMMSSHHtime(K112),\"\")","v":""},{"$f":"IF(AND(ISNUMBER($B112),$B112>0,L112<>\"\"),formatMMSSHHtime(L112),\"\")","v":""},{"$f":"IF(AND(ISNUMBER($B112),$B112>0,M112<>\"\"),formatMMSSHHtime(M112),\"\")","v":""},{"$f":"IF(AND(ISNUMBER($B112),$B112>0,N112<>\"\"),formatMMSSHHtime(N112),\"\")","v":""}]

{"sheet":"Events","index":3,"n_rows":19,"n_cols":4,"rows_kept":19,"cut":false,"hidden":true,"merged":[]}
["01","50m FREESTYLE","50m FC","Do not Edit these lists, they contain the event \"code\" and description for the British Swimming Neutral File Format"]
["02","100m FREESTYLE","100m FC"]
["03","200m FREESTYLE ","200m FC"]
["04","400m FREESTYLE","400m FC"]
["05","800m FREESTYLE","800m FC"]
["06","1500m FREESTYLE","1500m FC"]
["07","50m BREASTSTROKE","50m BRST"]
["08","100m BREASTSTROKE","100m BRST"]
["09","200m BREASTSTROKE","200m BRST"]
["10","50m BUTTERFLY","50m FLY"]
["11","100m BUTTERFLY","100m FLY"]
["12","200m BUTTERFLY","200m FLY"]
["13","50m BACKSTROKE","50m BC"]
["14","100m BACKSTROKE","100m BC"]
["15","200m BACKSTROKE","200m BC"]
["16","200m INDIVIDUAL MEDLEY","200m IM"]
["17","400m INDIVIDUAL MEDLEY","400m IM"]
["29","100m INDIVIDUAL MEDLEY","100m IM"]
["37","150m INDIVIDUAL MEDLEY","150m IM"]